%!PS-Adobe-3.0
%%Creator: graphviz version 2.38.0 (20140413.2041)
%%Title: Tree
%%Pages: (atend)
%%BoundingBox: (atend)
%%EndComments
save
%%BeginProlog
/DotDict 200 dict def
DotDict begin

/setupLatin1 {
mark
/EncodingVector 256 array def
 EncodingVector 0

ISOLatin1Encoding 0 255 getinterval putinterval
EncodingVector 45 /hyphen put

% Set up ISO Latin 1 character encoding
/starnetISO {
        dup dup findfont dup length dict begin
        { 1 index /FID ne { def }{ pop pop } ifelse
        } forall
        /Encoding EncodingVector def
        currentdict end definefont
} def
/Times-Roman starnetISO def
/Times-Italic starnetISO def
/Times-Bold starnetISO def
/Times-BoldItalic starnetISO def
/Helvetica starnetISO def
/Helvetica-Oblique starnetISO def
/Helvetica-Bold starnetISO def
/Helvetica-BoldOblique starnetISO def
/Courier starnetISO def
/Courier-Oblique starnetISO def
/Courier-Bold starnetISO def
/Courier-BoldOblique starnetISO def
cleartomark
} bind def

%%BeginResource: procset graphviz 0 0
/coord-font-family /Times-Roman def
/default-font-family /Times-Roman def
/coordfont coord-font-family findfont 8 scalefont def

/InvScaleFactor 1.0 def
/set_scale {
       dup 1 exch div /InvScaleFactor exch def
       scale
} bind def

% styles
/solid { [] 0 setdash } bind def
/dashed { [9 InvScaleFactor mul dup ] 0 setdash } bind def
/dotted { [1 InvScaleFactor mul 6 InvScaleFactor mul] 0 setdash } bind def
/invis {/fill {newpath} def /stroke {newpath} def /show {pop newpath} def} bind def
/bold { 2 setlinewidth } bind def
/filled { } bind def
/unfilled { } bind def
/rounded { } bind def
/diagonals { } bind def
/tapered { } bind def

% hooks for setting color 
/nodecolor { sethsbcolor } bind def
/edgecolor { sethsbcolor } bind def
/graphcolor { sethsbcolor } bind def
/nopcolor {pop pop pop} bind def

/beginpage {	% i j npages
	/npages exch def
	/j exch def
	/i exch def
	/str 10 string def
	npages 1 gt {
		gsave
			coordfont setfont
			0 0 moveto
			(\() show i str cvs show (,) show j str cvs show (\)) show
		grestore
	} if
} bind def

/set_font {
	findfont exch
	scalefont setfont
} def

% draw text fitted to its expected width
/alignedtext {			% width text
	/text exch def
	/width exch def
	gsave
		width 0 gt {
			[] 0 setdash
			text stringwidth pop width exch sub text length div 0 text ashow
		} if
	grestore
} def

/boxprim {				% xcorner ycorner xsize ysize
		4 2 roll
		moveto
		2 copy
		exch 0 rlineto
		0 exch rlineto
		pop neg 0 rlineto
		closepath
} bind def

/ellipse_path {
	/ry exch def
	/rx exch def
	/y exch def
	/x exch def
	matrix currentmatrix
	newpath
	x y translate
	rx ry scale
	0 0 1 0 360 arc
	setmatrix
} bind def

/endpage { showpage } bind def
/showpage { } def

/layercolorseq
	[	% layer color sequence - darkest to lightest
		[0 0 0]
		[.2 .8 .8]
		[.4 .8 .8]
		[.6 .8 .8]
		[.8 .8 .8]
	]
def

/layerlen layercolorseq length def

/setlayer {/maxlayer exch def /curlayer exch def
	layercolorseq curlayer 1 sub layerlen mod get
	aload pop sethsbcolor
	/nodecolor {nopcolor} def
	/edgecolor {nopcolor} def
	/graphcolor {nopcolor} def
} bind def

/onlayer { curlayer ne {invis} if } def

/onlayers {
	/myupper exch def
	/mylower exch def
	curlayer mylower lt
	curlayer myupper gt
	or
	{invis} if
} def

/curlayer 0 def

%%EndResource
%%EndProlog
%%BeginSetup
14 default-font-family set_font
1 setmiterlimit
% /arrowlength 10 def
% /arrowwidth 5 def

% make sure pdfmark is harmless for PS-interpreters other than Distiller
/pdfmark where {pop} {userdict /pdfmark /cleartomark load put} ifelse
% make '<<' and '>>' safe on PS Level 1 devices
/languagelevel where {pop languagelevel}{1} ifelse
2 lt {
    userdict (<<) cvn ([) cvn load put
    userdict (>>) cvn ([) cvn load put
} if

%%EndSetup
setupLatin1
%%Page: 1 1
%%PageBoundingBox: 36 36 544 296
%%PageOrientation: Portrait
0 0 1 beginpage
gsave
36 36 508 260 boxprim clip newpath
1 1 set_scale 0 rotate 40 40 translate
% 0
gsave
1 setlinewidth
0 0 0 nodecolor
257 234 34.39 18 ellipse_path stroke
0 0 0 nodecolor
14 /Times-Roman set_font
238.5 230.3 moveto 37 (ROOT) alignedtext
grestore
% 1
gsave
1 setlinewidth
0 0 0 nodecolor
257 162 27 18 ellipse_path stroke
0 0 0 nodecolor
14 /Times-Roman set_font
253 158.3 moveto 8 (S) alignedtext
grestore
% 0->1
gsave
1 setlinewidth
0 0 0 edgecolor
newpath 257 215.7 moveto
257 207.98 257 198.71 257 190.11 curveto
stroke
0 0 0 edgecolor
newpath 260.5 190.1 moveto
257 180.1 lineto
253.5 190.1 lineto
closepath fill
1 setlinewidth
solid
0 0 0 edgecolor
newpath 260.5 190.1 moveto
257 180.1 lineto
253.5 190.1 lineto
closepath stroke
grestore
% 2
gsave
0 0 0.75294 nodecolor
27 90 27 18 ellipse_path fill
1 setlinewidth
filled
0 0 0 nodecolor
27 90 27 18 ellipse_path stroke
0 0 0 nodecolor
14 /Times-Roman set_font
19 86.3 moveto 16 ([a]) alignedtext
grestore
% 1->2
gsave
1 setlinewidth
0 0 0 edgecolor
newpath 231.76 155.59 moveto
194.31 147.23 122.11 129.84 63 108 curveto
61.15 107.32 59.27 106.58 57.38 105.8 curveto
stroke
0 0 0 edgecolor
newpath 58.62 102.52 moveto
48.06 101.69 lineto
55.8 108.93 lineto
closepath fill
1 setlinewidth
solid
0 0 0 edgecolor
newpath 58.62 102.52 moveto
48.06 101.69 lineto
55.8 108.93 lineto
closepath stroke
grestore
% 3
gsave
1 setlinewidth
0 0 0 nodecolor
106 90 33.6 18 ellipse_path stroke
0 0 0 nodecolor
14 /Times-Roman set_font
88 86.3 moveto 36 (SBAR) alignedtext
grestore
% 1->3
gsave
1 setlinewidth
0 0 0 edgecolor
newpath 235.37 150.97 moveto
210.45 139.42 169.22 120.31 140.01 106.76 curveto
stroke
0 0 0 edgecolor
newpath 141.15 103.44 moveto
130.6 102.4 lineto
138.2 109.79 lineto
closepath fill
1 setlinewidth
solid
0 0 0 edgecolor
newpath 141.15 103.44 moveto
130.6 102.4 lineto
138.2 109.79 lineto
closepath stroke
grestore
% 4
gsave
0 0 0.75294 nodecolor
185 90 27 18 ellipse_path fill
1 setlinewidth
filled
0 0 0 nodecolor
185 90 27 18 ellipse_path stroke
0 0 0 nodecolor
14 /Times-Roman set_font
177 86.3 moveto 16 ([d]) alignedtext
grestore
% 1->4
gsave
1 setlinewidth
0 0 0 edgecolor
newpath 242.43 146.83 moveto
232.25 136.94 218.48 123.55 206.97 112.36 curveto
stroke
0 0 0 edgecolor
newpath 209.41 109.85 moveto
199.8 105.38 lineto
204.53 114.87 lineto
closepath fill
1 setlinewidth
solid
0 0 0 edgecolor
newpath 209.41 109.85 moveto
199.8 105.38 lineto
204.53 114.87 lineto
closepath stroke
grestore
% 5
gsave
1 setlinewidth
0 0 0 nodecolor
257 90 27 18 ellipse_path stroke
0 0 0 nodecolor
14 /Times-Roman set_font
248 86.3 moveto 18 (NP) alignedtext
grestore
% 1->5
gsave
1 setlinewidth
0 0 0 edgecolor
newpath 257 143.7 moveto
257 135.98 257 126.71 257 118.11 curveto
stroke
0 0 0 edgecolor
newpath 260.5 118.1 moveto
257 108.1 lineto
253.5 118.1 lineto
closepath fill
1 setlinewidth
solid
0 0 0 edgecolor
newpath 260.5 118.1 moveto
257 108.1 lineto
253.5 118.1 lineto
closepath stroke
grestore
% 6
gsave
0 0 0.75294 nodecolor
329 90 27 18 ellipse_path fill
1 setlinewidth
filled
0 0 0 nodecolor
329 90 27 18 ellipse_path stroke
0 0 0 nodecolor
14 /Times-Roman set_font
321 86.3 moveto 16 ([e]) alignedtext
grestore
% 1->6
gsave
1 setlinewidth
0 0 0 edgecolor
newpath 271.57 146.83 moveto
281.75 136.94 295.52 123.55 307.03 112.36 curveto
stroke
0 0 0 edgecolor
newpath 309.47 114.87 moveto
314.2 105.38 lineto
304.59 109.85 lineto
closepath fill
1 setlinewidth
solid
0 0 0 edgecolor
newpath 309.47 114.87 moveto
314.2 105.38 lineto
304.59 109.85 lineto
closepath stroke
grestore
% 7
gsave
1 setlinewidth
0 0 0 nodecolor
401 90 27 18 ellipse_path stroke
0 0 0 nodecolor
14 /Times-Roman set_font
392 86.3 moveto 18 (VP) alignedtext
grestore
% 1->7
gsave
1 setlinewidth
0 0 0 edgecolor
newpath 278.25 150.67 moveto
302.6 138.83 342.72 119.33 370.43 105.86 curveto
stroke
0 0 0 edgecolor
newpath 372.2 108.89 moveto
379.67 101.37 lineto
369.14 102.6 lineto
closepath fill
1 setlinewidth
solid
0 0 0 edgecolor
newpath 372.2 108.89 moveto
379.67 101.37 lineto
369.14 102.6 lineto
closepath stroke
grestore
% 8
gsave
0 0 0.75294 nodecolor
473 90 27 18 ellipse_path fill
1 setlinewidth
filled
0 0 0 nodecolor
473 90 27 18 ellipse_path stroke
0 0 0 nodecolor
14 /Times-Roman set_font
466 86.3 moveto 14 ([f]) alignedtext
grestore
% 1->8
gsave
1 setlinewidth
0 0 0 edgecolor
newpath 282.15 154.91 moveto
317.32 146.1 382.96 128.57 437 108 curveto
438.84 107.3 440.72 106.54 442.6 105.75 curveto
stroke
0 0 0 edgecolor
newpath 444.19 108.88 moveto
451.92 101.62 lineto
441.36 102.48 lineto
closepath fill
1 setlinewidth
solid
0 0 0 edgecolor
newpath 444.19 108.88 moveto
451.92 101.62 lineto
441.36 102.48 lineto
closepath stroke
grestore
% 9
gsave
0 0 0.75294 nodecolor
34 18 27 18 ellipse_path fill
1 setlinewidth
filled
0 0 0 nodecolor
34 18 27 18 ellipse_path stroke
0 0 0 nodecolor
14 /Times-Roman set_font
26 14.3 moveto 16 ([b]) alignedtext
grestore
% 3->9
gsave
1 setlinewidth
0 0 0 edgecolor
newpath 90.38 73.81 moveto
80.3 64.01 67.04 51.12 55.91 40.3 curveto
stroke
0 0 0 edgecolor
newpath 58.22 37.67 moveto
48.61 33.21 lineto
53.34 42.69 lineto
closepath fill
1 setlinewidth
solid
0 0 0 edgecolor
newpath 58.22 37.67 moveto
48.61 33.21 lineto
53.34 42.69 lineto
closepath stroke
grestore
% 10
gsave
1 setlinewidth
0 0 0 nodecolor
106 18 27 18 ellipse_path stroke
0 0 0 nodecolor
14 /Times-Roman set_font
102 14.3 moveto 8 (S) alignedtext
grestore
% 3->10
gsave
1 setlinewidth
0 0 0 edgecolor
newpath 106 71.7 moveto
106 63.98 106 54.71 106 46.11 curveto
stroke
0 0 0 edgecolor
newpath 109.5 46.1 moveto
106 36.1 lineto
102.5 46.1 lineto
closepath fill
1 setlinewidth
solid
0 0 0 edgecolor
newpath 109.5 46.1 moveto
106 36.1 lineto
102.5 46.1 lineto
closepath stroke
grestore
% 11
gsave
0 0 0.75294 nodecolor
178 18 27 18 ellipse_path fill
1 setlinewidth
filled
0 0 0 nodecolor
178 18 27 18 ellipse_path stroke
0 0 0 nodecolor
14 /Times-Roman set_font
170 14.3 moveto 16 ([c]) alignedtext
grestore
% 3->11
gsave
1 setlinewidth
0 0 0 edgecolor
newpath 121.62 73.81 moveto
131.7 64.01 144.96 51.12 156.09 40.3 curveto
stroke
0 0 0 edgecolor
newpath 158.66 42.69 moveto
163.39 33.21 lineto
153.78 37.67 lineto
closepath fill
1 setlinewidth
solid
0 0 0 edgecolor
newpath 158.66 42.69 moveto
163.39 33.21 lineto
153.78 37.67 lineto
closepath stroke
grestore
endpage
showpage
grestore
%%PageTrailer
%%EndPage: 1
setupLatin1
%%Page: 2 2
%%PageBoundingBox: 36 36 273 170
%%PageOrientation: Portrait
0 0 1 beginpage
gsave
36 36 237 134 boxprim clip newpath
1 1 set_scale 0 rotate 40 40 translate
% 0
gsave
1 setlinewidth
0 0 0 nodecolor
99.7 98.87 99.9 26.74 ellipse_path stroke
0 0 0 nodecolor
14 /Times-Roman set_font
37.2 102.67 moveto 125 (SUBORDINATION_1) alignedtext
0 0 0 nodecolor
14 /Times-Roman set_font
73.7 87.67 moveto 52 (signal:[b]) alignedtext
grestore
% l
gsave
1 setlinewidth
0 0 0 nodecolor
41.7 18 27 18 ellipse_path stroke
0 0 0 nodecolor
14 /Times-Roman set_font
37.7 14.3 moveto 8 (S) alignedtext
grestore
% 0->l
gsave
1 setlinewidth
0 0 0 edgecolor
newpath 80.71 72.05 moveto
73.73 62.55 65.87 51.86 59.04 42.57 curveto
stroke
0 0 0 edgecolor
newpath 61.86 40.5 moveto
53.11 34.52 lineto
56.22 44.65 lineto
closepath fill
1 setlinewidth
solid
0 0 0 edgecolor
newpath 61.86 40.5 moveto
53.11 34.52 lineto
56.22 44.65 lineto
closepath stroke
grestore
% r
gsave
1 setlinewidth
0 0 0 nodecolor
157.7 18 71.49 18 ellipse_path stroke
0 0 0 nodecolor
14 /Times-Roman set_font
110.7 14.3 moveto 94 ([a][d]NP[e]VP[f]) alignedtext
grestore
% 0->r
gsave
1 setlinewidth
0 0 0 edgecolor
newpath 118.69 72.05 moveto
125.3 63.06 132.7 52.99 139.27 44.07 curveto
stroke
0 0 0 edgecolor
newpath 142.15 46.06 moveto
145.25 35.93 lineto
136.51 41.91 lineto
closepath fill
1 setlinewidth
solid
0 0 0 edgecolor
newpath 142.15 46.06 moveto
145.25 35.93 lineto
136.51 41.91 lineto
closepath stroke
grestore
endpage
showpage
grestore
%%PageTrailer
%%EndPage: 2
%%Trailer
%%Pages: 2
%%BoundingBox: 36 36 544 296
end
restore
%%EOF
