%!PS-Adobe-3.0
%%Creator: graphviz version 2.38.0 (20140413.2041)
%%Title: Tree
%%Pages: (atend)
%%BoundingBox: (atend)
%%EndComments
save
%%BeginProlog
/DotDict 200 dict def
DotDict begin

/setupLatin1 {
mark
/EncodingVector 256 array def
 EncodingVector 0

ISOLatin1Encoding 0 255 getinterval putinterval
EncodingVector 45 /hyphen put

% Set up ISO Latin 1 character encoding
/starnetISO {
        dup dup findfont dup length dict begin
        { 1 index /FID ne { def }{ pop pop } ifelse
        } forall
        /Encoding EncodingVector def
        currentdict end definefont
} def
/Times-Roman starnetISO def
/Times-Italic starnetISO def
/Times-Bold starnetISO def
/Times-BoldItalic starnetISO def
/Helvetica starnetISO def
/Helvetica-Oblique starnetISO def
/Helvetica-Bold starnetISO def
/Helvetica-BoldOblique starnetISO def
/Courier starnetISO def
/Courier-Oblique starnetISO def
/Courier-Bold starnetISO def
/Courier-BoldOblique starnetISO def
cleartomark
} bind def

%%BeginResource: procset graphviz 0 0
/coord-font-family /Times-Roman def
/default-font-family /Times-Roman def
/coordfont coord-font-family findfont 8 scalefont def

/InvScaleFactor 1.0 def
/set_scale {
       dup 1 exch div /InvScaleFactor exch def
       scale
} bind def

% styles
/solid { [] 0 setdash } bind def
/dashed { [9 InvScaleFactor mul dup ] 0 setdash } bind def
/dotted { [1 InvScaleFactor mul 6 InvScaleFactor mul] 0 setdash } bind def
/invis {/fill {newpath} def /stroke {newpath} def /show {pop newpath} def} bind def
/bold { 2 setlinewidth } bind def
/filled { } bind def
/unfilled { } bind def
/rounded { } bind def
/diagonals { } bind def
/tapered { } bind def

% hooks for setting color 
/nodecolor { sethsbcolor } bind def
/edgecolor { sethsbcolor } bind def
/graphcolor { sethsbcolor } bind def
/nopcolor {pop pop pop} bind def

/beginpage {	% i j npages
	/npages exch def
	/j exch def
	/i exch def
	/str 10 string def
	npages 1 gt {
		gsave
			coordfont setfont
			0 0 moveto
			(\() show i str cvs show (,) show j str cvs show (\)) show
		grestore
	} if
} bind def

/set_font {
	findfont exch
	scalefont setfont
} def

% draw text fitted to its expected width
/alignedtext {			% width text
	/text exch def
	/width exch def
	gsave
		width 0 gt {
			[] 0 setdash
			text stringwidth pop width exch sub text length div 0 text ashow
		} if
	grestore
} def

/boxprim {				% xcorner ycorner xsize ysize
		4 2 roll
		moveto
		2 copy
		exch 0 rlineto
		0 exch rlineto
		pop neg 0 rlineto
		closepath
} bind def

/ellipse_path {
	/ry exch def
	/rx exch def
	/y exch def
	/x exch def
	matrix currentmatrix
	newpath
	x y translate
	rx ry scale
	0 0 1 0 360 arc
	setmatrix
} bind def

/endpage { showpage } bind def
/showpage { } def

/layercolorseq
	[	% layer color sequence - darkest to lightest
		[0 0 0]
		[.2 .8 .8]
		[.4 .8 .8]
		[.6 .8 .8]
		[.8 .8 .8]
	]
def

/layerlen layercolorseq length def

/setlayer {/maxlayer exch def /curlayer exch def
	layercolorseq curlayer 1 sub layerlen mod get
	aload pop sethsbcolor
	/nodecolor {nopcolor} def
	/edgecolor {nopcolor} def
	/graphcolor {nopcolor} def
} bind def

/onlayer { curlayer ne {invis} if } def

/onlayers {
	/myupper exch def
	/mylower exch def
	curlayer mylower lt
	curlayer myupper gt
	or
	{invis} if
} def

/curlayer 0 def

%%EndResource
%%EndProlog
%%BeginSetup
14 default-font-family set_font
1 setmiterlimit
% /arrowlength 10 def
% /arrowwidth 5 def

% make sure pdfmark is harmless for PS-interpreters other than Distiller
/pdfmark where {pop} {userdict /pdfmark /cleartomark load put} ifelse
% make '<<' and '>>' safe on PS Level 1 devices
/languagelevel where {pop languagelevel}{1} ifelse
2 lt {
    userdict (<<) cvn ([) cvn load put
    userdict (>>) cvn ([) cvn load put
} if

%%EndSetup
setupLatin1
%%Page: 1 1
%%PageBoundingBox: 36 36 458 296
%%PageOrientation: Portrait
0 0 1 beginpage
gsave
36 36 422 260 boxprim clip newpath
1 1 set_scale 0 rotate 40 40 translate
% 0
gsave
1 setlinewidth
0 0 0 nodecolor
171 234 34.39 18 ellipse_path stroke
0 0 0 nodecolor
14 /Times-Roman set_font
152.5 230.3 moveto 37 (ROOT) alignedtext
grestore
% 1
gsave
1 setlinewidth
0 0 0 nodecolor
171 162 27 18 ellipse_path stroke
0 0 0 nodecolor
14 /Times-Roman set_font
167 158.3 moveto 8 (S) alignedtext
grestore
% 0->1
gsave
1 setlinewidth
0 0 0 edgecolor
newpath 171 215.7 moveto
171 207.98 171 198.71 171 190.11 curveto
stroke
0 0 0 edgecolor
newpath 174.5 190.1 moveto
171 180.1 lineto
167.5 190.1 lineto
closepath fill
1 setlinewidth
solid
0 0 0 edgecolor
newpath 174.5 190.1 moveto
171 180.1 lineto
167.5 190.1 lineto
closepath stroke
grestore
% 2
gsave
0 0 0.75294 nodecolor
27 90 27 18 ellipse_path fill
1 setlinewidth
filled
0 0 0 nodecolor
27 90 27 18 ellipse_path stroke
0 0 0 nodecolor
14 /Times-Roman set_font
19 86.3 moveto 16 ([a]) alignedtext
grestore
% 1->2
gsave
1 setlinewidth
0 0 0 edgecolor
newpath 149.75 150.67 moveto
125.4 138.83 85.28 119.33 57.57 105.86 curveto
stroke
0 0 0 edgecolor
newpath 58.86 102.6 moveto
48.33 101.37 lineto
55.8 108.89 lineto
closepath fill
1 setlinewidth
solid
0 0 0 edgecolor
newpath 58.86 102.6 moveto
48.33 101.37 lineto
55.8 108.89 lineto
closepath stroke
grestore
% 3
gsave
1 setlinewidth
0 0 0 nodecolor
99 90 27 18 ellipse_path stroke
0 0 0 nodecolor
14 /Times-Roman set_font
90 86.3 moveto 18 (NP) alignedtext
grestore
% 1->3
gsave
1 setlinewidth
0 0 0 edgecolor
newpath 156.43 146.83 moveto
146.25 136.94 132.48 123.55 120.97 112.36 curveto
stroke
0 0 0 edgecolor
newpath 123.41 109.85 moveto
113.8 105.38 lineto
118.53 114.87 lineto
closepath fill
1 setlinewidth
solid
0 0 0 edgecolor
newpath 123.41 109.85 moveto
113.8 105.38 lineto
118.53 114.87 lineto
closepath stroke
grestore
% 4
gsave
0 0 0.75294 nodecolor
171 90 27 18 ellipse_path fill
1 setlinewidth
filled
0 0 0 nodecolor
171 90 27 18 ellipse_path stroke
0 0 0 nodecolor
14 /Times-Roman set_font
163 86.3 moveto 16 ([b]) alignedtext
grestore
% 1->4
gsave
1 setlinewidth
0 0 0 edgecolor
newpath 171 143.7 moveto
171 135.98 171 126.71 171 118.11 curveto
stroke
0 0 0 edgecolor
newpath 174.5 118.1 moveto
171 108.1 lineto
167.5 118.1 lineto
closepath fill
1 setlinewidth
solid
0 0 0 edgecolor
newpath 174.5 118.1 moveto
171 108.1 lineto
167.5 118.1 lineto
closepath stroke
grestore
% 5
gsave
1 setlinewidth
0 0 0 nodecolor
243 90 27 18 ellipse_path stroke
0 0 0 nodecolor
14 /Times-Roman set_font
234 86.3 moveto 18 (VP) alignedtext
grestore
% 1->5
gsave
1 setlinewidth
0 0 0 edgecolor
newpath 185.57 146.83 moveto
195.75 136.94 209.52 123.55 221.03 112.36 curveto
stroke
0 0 0 edgecolor
newpath 223.47 114.87 moveto
228.2 105.38 lineto
218.59 109.85 lineto
closepath fill
1 setlinewidth
solid
0 0 0 edgecolor
newpath 223.47 114.87 moveto
228.2 105.38 lineto
218.59 109.85 lineto
closepath stroke
grestore
% 6
gsave
0 0 0.75294 nodecolor
315 90 27 18 ellipse_path fill
1 setlinewidth
filled
0 0 0 nodecolor
315 90 27 18 ellipse_path stroke
0 0 0 nodecolor
14 /Times-Roman set_font
308 86.3 moveto 14 ([f]) alignedtext
grestore
% 1->6
gsave
1 setlinewidth
0 0 0 edgecolor
newpath 192.25 150.67 moveto
216.6 138.83 256.72 119.33 284.43 105.86 curveto
stroke
0 0 0 edgecolor
newpath 286.2 108.89 moveto
293.67 101.37 lineto
283.14 102.6 lineto
closepath fill
1 setlinewidth
solid
0 0 0 edgecolor
newpath 286.2 108.89 moveto
293.67 101.37 lineto
283.14 102.6 lineto
closepath stroke
grestore
% 7
gsave
0 0 0.75294 nodecolor
99 18 27 18 ellipse_path fill
1 setlinewidth
filled
0 0 0 nodecolor
99 18 27 18 ellipse_path stroke
0 0 0 nodecolor
14 /Times-Roman set_font
91 14.3 moveto 16 ([c]) alignedtext
grestore
% 5->7
gsave
1 setlinewidth
0 0 0 edgecolor
newpath 221.75 78.67 moveto
197.4 66.83 157.28 47.33 129.57 33.86 curveto
stroke
0 0 0 edgecolor
newpath 130.86 30.6 moveto
120.33 29.37 lineto
127.8 36.89 lineto
closepath fill
1 setlinewidth
solid
0 0 0 edgecolor
newpath 130.86 30.6 moveto
120.33 29.37 lineto
127.8 36.89 lineto
closepath stroke
grestore
% 8
gsave
1 setlinewidth
0 0 0 nodecolor
171 18 27 18 ellipse_path stroke
0 0 0 nodecolor
14 /Times-Roman set_font
158.5 14.3 moveto 25 (VP1) alignedtext
grestore
% 5->8
gsave
1 setlinewidth
0 0 0 edgecolor
newpath 228.43 74.83 moveto
218.25 64.94 204.48 51.55 192.97 40.36 curveto
stroke
0 0 0 edgecolor
newpath 195.41 37.85 moveto
185.8 33.38 lineto
190.53 42.87 lineto
closepath fill
1 setlinewidth
solid
0 0 0 edgecolor
newpath 195.41 37.85 moveto
185.8 33.38 lineto
190.53 42.87 lineto
closepath stroke
grestore
% 9
gsave
0 0 0.75294 nodecolor
243 18 27 18 ellipse_path fill
1 setlinewidth
filled
0 0 0 nodecolor
243 18 27 18 ellipse_path stroke
0 0 0 nodecolor
14 /Times-Roman set_font
235 14.3 moveto 16 ([d]) alignedtext
grestore
% 5->9
gsave
1 setlinewidth
0 0 0 edgecolor
newpath 243 71.7 moveto
243 63.98 243 54.71 243 46.11 curveto
stroke
0 0 0 edgecolor
newpath 246.5 46.1 moveto
243 36.1 lineto
239.5 46.1 lineto
closepath fill
1 setlinewidth
solid
0 0 0 edgecolor
newpath 246.5 46.1 moveto
243 36.1 lineto
239.5 46.1 lineto
closepath stroke
grestore
% 10
gsave
1 setlinewidth
0 0 0 nodecolor
315 18 27 18 ellipse_path stroke
0 0 0 nodecolor
14 /Times-Roman set_font
302.5 14.3 moveto 25 (VP2) alignedtext
grestore
% 5->10
gsave
1 setlinewidth
0 0 0 edgecolor
newpath 257.57 74.83 moveto
267.75 64.94 281.52 51.55 293.03 40.36 curveto
stroke
0 0 0 edgecolor
newpath 295.47 42.87 moveto
300.2 33.38 lineto
290.59 37.85 lineto
closepath fill
1 setlinewidth
solid
0 0 0 edgecolor
newpath 295.47 42.87 moveto
300.2 33.38 lineto
290.59 37.85 lineto
closepath stroke
grestore
% 11
gsave
0 0 0.75294 nodecolor
387 18 27 18 ellipse_path fill
1 setlinewidth
filled
0 0 0 nodecolor
387 18 27 18 ellipse_path stroke
0 0 0 nodecolor
14 /Times-Roman set_font
379 14.3 moveto 16 ([e]) alignedtext
grestore
% 5->11
gsave
1 setlinewidth
0 0 0 edgecolor
newpath 264.25 78.67 moveto
288.6 66.83 328.72 47.33 356.43 33.86 curveto
stroke
0 0 0 edgecolor
newpath 358.2 36.89 moveto
365.67 29.37 lineto
355.14 30.6 lineto
closepath fill
1 setlinewidth
solid
0 0 0 edgecolor
newpath 358.2 36.89 moveto
365.67 29.37 lineto
355.14 30.6 lineto
closepath stroke
grestore
endpage
showpage
grestore
%%PageTrailer
%%EndPage: 1
setupLatin1
%%Page: 2 2
%%PageBoundingBox: 36 36 406 170
%%PageOrientation: Portrait
0 0 1 beginpage
gsave
36 36 370 134 boxprim clip newpath
1 1 set_scale 0 rotate 40 40 translate
% 0
gsave
1 setlinewidth
0 0 0 nodecolor
180.79 98.87 154.3 26.74 ellipse_path stroke
0 0 0 nodecolor
14 /Times-Roman set_font
79.79 102.67 moveto 202 (SHARED_NP_COORDINATION_1) alignedtext
0 0 0 nodecolor
14 /Times-Roman set_font
154.79 87.67 moveto 52 (signal:[d]) alignedtext
grestore
% l
gsave
1 setlinewidth
0 0 0 nodecolor
85.79 18 85.59 18 ellipse_path stroke
0 0 0 nodecolor
14 /Times-Roman set_font
27.79 14.3 moveto 116 ([a]NP[b][c]VP1[e][f]) alignedtext
grestore
% 0->l
gsave
1 setlinewidth
0 0 0 edgecolor
newpath 150.21 72.48 moveto
138.51 62.77 125.24 51.75 113.8 42.25 curveto
stroke
0 0 0 edgecolor
newpath 115.76 39.33 moveto
105.83 35.64 lineto
111.29 44.72 lineto
closepath fill
1 setlinewidth
solid
0 0 0 edgecolor
newpath 115.76 39.33 moveto
105.83 35.64 lineto
111.29 44.72 lineto
closepath stroke
grestore
% r
gsave
1 setlinewidth
0 0 0 nodecolor
275.79 18 85.59 18 ellipse_path stroke
0 0 0 nodecolor
14 /Times-Roman set_font
217.79 14.3 moveto 116 ([a]NP[b][c]VP2[e][f]) alignedtext
grestore
% 0->r
gsave
1 setlinewidth
0 0 0 edgecolor
newpath 211.37 72.48 moveto
223.07 62.77 236.34 51.75 247.79 42.25 curveto
stroke
0 0 0 edgecolor
newpath 250.29 44.72 moveto
255.75 35.64 lineto
245.82 39.33 lineto
closepath fill
1 setlinewidth
solid
0 0 0 edgecolor
newpath 250.29 44.72 moveto
255.75 35.64 lineto
245.82 39.33 lineto
closepath stroke
grestore
endpage
showpage
grestore
%%PageTrailer
%%EndPage: 2
%%Trailer
%%Pages: 2
%%BoundingBox: 36 36 458 296
end
restore
%%EOF
