digraph Tree {
    0 [label="ROOT"];

    1 [label="S"];

    2 [label="[a]", style="filled", fillcolor="gray"];
    3 [label="S1"];
    4 [label="[b]", style="filled", fillcolor="gray"];
    5 [label="S2"];
    6 [label="[c]", style="filled", fillcolor="gray"];

    0 -> 1;
    1 -> {2; 3; 4; 5; 6};
}

digraph Extraction {
    0 [label="COORDINATION" + "\nsignal:" + "[b]"];

    l [label="[a]S1[c]"];
    r [label="[a]S2[c]"];

    0 -> {l; r};
}