id,name,model_id:id,group_id:id,perm_read,perm_write,perm_create,perm_unlink
access_partner_employee_department_admin_pegawai,partner_employee_department admin_pegawai,model_partner_employee_department,df_partner_employee_sapk.group_partner_employee_admin,1,1,1,1
access_partner_employee_eselon_admin_pegawai,partner_employee_eselon admin_pegawai,model_partner_employee_eselon,df_partner_employee_sapk.group_partner_employee_admin,1,1,1,1
access_partner_employee_biro_admin_pegawai,partner_employee_biro admin_pegawai,model_partner_employee_biro,df_partner_employee_sapk.group_partner_employee_admin,1,1,1,1
access_partner_employee_job_admin_pegawai,partner_employee_job admin_pegawai,model_partner_employee_job,df_partner_employee_sapk.group_partner_employee_admin,1,1,1,1
access_partner_employee_title_admin_pegawai,partner_employee_title admin_pegawai,model_partner_employee_title,df_partner_employee_sapk.group_partner_employee_admin,1,1,1,1
access_partner_employee_school_admin_pegawai,partner_employee_school admin_pegawai,model_partner_employee_school,df_partner_employee_sapk.group_partner_employee_admin,1,1,1,1
access_partner_employee_study_admin_pegawai,partner_employee_study admin_pegawai,model_partner_employee_study,df_partner_employee_sapk.group_partner_employee_admin,1,1,1,1
access_partner_employee_study_degree_admin_pegawai,partner_employee_study_degree admin_pegawai,model_partner_employee_study_degree,df_partner_employee_sapk.group_partner_employee_admin,1,1,1,1
access_partner_employee_study_type_admin_pegawai,partner_employee_study_type admin_pegawai,model_partner_employee_study_type,df_partner_employee_sapk.group_partner_employee_admin,1,1,1,1
access_partner_employee_golongan_admin_pegawai,partner_employee_golongan admin_pegawai,model_partner_employee_golongan,df_partner_employee_sapk.group_partner_employee_admin,1,1,1,1
