id,name,model_id:id,group_id:id,perm_read,perm_write,perm_create,perm_unlink
employee_partner_employee_department,partner_employee_department,partner.employee.department,group_partner_employee,1,0,0,0
employee_partner_employee_eselon,partner_employee_eselon,partner_employee_eselon,group_partner_employee,1,0,0,0
employee_partner_employee_biro,partner_employee_biro,partner_employee_biro,group_partner_employee,1,0,0,0
employee_partner_employee_golongan,partner_employee_golongan,partner_employee_golongan,group_partner_employee,1,0,0,0
employee_partner_employee_job,partner_employee_job,partner_employee_job,group_partner_employee,1,0,0,0
employee_partner_employee_title,partner_employee_title,partner_employee_title,group_partner_employee,1,0,0,0
employee_partner_employee_study,partner_employee_study,partner_employee_study,group_partner_employee,1,0,0,0
employee_partner_employee_study_type,partner_employee_study_type,partner_employee_study_type,group_partner_employee,1,0,0,0
employee_partner_employee_golongan_history,partner_employee_golongan_history,partner_employee_golongan_history,group_partner_employee,1,1,1,1
employee_partner_employee_study_history,partner_employee_study_history,partner_employee_study_history,group_partner_employee,1,1,1,1
employee_partner_employee_hukuman_disiplin_history,partner_employee_hukuman_disiplin_history,partner_employee_hukuman_disiplin_history,group_partner_employee,1,1,1,1
employee_partner_employee_job_history,partner_employee_job_history,partner_employee_job_history,group_partner_employee,1,1,1,1
employee_partner_employee_diklat_kepemimpinan_history,partner_employee_diklat_kepemimpinan_history,partner_employee_diklat_kepemimpinan_history,group_partner_employee,1,1,1,1
employee_partner_employee_diklat_fungsional_history,partner_employee_diklat_fungsional_history,partner_employee_diklat_fungsional_history,group_partner_employee,1,1,1,1
employee_partner_employee_diklat_teknik_history,partner_employee_diklat_teknik_history,partner_employee_diklat_teknik_history,group_partner_employee,1,1,1,1
employee_partner_employee_penataran_history,partner_employee_penataran_history,partner_employee_penataran_history,group_partner_employee,1,1,1,1
