{
  "types": [
    {
      "name": "settings",
      "description": "Bot management commands.",
      "visible": false,
      "emoji": "⚙"
    },

    {
      "name": "info",
      "description": "These commands shows status of bot.",
      "visible": true,
      "emoji": "❔"
    }
  ]
}