{
  "types": [
    {
      "name": "settings",
      "description": "Bot management commands.",
      "visible": false,
      "emoji": "⚙"
    },

    {
      "name": "suicide",
      "description": "Suicide Prevention Module settings.",
      "visible": false,
      "emoji": "☠️"
    },

    {
      "name": "info",
      "description": "These commands shows status of bot.",
      "visible": true,
      "emoji": "❔"
    },

    {
      "name": "fun",
      "description": "These commands you can use for having fun.",
      "visible": true,
      "emoji": "\uD83E\uDE80"
    },

    {
      "name": "photo",
      "description": "Result of these commands are just photos.",
      "visible": true,
      "emoji": "\uD83D\uDCF8"
    },

    {
      "name": "birthday",
      "description": "Birthday module commands.",
      "visible": true,
      "emoji": "\uD83C\uDF81"
    },

    {
      "name": "dynamic",
      "description": "These commands allows you to manage dynamic (custom) commands.",
      "visible": false,
      "emoji": "⚡"
    }
  ]
}