{
  "prefix": {
    "type": "settings",
    "help": "Allows to set new prefix. Syntax: `[prefix]prefix [new prefix]`",
    "visible": false,
    "protected": true
  },
  "add-permission": {
    "type": "settings",
    "help": "Add given role permission to manage administrative commands. Syntax: `[prefix]add-permission [role name|role id]`",
    "visible": false,
    "protected": true
  },
  "remove-permission": {
    "type": "settings",
    "help": "Remove permission from given role. Syntax: `[prefix]remove permission [role name|@role]`",
    "visible": false,
    "protected": true
  },
  "permitted-roles": {
    "type": "settings",
    "help": "Display list of roles with permissions.",
    "visible": false,
    "protected": true
  },
  "enable-command": {
    "type": "settings",
    "help": "Remove command from disabled list. Syntax `[prefix]enable-command [command name]`",
    "visible": false,
    "protected": true
  },
  "disable-command": {
    "type": "settings",
    "help": "Add command to disabled list. Syntax `[prefix]disable-command [command name]`",
    "visible": false,
    "protected": true
  },
  "disabled-commands": {
    "type": "settings",
    "help": "Display list of disabled commands.",
    "visible": false,
    "protected": true
  },
  "reports-channel": {
    "type": "settings",
    "help": "Allows to specify reports channel. Syntax `[prefix]reports-channel [channel mention|off]`",
    "visible": false,
    "protected": true
  },

  "info": {
    "type": "info",
    "help": "Display some bot statistics.",
    "visible": true,
    "protected": false
  },
  "help": {
    "type": "info",
    "help": "Display this message.",
    "visible": true,
    "protected": true
  },
  "help-admin": {
    "type": "info",
    "help": "Display this message.",
    "visible": false,
    "protected": true
  }
}