<?xml version="1.0" encoding="utf-8"?>
<!-- Generator: Adobe Illustrator 20.0.0, SVG Export Plug-In . SVG Version: 6.00 Build 0)  -->
<svg version="1.1" id="Layer_1" xmlns="http://www.w3.org/2000/svg" xmlns:xlink="http://www.w3.org/1999/xlink" x="0px" y="0px"
	 viewBox="0 0 566.9 566.9" style="enable-background:new 0 0 566.9 566.9;" xml:space="preserve">
<style type="text/css">
	.st0{fill:#FFFFFF;}
	.st1{fill:#C1C1C1;}
</style>
<path class="st0" d="M299.2,166c-1.6,0-3.1,0.7-4.3,1.8c-1.1,1.1-1.8,2.6-1.8,4.3c0,1.6,0.7,3.1,1.8,4.3c1.2,1.1,2.6,1.8,4.3,1.8
	c1.6,0,3.1-0.7,4.2-1.8c1.2-1.1,1.8-2.6,1.8-4.3c0-1.6-0.7-3.1-1.8-4.3C302.4,166.6,300.8,166,299.2,166z"/>
<path class="st1" d="M449.8,105.4c-2.1-6.9-10.1-17.9-50.2-34.3c-17.9-7.3-35.1-12.8-41.1-14.7c-4.8-7.4-12.3-14.3-22.4-20.7l0,0
	c-0.9-0.6-2-0.9-3.1-0.9h-98.6c-1.2,0-2.3,0.4-3.1,0.9l0,0C221,42.2,213.6,49,208.8,56.4c-6,1.9-23.2,7.3-41.1,14.7
	c-40.1,16.4-48.2,27.4-50.2,34.3l-61.8,122c-0.7,1.5-0.9,3.1-0.3,4.7c0.5,1.6,1.7,2.7,3,3.5l87.8,42.6v241.3c0,2.5,1.6,4.8,4,5.7
	c2,0.7,22.5,6.9,133.2,6.9l0,0l0,0c110.7,0,131.2-6.2,133.2-6.9c2.4-0.9,4-3.1,4-5.7V278.1l87.8-42.6c1.5-0.7,2.5-2,3-3.5
	c0.5-1.6,0.4-3.2-0.3-4.7L449.8,105.4z M444.5,121.6l44.4,88.1L420.8,243v-29.5C420.8,181.3,436.2,140.9,444.5,121.6z M335.8,50.2
	c13.1,9.8,18.5,20.4,16.9,32.7c-1.8,13.4-9.4,44.8-12.7,57.9l-34.1-9.1L335.8,50.2z M292.6,133.1l-9,13.1l-9-13.1l-25.1-68.3h68.2
	L292.6,133.1z M324.2,47l-2.2,5.8h-77l-2.2-5.8H324.2z M231.3,50.2l29.9,81.5l-34.1,9.1c-3.2-13.1-11-44.5-12.7-57.9
	C212.8,70.5,218.2,60.1,231.3,50.2z M146.4,264.7l-77-37.4l3.5-6.9l73.5,36V264.7z M146.4,243l-68.1-33.3l44.4-88.1
	c8.2,19.4,23.7,59.7,23.7,91.8V243z M408.8,213.4v301.2c-9.9,1.8-40.8,5.4-125.2,5.4s-115.2-3.6-125.2-5.4V213.4
	c0-41.8-23.3-94.2-28.9-106.1c5.8-10,39.6-25.4,73.2-36.4c-0.8,4.3-0.9,8.8-0.3,13.5c2.3,17.8,13.9,63.3,14.5,65.3
	c0.4,1.6,1.4,2.9,2.8,3.7c1,0.6,2.9,1.2,4.6,0.6l42.3-11.3l11,16v49.3c0,3.3,2.7,6.1,6.1,6.1c3.3,0,6.1-2.7,6.1-6.1v-49.3l11-16
	L343,154c0.5,0.1,2.9,0.6,4.6-0.6c1.7-1.2,2.3-2.2,2.8-3.7c0.5-2,12.1-47.4,14.5-65.3c0.6-4.7,0.5-9.2-0.3-13.5
	c33.6,11,67.3,26.4,73.2,36.4C432,119.3,408.8,171.6,408.8,213.4z M420.8,264.7v-8.3l73.5-36l3.5,6.9L420.8,264.7z"/>
</svg>
