com\mycompany\MANDOWEB\Controlles\DislikeComentario.class
com\mycompany\MANDOWEB\Controlles\BuscadorController.class
com\mycompany\MANDOWEB\Controlles\FavoritosController.class
com\mycompany\MANDOWEB\Controlles\NoticiaCrearController.class
com\mycompany\MANDOWEB\Controlles\RegistrarController.class
com\mycompany\MANDOWEB\Models\Categorias.class
com\mycompany\MANDOWEB\Models\Usuario.class
com\mycompany\MANDOWEB\DAO\ComentariosDAO.class
com\mycompany\MANDOWEB\DAO\UsuarioDAO.class
com\mycompany\MANDOWEB\Controlles\CerrarSesion.class
com\mycompany\MANDOWEB\Controlles\NoticiaMostrarController.class
com\mycompany\MANDOWEB\Controlles\DislikeNoticia.class
com\mycompany\MANDOWEB\Controlles\FavoritosBorrarController.class
com\mycompany\MANDOWEB\Controlles\IniSesionController.class
com\mycompany\MANDOWEB\DAO\CategoriasDAO.class
com\mycompany\MANDOWEB\Controlles\NoticiaPendienteController.class
com\mycompany\MANDOWEB\Controlles\NoticiaCanceladoControlle.class
com\mycompany\MANDOWEB\Controlles\ComentariosBorrarController.class
com\mycompany\MANDOWEB\DAO\NoticiasDAO.class
com\mycompany\MANDOWEB\Controlles\NoticiaPendientController.class
com\mycompany\MANDOWEB\Controlles\ComentariosController.class
com\mycompany\MANDOWEB\Models\Comentarios.class
com\mycompany\MANDOWEB\Utils\DbConnection.class
com\mycompany\MANDOWEB\Controlles\LikeNoticia.class
com\mycompany\MANDOWEB\Controlles\LikeComentario.class
com\mycompany\MANDOWEB\Controlles\NoticiaEstadoController.class
com\mycompany\MANDOWEB\Controlles\NoticiaCancelados.class
com\mycompany\MANDOWEB\Controlles\editUsuaController.class
com\mycompany\MANDOWEB\Controlles\indexController.class
com\mycompany\MANDOWEB\DAO\FavsDAO.class
com\mycompany\MANDOWEB\Models\Noticias.class
com\mycompany\MANDOWEB\Controlles\Sesion.class
com\mycompany\MANDOWEB\Models\Favs.class
com\mycompany\MANDOWEB\Utils\FileUtils.class
