[
    {
        "folio": 14,
        "fecha": "2019-07-31 21:29",
        "mes": "07",
        "random": "35P0B7CUYKSSPPJ6",
        "imei": "123456789456123",
        "email": "ma@gm.com",
        "nombre": "Manuel",
        "marca": "LG",
        "equipo": "LG Ca\u00f1onero",
        "pais": "9",
        "operator": "198",
        "precio": "43",
        "comentario": "",
        "estatus": 0,
        "code": 0
    }
]