[{"id" : "1", "name" : "LG", "img" : "logos/logo.png"},
 {"id" : "2", "name" : "Doro", "img" : "logos/logo-2.png"},
 {"id" : "3", "name" : "ZTE", "img" : "logos/logo-3.png"},
 {"id" : "4", "name" : "Grundig", "img" : "logos/logo-4.png"},
 {"id" : "5", "name" : "Philips", "img" : "logos/logo-5.png"},
 {"id" : "6", "name" : "Sony Ericsson", "img" : "logos/logo-6.png"},
 {"id" : "7", "name" : "SPV Orange", "img" : "logos/logo-7.png"},
 {"id" : "8", "name" : "HTC", "img" : "logos/logo-8.png"},
 {"id" : "9", "name" : "Nokia", "img" : "logos/logo-9.png"},
 {"id" : "10", "name" : "Vodafone", "img" : "logos/logo-10.png"},
 {"id" : "11", "name" : "Verykool", "img" : "logos/logo-11.png"},
 {"id" : "12", "name" : "Vitel", "img" : "logos/logo-12.png"},
 {"id" : "13", "name" : "Huawei", "img" : "logos/logo-13.png"},
 {"id" : "14", "name" : "BQ", "img" : "logos/logo-14.png"},
 {"id" : "15", "name" : "Motorola", "img" : "logos/logo-15.png"},
 {"id" : "16", "name" : "Sagem", "img" : "logos/logo-16.png"},
 {"id" : "17", "name" : "Amazon", "img" : "logos/logo-17.png"},
 {"id" : "18", "name" : "Apple", "img" : "logos/logo-18.png"},
 {"id" : "19", "name" : "Lenovo", "img" : "logos/logo-19.png"},
 {"id" : "20", "name" : "Lanix", "img" : "logos/logo-20.png"},
 {"id" : "21", "name" : "i mate", "img" : "logos/logo-21.png"},
 {"id" : "22", "name" : "Mitsubishi", "img" : "logos/logo-22.png"},
 {"id" : "23", "name" : "Vtelca", "img" : "logos/logo-23.png"},
 {"id" : "24", "name" : "Samsung", "img" : "logos/logo-24.png"},
 {"id" : "25", "name" : "iPhone", "img" : "logos/logo-25.png"},
 {"id" : "26", "name" : "Qtek", "img" : "logos/logo-26.png"},
 {"id" : "27", "name" : "Hisense", "img" : "logos/logo-27.png"},
 {"id" : "28", "name" : "Orange", "img" : "logos/logo-28.png"},
 {"id" : "29", "name" : "Palm", "img" : "logos/logo-29.png"},
 {"id" : "30", "name" : "Azumi", "img" : "logos/logo-30.png"},
 {"id" : "31", "name" : "Toshiba", "img" : "logos/logo-31.png"},
 {"id" : "32", "name" : "Kyocera", "img" : "logos/logo-32.png"},
 {"id" : "33", "name" : "Pantech", "img" : "logos/logo-33.png"},
 {"id" : "34", "name" : "Coolpad", "img" : "logos/logo-34.png"},
 {"id" : "35", "name" : "BGH", "img" : "logos/logo-35.png"},
 {"id" : "36", "name" : "Panasonic", "img" : "logos/logo-36.png"},
 {"id" : "37", "name" : "Sendo", "img" : "logos/logo-37.png"},
 {"id" : "38", "name" : "Siemens", "img" : "logos/logo-38.png"},
 {"id" : "39", "name" : "Sidekick", "img" : "logos/logo-39.png"},
 {"id" : "40", "name" : "Nec", "img" : "logos/logo-40.png"},
 {"id" : "41", "name" : "BLU", "img" : "logos/logo-41.png"},
 {"id" : "42", "name" : "Sony", "img" : "logos/logo-42.png"},
 {"id" : "43", "name" : "Alcatel", "img" : "logos/logo-43.png"},
 {"id" : "44", "name" : "HP", "img" : "logos/logo-44.png"},
 {"id" : "45", "name" : "BlackBerry", "img" : "logos/logo-45.png"},
 {"id" : "46", "name" : "BenQ Siemens", "img" : "logos/logo-46.png"},
 {"id" : "47", "name" : "Asus", "img" : "logos/logo-47.png"},
 {"id" : "48", "name" : "Sharp", "img" : "logos/logo-48.png"}]