[
    {
        "id": 10,
        "renta": "0",
        "categorias": "TQcQtEKChjzD",
        "precio": "10",
        "cuartos": "0",
        "jacuzzi": "false",
        "air": "false",
        "jardin": "false",
        "chimenea": "false",
        "banos": "0",
        "cochera": "0",
        "piscina": "false",
        "terraza": "false",
        "balcon": "false",
        "seguridad": "false",
        "recepcion": "false",
        "gimnasio": "false",
        "mail": true
    }
]