[
    {
        "pro_index": "AGyGQDnKN2R4",
        "cuartos": "0",
        "jacuzzi": "true",
        "air": "false",
        "jardin": "true",
        "trasero": "false",
        "chimenea": "false",
        "banos": "0",
        "cochera": "0",
        "piscina": "false",
        "terraza": "false",
        "balcon": "false",
        "seguridad": "false",
        "multimedia": ""
    }
]