[
    {
        "id": 10,
        "renta": "1",
        "categorias": "0",
        "precio": "67738999",
        "cuartos": "0",
        "jacuzzi": "false",
        "air": "false",
        "jardin": "false",
        "chimenea": "false",
        "banos": "0",
        "cochera": "0",
        "piscina": "false",
        "terraza": "false",
        "balcon": "true",
        "seguridad": "true",
        "recepcion": "true",
        "gimnasio": "true",
        "mail": true
    }
]