[
    {
        "folio": 199,
        "fecha": "2019-12-05 20:20",
        "mes": "12",
        "random": "W6LIP0QO",
        "imei": "992829392939990",
        "email": "valdezbeto@gmail.com",
        "nombre": "IMEI Request",
        "precio": 0,
        "fuente": "1",
        "comentario": "",
        "estatus": 0,
        "serviceinfo": "{\"result\":\"Error E01: IMEI is Wrong!\",\"imei\":\"992829392939990\",\"status\":\"error\"}",
        "code": ""
    }
]