[
    {
        "folio": 114,
        "fecha": "2019-10-25 19:30",
        "mes": "10",
        "random": "LX2GSYXD",
        "imei": "989898989898989",
        "email": "darck.to@gmail.com",
        "nombre": "Manuel Juarez",
        "marca": "Doro",
        "equipo": "Doro",
        "pais": "1",
        "operator": "1",
        "precio": "3",
        "coin": "MXN",
        "serviceid": "104",
        "servicename": "tagtest",
        "comentario": "",
        "estatus": 0,
        "serviceanswer": 0,
        "serviceinfo": 0,
        "mporder": 0,
        "code": 0
    }
]