[
    {
        "folio": 203,
        "fecha": "2020-01-10 16:56",
        "mes": "01",
        "random": "B6VLSJAF",
        "imei": "948292839929990",
        "email": "darck@gmail.com",
        "nombre": "IMEI Request",
        "precio": 0,
        "fuente": "1",
        "comentario": "",
        "estatus": 0,
        "serviceinfo": "{\"result\":\"Error E01: IMEI is Wrong!\",\"imei\":\"948292839929990\",\"status\":\"error\"}",
        "code": ""
    }
]