[
    {
        "folio": 216,
        "fecha": "2020-06-11 20:53",
        "mes": "06",
        "random": "FV5VPD3R",
        "imei": "321654987456123",
        "email": "darck.to@gmail.com",
        "nombre": "Manuel Roberto Valdez Guti\u00e9rrez",
        "marca": "LG",
        "equipo": "LG",
        "pais": "1",
        "operator": "1",
        "precio": "328.13",
        "coin": "MXN",
        "serviceid": "329",
        "servicename": "BASE",
        "comentario": "",
        "estatus": 0,
        "serviceanswer": 0,
        "serviceinfo": 0,
        "mporder": 0,
        "code": 0
    }
]