[
    {
        "folio": 128,
        "fecha": "2019-11-24 20:02",
        "mes": "11",
        "random": "AQX8Y5XH",
        "imei": "321654987456123",
        "email": "chat@movilsim.com",
        "nombre": "Manuel Juarez",
        "marca": "Doro",
        "equipo": "Doro",
        "pais": "1",
        "operator": "3",
        "precio": "1",
        "coin": "MXN",
        "serviceid": "113",
        "servicename": "tagtest",
        "comentario": "",
        "estatus": 0,
        "serviceanswer": 0,
        "serviceinfo": 0,
        "mporder": 0,
        "code": 0
    }
]