[
    {
        "email": "darck.to@gmail.com",
        "usuario": "Pregunta efimera",
        "mensaje": "Prueba de teste de test",
        "fecha": "2019-08-11 19:41:25",
        "answer": "Respuesta de 194125",
        "status": 1
    }
]