[
    {
        "id": "2",
        "id_m": "2",
        "name": "Doro",
        "img": "logos\/logo-2.png",
        "cost": "2",
        "desc": ""
    },
    {
        "id": "3",
        "id_m": "3",
        "name": "ZTE",
        "img": "logos\/logo-3.png",
        "cost": "3",
        "desc": ""
    },
    {
        "id": "4",
        "id_m": "4",
        "name": "Grundig",
        "img": "logos\/logo-4.png",
        "cost": "4",
        "desc": ""
    },
    {
        "id": "5",
        "id_m": "5",
        "name": "Philips",
        "img": "logos\/logo-5.png",
        "cost": "5",
        "desc": ""
    },
    {
        "id": "6",
        "id_m": "6",
        "name": "Sony Ericsson",
        "img": "logos\/logo-6.png",
        "cost": "6",
        "desc": ""
    },
    {
        "id": "7",
        "id_m": "7",
        "name": "SPV Orange",
        "img": "logos\/logo-7.png",
        "cost": "7",
        "desc": ""
    },
    {
        "id": "8",
        "id_m": "8",
        "name": "HTC",
        "img": "logos\/logo-8.png",
        "cost": "8",
        "desc": ""
    },
    {
        "id": "9",
        "id_m": "9",
        "name": "Nokia",
        "img": "logos\/logo-9.png",
        "cost": "9",
        "desc": ""
    },
    {
        "id": "10",
        "id_m": "10",
        "name": "Vodafone",
        "img": "logos\/logo-10.png",
        "cost": "10",
        "desc": ""
    },
    {
        "id": "11",
        "id_m": "11",
        "name": "Verykool",
        "img": "logos\/logo-11.png",
        "cost": "11",
        "desc": ""
    },
    {
        "id": "12",
        "id_m": "12",
        "name": "Vitel",
        "img": "logos\/logo-12.png",
        "cost": "12",
        "desc": ""
    },
    {
        "id": "13",
        "id_m": "13",
        "name": "Huawei",
        "img": "logos\/logo-13.png",
        "cost": "13",
        "desc": ""
    },
    {
        "id": "14",
        "id_m": "14",
        "name": "BQ",
        "img": "logos\/logo-14.png",
        "cost": "14",
        "desc": ""
    },
    {
        "id": "15",
        "id_m": "15",
        "name": "Motorola",
        "img": "logos\/logo-15.png",
        "cost": "15",
        "desc": ""
    },
    {
        "id": "16",
        "id_m": "16",
        "name": "Sagem",
        "img": "logos\/logo-16.png",
        "cost": "16",
        "desc": ""
    },
    {
        "id": "17",
        "id_m": "17",
        "name": "Amazon",
        "img": "logos\/logo-17.png",
        "cost": "17",
        "desc": ""
    },
    {
        "id": "18",
        "id_m": "18",
        "name": "Apple",
        "img": "logos\/logo-18.png",
        "cost": "18",
        "desc": ""
    },
    {
        "id": "19",
        "id_m": "19",
        "name": "Lenovo",
        "img": "logos\/logo-19.png",
        "cost": "19",
        "desc": ""
    },
    {
        "id": "20",
        "id_m": "20",
        "name": "Lanix",
        "img": "logos\/logo-20.png",
        "cost": "20",
        "desc": ""
    },
    {
        "id": "21",
        "id_m": "21",
        "name": "i mate",
        "img": "logos\/logo-21.png",
        "cost": "21",
        "desc": ""
    },
    {
        "id": "22",
        "id_m": "22",
        "name": "Mitsubishi",
        "img": "logos\/logo-22.png",
        "cost": "22",
        "desc": ""
    },
    {
        "id": "23",
        "id_m": "23",
        "name": "Vtelca",
        "img": "logos\/logo-23.png",
        "cost": "23",
        "desc": ""
    },
    {
        "id": "24",
        "id_m": "24",
        "name": "Samsung",
        "img": "logos\/logo-24.png",
        "cost": "24",
        "desc": ""
    },
    {
        "id": "25",
        "id_m": "25",
        "name": "iPhone",
        "img": "logos\/logo-25.png",
        "cost": "25",
        "desc": ""
    },
    {
        "id": "26",
        "id_m": "26",
        "name": "Qtek",
        "img": "logos\/logo-26.png",
        "cost": "26",
        "desc": ""
    },
    {
        "id": "27",
        "id_m": "27",
        "name": "Hisense",
        "img": "logos\/logo-27.png",
        "cost": "27",
        "desc": ""
    },
    {
        "id": "28",
        "id_m": "28",
        "name": "Orange",
        "img": "logos\/logo-28.png",
        "cost": "28",
        "desc": ""
    },
    {
        "id": "29",
        "id_m": "29",
        "name": "Palm",
        "img": "logos\/logo-29.png",
        "cost": "29",
        "desc": ""
    },
    {
        "id": "30",
        "id_m": "30",
        "name": "Azumi",
        "img": "logos\/logo-30.png",
        "cost": "30",
        "desc": ""
    },
    {
        "id": "31",
        "id_m": "31",
        "name": "Toshiba",
        "img": "logos\/logo-31.png",
        "cost": "31",
        "desc": ""
    },
    {
        "id": "32",
        "id_m": "32",
        "name": "Kyocera",
        "img": "logos\/logo-32.png",
        "cost": "32",
        "desc": ""
    },
    {
        "id": "33",
        "id_m": "33",
        "name": "Pantech",
        "img": "logos\/logo-33.png",
        "cost": "33",
        "desc": ""
    },
    {
        "id": "34",
        "id_m": "34",
        "name": "Coolpad",
        "img": "logos\/logo-34.png",
        "cost": "34",
        "desc": ""
    },
    {
        "id": "35",
        "id_m": "35",
        "name": "BGH",
        "img": "logos\/logo-35.png",
        "cost": "35",
        "desc": ""
    },
    {
        "id": "36",
        "id_m": "36",
        "name": "Panasonic",
        "img": "logos\/logo-36.png",
        "cost": "36",
        "desc": ""
    },
    {
        "id": "37",
        "id_m": "37",
        "name": "Sendo",
        "img": "logos\/logo-37.png",
        "cost": "37",
        "desc": ""
    },
    {
        "id": "38",
        "id_m": "38",
        "name": "Siemens",
        "img": "logos\/logo-38.png",
        "cost": "38",
        "desc": ""
    },
    {
        "id": "39",
        "id_m": "39",
        "name": "Sidekick",
        "img": "logos\/logo-39.png",
        "cost": "39",
        "desc": ""
    },
    {
        "id": "40",
        "id_m": "40",
        "name": "Nec",
        "img": "logos\/logo-40.png",
        "cost": "40",
        "desc": ""
    },
    {
        "id": "41",
        "id_m": "41",
        "name": "BLU",
        "img": "logos\/logo-41.png",
        "cost": "41",
        "desc": ""
    },
    {
        "id": "42",
        "id_m": "42",
        "name": "Sony",
        "img": "logos\/logo-42.png",
        "cost": "42",
        "desc": ""
    },
    {
        "id": "43",
        "id_m": "43",
        "name": "Alcatel",
        "img": "logos\/logo-43.png",
        "cost": "43",
        "desc": ""
    },
    {
        "id": "44",
        "id_m": "44",
        "name": "HP",
        "img": "logos\/logo-44.png",
        "cost": "44",
        "desc": ""
    },
    {
        "id": "45",
        "id_m": "45",
        "name": "BlackBerry",
        "img": "logos\/logo-45.png",
        "cost": "45",
        "desc": ""
    },
    {
        "id": "46",
        "id_m": "46",
        "name": "BenQ Siemens",
        "img": "logos\/logo-46.png",
        "cost": "46",
        "desc": ""
    },
    {
        "id": "47",
        "id_m": "47",
        "name": "Asus",
        "img": "logos\/logo-47.png",
        "cost": "47",
        "desc": ""
    },
    {
        "id": 48,
        "id_m": "1",
        "name": "LG Black",
        "img": "logos\/phones\/logo-48.png",
        "cost": "32",
        "desc": ""
    },
    {
        "id": 49,
        "id_m": "48",
        "name": "Sharp",
        "img": "logos\/phones\/logo-49.png",
        "cost": "343",
        "desc": ""
    },
    {
        "id": 50,
        "id_m": "1",
        "name": "LG K8",
        "img": "logos\/phones\/logo-50.png",
        "cost": "23",
        "desc": null
    },
    {
        "id": 51,
        "id_m": "1",
        "name": "LG Ca\u00f1onero",
        "img": "logos\/phones\/logo-51.png",
        "cost": "43",
        "desc": "<h6>El Lg Ca\u00f1onero es el gama alta y se desbloquea con las siguientes instrucciones<\/h6><ol><li>sdasdsjkhkjsdjfkds<\/li><li>asdfs<\/li><li>adfasfds dasf asd<\/li><li>asdf asdfasdfasdf<\/li><li>asdfasdf asdf<\/li><li>asdfasdf<\/li><li>asdfdasdf asdfsd<\/li><\/ol><blockquote><p>De requerir asistencia por favor consulta el: adsf asdf asdf asdf das<\/p><p>Y al: afads sadf sadf sadf<\/p><\/blockquote><p><b>Gracias<\/b><br><\/p>"
    },
    {
        "id": 52,
        "id_m": "1",
        "name": "LG n",
        "img": "logos\/phones\/logo-52.png",
        "cost": "6",
        "desc": "<p>\"<b>Lorem <\/b>ipsum dolor sit amet, consectetur <u>adipiscing <\/u>elit, sed do eiusmod tempor incididunt ut labore<\/p><ol><li>et dolore magna al<\/li><li>iqua. Ut enim <br><\/li><li>ad minim veniam, <br><\/li><li>quis nostrud exercitation<\/li><\/ol><blockquote><p> ullamco laboris nisi ut aliquip ex ea commodo consequat. Duis aute irure dolor in reprehenderit in voluptate velit esse cillum dolore eu fugiat nulla pariatur. Excepteur sint occaecat cupidatat non proident, sunt in culpa qui officia deserunt mollit anim id est laborum.\"<\/p><\/blockquote>"
    }
]