[
    {
        "folio": 190,
        "fecha": "2019-11-30 09:43",
        "mes": "11",
        "random": "3QPC9W96",
        "imei": "356568085067789",
        "email": "hectorhackhd@gmail.com",
        "nombre": "El Amor De Mi Vida",
        "marca": "Apple",
        "equipo": "iPhone 6 Daisy",
        "pais": "114",
        "operator": "12",
        "precio": "1000",
        "coin": "MXN",
        "serviceid": "329",
        "servicename": "SERVICIO",
        "comentario": "",
        "estatus": 0,
        "serviceanswer": 0,
        "serviceinfo": 0,
        "mporder": "5540428484",
        "code": 0
    }
]