[
    {
        "folio": 200,
        "fecha": "2019-12-06 17:25",
        "mes": "12",
        "random": "JJBTNWAG",
        "imei": "353064095434386",
        "email": "hectorhackhd@gmail.com",
        "nombre": "hector mayorga",
        "marca": "Apple",
        "equipo": "iPhone 6",
        "pais": "1",
        "operator": "13",
        "precio": "10",
        "coin": "MXN",
        "serviceid": "185",
        "servicename": "PREMIUM",
        "comentario": "",
        "estatus": 0,
        "serviceanswer": 0,
        "serviceinfo": 0,
        "mporder": "5574795183",
        "code": 0
    }
]