[
    {
        "folio": 195,
        "fecha": "2019-12-01 16:23",
        "mes": "12",
        "random": "YEZ8ACX1",
        "imei": "990000862471854",
        "email": "valdezbeto@gmail.com",
        "nombre": "Roberto Test",
        "marca": "Apple",
        "equipo": "iPhone SE",
        "pais": "1",
        "operator": "13",
        "precio": "500",
        "coin": "MXN",
        "serviceid": "410",
        "servicename": "Iphone",
        "comentario": "",
        "estatus": 1,
        "serviceanswer": "ERROR",
        "serviceinfo": [
            {
                "MESSAGE": "ValidationError123",
                "FULL_DESCRIPTION": ",Invalid IMEI-990000862471854,Invalid IMEI-990000862471854"
            }
        ],
        "mporder": "5545939114",
        "code": [
            {
                "IMEI": "355793078219178",
                "STATUS": "0",
                "CODE": "",
                "COMMENTS": ""
            }
        ]
    }
]