[
    {
        "folio": 212,
        "mes": "06",
        "random": "46JY4VZT",
        "imei": "321654987456123",
        "email": "darck.to@gmail.com",
        "nombre": "Manuel Roberto Valdez Guti\u00e9rrez",
        "marca": "LG",
        "equipo": "LG",
        "pais": "1",
        "operator": "1",
        "precio": "367.50",
        "coin": "MXN",
        "serviceid": "122",
        "servicename": "BASE",
        "comentario": "",
        "estatus": 0,
        "serviceanswer": 0,
        "serviceinfo": 0,
        "mporder": 0,
        "code": 0
    }
]