[
    {
        "folio": 192,
        "fecha": "2019-11-30 09:56",
        "mes": "11",
        "random": "J9MAE1ML",
        "imei": "356568085067789",
        "email": "hector@gmail.com",
        "nombre": "El Amor De Mi Vida",
        "marca": "Apple",
        "equipo": "iPhone 6 Daisy",
        "pais": "114",
        "operator": "12",
        "precio": "25.59",
        "coin": "USD",
        "serviceid": "194",
        "servicename": "SERVICIO",
        "comentario": "",
        "estatus": 0,
        "serviceanswer": 0,
        "serviceinfo": 0,
        "mporder": 0,
        "code": 0
    }
]