<?xml version="1.0" standalone="no"?>
<!DOCTYPE svg PUBLIC "-//W3C//DTD SVG 20010904//EN"
 "http://www.w3.org/TR/2001/REC-SVG-20010904/DTD/svg10.dtd">
<svg version="1.0" xmlns="http://www.w3.org/2000/svg"
 width="150.000000pt" height="150.000000pt" viewBox="0 0 150.000000 150.000000"
 preserveAspectRatio="xMidYMid meet">
<metadata>
Created by potrace 1.11, written by Peter Selinger 2001-2013
</metadata>
<g transform="translate(0.000000,150.000000) scale(0.100000,-0.100000)"
fill="#000000" stroke="none">
<path d="M410 1022 l0 -348 26 -52 c31 -62 79 -106 154 -141 47 -22 69 -26
155 -26 89 0 107 3 162 29 82 37 146 106 167 177 13 43 16 111 16 381 l0 328
-340 0 -340 0 0 -348z m246 281 c-12 -57 55 -122 110 -109 13 4 26 1 29 -5 4
-6 -3 -13 -15 -16 -12 -3 -26 -17 -31 -30 -7 -19 -14 -23 -36 -19 -16 2 -35 5
-44 5 -9 1 -21 12 -27 26 -6 14 -18 25 -26 25 -8 0 -18 9 -21 20 -8 25 -20 25
-37 2 -7 -10 -25 -27 -40 -36 -16 -10 -28 -24 -28 -32 0 -7 -9 -12 -20 -11
-17 1 -20 8 -20 54 l0 52 43 3 c37 3 42 6 42 28 0 22 -5 25 -42 28 -35 3 -43
7 -43 23 0 18 8 19 106 19 l106 0 -6 -27z m162 -14 c4 -43 -22 -70 -67 -71
-49 -2 -86 44 -74 91 5 20 11 22 72 19 l66 -3 3 -36z m-303 -29 c0 -18 -52
-27 -67 -12 -17 17 2 33 35 30 20 -2 32 -8 32 -18z m535 -20 c0 -5 -13 -10
-30 -10 -16 0 -30 5 -30 10 0 6 14 10 30 10 17 0 30 -4 30 -10z m-220 -14 c0
-2 -8 -10 -17 -17 -16 -13 -17 -12 -4 4 13 16 21 21 21 13z m203 -23 c-7 -2
-21 -2 -30 0 -10 3 -4 5 12 5 17 0 24 -2 18 -5z m-233 -57 c0 -2 -7 -19 -15
-37 l-14 -34 -1 31 c0 17 3 34 7 37 7 8 23 9 23 3z m-279 -37 c-9 -22 -10 -22
-10 -3 -1 11 2 24 6 27 12 12 14 0 4 -24z m111 -23 c-9 -18 -11 -16 -11 19 0
33 1 37 10 21 8 -12 8 -25 1 -40z m85 -18 c-3 -8 -6 -5 -6 6 -1 11 2 17 5 13
3 -3 4 -12 1 -19z m48 -48 c-3 -5 -13 -10 -21 -10 -8 0 -14 5 -14 10 0 6 9 10
21 10 11 0 17 -4 14 -10z m-56 -39 c15 -10 13 -10 -134 -36 -49 -9 -98 -19
-107 -21 -14 -4 -18 1 -18 19 0 24 5 26 73 35 96 12 169 14 186 3z m214 -2
c31 -5 73 -17 93 -25 65 -27 23 -34 -86 -13 -157 29 -156 29 -139 40 19 12 63
11 132 -2z m-166 -5 c-3 -3 -12 -4 -19 -1 -8 3 -5 6 6 6 11 1 17 -2 13 -5z
m43 -34 c33 -11 31 -11 -84 -15 -99 -4 -118 2 -49 15 50 10 102 10 133 0z
m250 -40 c0 -6 -107 -10 -300 -10 -193 0 -300 4 -300 10 0 6 107 10 300 10
193 0 300 -4 300 -10z m-580 -71 c0 -10 -4 -19 -10 -19 -5 0 -10 12 -10 26 0
14 4 23 10 19 6 -3 10 -15 10 -26z m90 20 c-14 -5 -33 -20 -43 -32 l-18 -22
10 22 c12 25 38 43 61 42 8 0 4 -5 -10 -10z m222 -6 c8 -10 18 -25 23 -33 4
-8 -4 -2 -17 14 -20 24 -29 28 -52 22 -16 -4 -30 -16 -33 -26 -3 -11 -9 -20
-15 -20 -13 0 9 37 30 49 26 15 47 13 64 -6z m186 -3 c12 -12 22 -25 22 -31 0
-6 -10 2 -23 17 -28 32 -67 28 -85 -8 -6 -13 -11 -17 -11 -10 -1 18 36 52 57
52 10 0 28 -9 40 -20z m-348 -21 c6 -10 7 -19 3 -19 -4 0 -13 11 -20 25 -13
29 2 24 17 -6z m429 -28 c-1 -33 -15 -93 -19 -81 -1 3 -4 33 -7 67 -4 54 -2
62 11 57 11 -4 16 -18 15 -43z m-579 -31 c0 -16 -4 -30 -10 -30 -5 0 -10 14
-10 30 0 17 5 30 10 30 6 0 10 -13 10 -30z m160 -5 c0 -24 -3 -25 -60 -25 -57
0 -60 1 -60 25 0 24 3 25 60 25 57 0 60 -1 60 -25z m89 12 c-9 -7 -18 -19 -22
-27 -3 -9 -6 -4 -6 13 -1 22 3 27 22 27 19 -1 20 -2 6 -13z m91 -12 c0 -31
-10 -31 -33 0 -18 25 -18 25 8 25 20 0 25 -5 25 -25z m170 0 c0 -24 -3 -25
-55 -25 -52 0 -55 1 -55 25 0 24 3 25 55 25 52 0 55 -1 55 -25z m-223 -1 c-3
-3 -12 -4 -19 -1 -8 3 -5 6 6 6 11 1 17 -2 13 -5z m0 -30 c-3 -3 -12 -4 -19
-1 -8 3 -5 6 6 6 11 1 17 -2 13 -5z m-213 -53 c3 -4 -8 -8 -24 -7 -17 1 -30 4
-30 9 0 10 48 9 54 -2z m96 -1 c0 -5 -7 -7 -15 -4 -8 4 -22 1 -30 -6 -15 -12
-22 0 -8 13 10 11 53 8 53 -3z m130 0 c0 -5 -8 -10 -18 -10 -24 0 -32 -8 -25
-26 7 -19 30 -18 43 4 10 16 11 16 8 -2 -2 -10 -11 -24 -21 -30 -26 -16 -62
27 -47 55 11 20 60 27 60 9z m140 -6 c0 -14 -3 -14 -15 -4 -12 10 -18 10 -30
0 -12 -10 -15 -10 -15 4 0 11 9 16 30 16 21 0 30 -5 30 -16z m94 7 c3 -4 -8
-8 -24 -7 -17 1 -30 4 -30 9 0 10 48 9 54 -2z m-274 -114 c0 -2 -10 -12 -22
-23 l-23 -19 19 23 c18 21 26 27 26 19z m51 -14 c13 -16 12 -17 -3 -4 -10 7
-18 15 -18 17 0 8 8 3 21 -13z m-107 -18 c-4 -10 0 -15 14 -15 11 0 25 7 32
15 7 8 18 15 25 15 7 0 18 -7 25 -15 7 -8 21 -15 32 -15 14 0 18 5 14 15 -4
12 5 15 57 14 l62 0 -65 -26 c-55 -21 -77 -24 -140 -21 -47 3 -92 13 -120 26
l-45 20 57 1 c47 1 56 -2 52 -14z"/>
<path d="M390 357 c0 -46 -5 -80 -13 -92 -16 -21 -37 -12 -37 16 0 14 -7 19
-25 19 -20 0 -25 -5 -25 -25 0 -57 86 -88 125 -45 21 23 30 91 21 154 -6 36
-11 46 -27 46 -17 0 -19 -7 -19 -73z"/>
<path d="M465 378 c-4 -29 -5 -78 -3 -108 l3 -55 78 -3 c77 -3 77 -3 77 23 0
24 -3 25 -55 25 -48 0 -55 2 -55 20 0 17 7 20 50 20 43 0 50 3 50 19 0 17 -8
20 -47 23 -40 3 -48 6 -48 23 0 17 8 20 53 23 44 3 52 6 52 23 0 17 -7 19 -74
19 l-75 0 -6 -52z"/>
<path d="M652 323 c3 -103 4 -108 26 -111 20 -3 22 1 22 37 0 36 3 41 23 41
33 0 45 -12 49 -45 2 -24 8 -30 28 -30 23 0 25 3 22 35 -2 19 -10 42 -18 51
-13 15 -13 17 1 22 9 4 15 19 15 41 0 49 -28 66 -108 66 l-63 0 3 -107z m118
52 c18 -21 -4 -45 -41 -45 -26 0 -29 4 -29 30 0 26 3 30 29 30 16 0 34 -7 41
-15z"/>
<path d="M852 323 l3 -108 78 -3 c77 -3 77 -3 77 23 0 24 -3 25 -55 25 -48 0
-55 2 -55 20 0 17 7 20 50 20 43 0 50 3 50 20 0 17 -7 20 -50 20 -47 0 -50 2
-50 25 0 24 3 25 55 25 48 0 55 2 55 20 0 18 -7 20 -80 20 l-81 0 3 -107z"/>
<path d="M1040 411 c0 -16 8 -20 46 -23 l45 -3 -51 -65 c-29 -38 -49 -73 -48
-85 3 -18 11 -20 83 -20 73 0 80 2 80 20 0 16 -8 21 -47 25 l-47 5 45 59 c24
33 44 70 44 83 0 22 -3 23 -75 23 -68 0 -75 -2 -75 -19z"/>
<path d="M324 174 c3 -8 2 -12 -4 -9 -6 3 -10 0 -10 -7 0 -8 9 -14 20 -14 11
0 20 3 20 7 0 17 -13 39 -22 39 -6 0 -7 -7 -4 -16z"/>
<path d="M490 180 c0 -6 -6 -10 -12 -9 -34 4 -57 -3 -61 -18 -4 -17 -5 -17 -6
-1 -1 13 -8 17 -26 16 -19 -2 -24 -7 -23 -25 3 -29 14 -29 23 0 6 19 8 20 12
4 3 -13 10 -16 26 -11 12 4 25 12 30 18 5 8 10 6 17 -4 9 -13 10 -13 11 0 0
10 3 8 9 -5 7 -17 9 -15 9 13 1 17 -1 32 -4 32 -3 0 -5 -5 -5 -10z"/>
<path d="M730 181 c0 -7 -33 -10 -105 -8 -103 2 -113 -1 -102 -30 4 -13 27
-12 41 3 13 12 15 12 19 -4 4 -14 5 -14 6 3 1 12 4 16 9 9 4 -6 23 -14 42 -17
26 -5 31 -4 20 4 -12 8 -9 9 13 4 19 -4 26 -2 22 5 -3 5 -1 10 4 10 6 0 11 -8
12 -17 0 -16 1 -16 8 1 6 16 8 17 13 4 9 -23 53 -18 53 7 0 12 -6 19 -14 17
-7 -1 -19 3 -27 9 -10 8 -14 8 -14 0z m50 -27 c0 -8 -5 -12 -10 -9 -6 4 -8 11
-5 16 9 14 15 11 15 -7z"/>
<path d="M815 180 c-4 -6 1 -7 12 -3 17 6 17 5 1 -14 -23 -25 -23 -33 2 -33
13 0 18 5 14 15 -8 20 6 19 21 -2 14 -19 35 -9 35 17 0 25 -17 35 -35 20 -9
-7 -15 -8 -20 0 -8 13 -22 13 -30 0z m75 -14 c0 -8 -4 -18 -10 -21 -5 -3 -10
3 -10 14 0 12 5 21 10 21 6 0 10 -6 10 -14z"/>
<path d="M917 183 c-3 -5 -1 -17 4 -28 7 -17 8 -17 8 8 1 27 -4 34 -12 20z"/>
<path d="M942 163 c4 -36 33 -39 33 -3 0 16 -7 26 -18 28 -15 3 -18 -2 -15
-25z m28 -7 c0 -3 -4 -8 -10 -11 -5 -3 -10 -1 -10 4 0 6 5 11 10 11 6 0 10 -2
10 -4z"/>
<path d="M1040 178 c0 -5 5 -6 10 -3 6 3 10 2 10 -4 0 -5 -4 -13 -10 -16 -15
-9 -12 -25 5 -25 8 0 12 6 9 14 -3 8 -1 17 5 21 6 3 11 -1 11 -9 0 -22 20 -30
36 -14 25 24 7 45 -37 45 -21 0 -39 -4 -39 -9z m70 -20 c0 -16 -3 -19 -11 -11
-6 6 -8 16 -5 22 11 17 16 13 16 -11z"/>
<path d="M1135 181 c-4 -7 1 -8 12 -4 17 6 17 5 1 -14 -23 -25 -23 -33 0 -33
13 0 18 8 17 27 0 27 -18 42 -30 24z"/>
<path d="M1187 183 c-3 -5 -1 -17 4 -28 7 -17 8 -17 8 8 1 27 -4 34 -12 20z"/>
</g>
</svg>
