[
    {
        "folio": 189,
        "fc": "Fri-Oct-2022 14:49",
        "random": "T1WUICF6XF",
        "date": "211020221449",
        "title": "ANUNCIAN DESCUENTOS PARA REGULARIZAR A CONTRIBUYENTES JEREZANOS ",
        "note": "<blockquote>-         El descuento ser\u00e1 hasta del 50% en multas y recargos en el predial<br>-         Permanecer\u00e1 vigente hasta el 31 de diciembre de 2022<\/blockquote><p> <\/p><p>Para incentivar la recaudaci\u00f3n municipal, el H. Ayuntamiento de Jerez, a trav\u00e9s de la Tesorer\u00eda Municipal, anunci\u00f3 el programa regularizaci\u00f3n fiscal de hasta el 50% de descuento en multas y recargos del impuesto predial.<\/p><p> <\/p><p>Dicho programa, se mantendr\u00e1 vigente hasta el 31 de diciembre de 2022 y los pagos se podr\u00e1n realizar de las caja de la Tesorer\u00eda, en la Presidencia Municipal, as\u00ed como en Recaudaci\u00f3n de Rentas. <\/p><p> <\/p><p>Cabe se\u00f1alar que dicho programa tiene como finalidad permitir a las y los contribuyentes poner al corriente su situaci\u00f3n, as\u00ed como incentivar la recaudaci\u00f3n; de esta forma los descuentos son aplicables para los adeudos de 2022 y anteriores.<\/p>",
        "foto1": "img_1_T1WUICF6XF_211020221449.PNG",
        "foto2": null,
        "portada": 0
    }
]