[
    {
        "folio": 214,
        "fc": "Mon-Oct-2022 15:07",
        "random": "HONT8QNBIH",
        "date": "241020221507",
        "title": "MEJORAS CONTINUAS AL MERCADO MUNICIPAL DE JEREZ",
        "note": "<blockquote>-\tCambian iluminaci\u00f3n por sistema led y los ventiladores en el \u00e1rea de comidas<br>Jerez, Zac.- Con el objeto de propiciar mejores condiciones en su trabajo a quienes desempe\u00f1an alguna actividad al interior del mercado municipal, el gobierno que encabeza el alcalde Jos\u00e9 Humberto Salazar Contreras ha emprendido constantes mejoras que favorecen tanto a los mercaderes como a su clientela.<\/blockquote><p>El administrador de Plazas y Mercados Manuel de Jes\u00fas Dorado Caldera inform\u00f3 sobre la instalaci\u00f3n de 16 l\u00e1mparas led en el \u00e1rea de comidas, donde tambi\u00e9n se sustituyeron 13 ventiladores de techo, debido a que los anteriores presentaban serias deficiencias.<\/p><p>De igual manera, se realiz\u00f3 la limpieza la tuber\u00eda del drenaje interno a los 25 locales que expenden alimentos,  pues en la mayor\u00eda de ellos se encontraba completamente colapsado, debido a que por a\u00f1os no se hab\u00eda realizado este proceso.<\/p><p>Las acciones que el gobierno municipal realiza en el principal centro de abasto del municipio son permanentes, recientemente se realiz\u00f3 la fumigaci\u00f3n total, que, ahora, por acuerdo con la mesa directiva de los locatarios,  se efect\u00faa cuatro veces al a\u00f1o y como se ha hecho costumbre de acuerdo con lo que marca la tem\u00e1tica de cada temporada, se colocaron los adornos en el exterior, con motivos relacionados al D\u00eda de Muertos.<\/p><p>Dorado Caldera inform\u00f3 que se tienen m\u00e1s proyectos para mejorar este lugar y brindar mejores condiciones de seguridad, higiene, ambiente agradable y otros aspectos que se consideran en las mejoras que se realizan en acuerdo con los l\u00edderes de los locatarios.<\/p>",
        "foto1": "img_1_HONT8QNBIH_241020221507.PNG",
        "foto2": "img_2_HONT8QNBIH_241020221507.PNG",
        "portada": 0
    }
]