[
    {
        "folio": 123,
        "fc": "Mon-Aug-2022 13:50",
        "random": "O46O5A7INU",
        "date": "010820221350",
        "title": "INSTITUYE EL CABILDO EL 1 DE AGOSTO COMO D\u00cdA DEL MIGRANTE JEREZANO Y SE DECLARA JEREZ, CAPITAL MIGRANTE",
        "note": "<blockquote>-\tEllos siempre orgullosos de sus ra\u00edces, nosotros siempre orgullosos de ellos: Humberto Salazar<br>-\tSon la mitad m\u00e1s noble del coraz\u00f3n de la Patria: Martha Alamillo<br>-\tReconoce titular del Zacatecano Migrante la iniciativa del alcalde para homenajear a esta comunidad<\/blockquote><p>Jerez, Zac.- El municipio de Jerez fue declarado oficialmente como Capital Migrante, toda vez que el Ayuntamiento aval\u00f3 la declaratoria hecha por el presidente Jos\u00e9 Humberto Salazar Contreras, para que, a partir de este 2022, se institucionalice el primer d\u00eda del mes de agosto como D\u00eda del Migrante Jerezano, homenaje del pueblo de Jerez a los paisanos que, sin importar la distancia, siguen manteniendo una profunda conexi\u00f3n con su tierra de origen.<\/p><p>En el Teatro Hinojosa los miembros del Ayuntamiento de Jerez realizaron la sesi\u00f3n solemne de Cabildo, misma que atestigu\u00f3 el Secretario del Zacatecano Migrante Iv\u00e1n Reyes en representaci\u00f3n del Gobernador David Monreal \u00c1vila y ante una cantidad considerable de migrantes, el doctor Salazar destac\u00f3 que Jerez, al igual que todo Zacatecas, tiene una arraigada tradici\u00f3n migrante, por lo que se consider\u00f3 de fundamental importancia, ofrecer un merecido reconocimiento a la nobleza de esp\u00edritu de las y los paisanos. <\/p><p>Afirm\u00f3 que esta Primera Semana del Migrante es la muestra material del agradecimiento que Jerez y su gente le profesa a aquellos y aquellas que han dado lo mejor de s\u00ed para el florecimiento de su pueblo, de ah\u00ed que se ha querido festejar el trabajo, compromiso y entrega que nuestras hermanas y hermanos migrantes ofrecen al rinconcito del mundo que los vio nacer. \u201cEllos siempre orgullosos de sus ra\u00edces, nosotros siempre orgullosos de ellos, afirm\u00f3\u201d.<\/p><p>Por su parte, el Secretario del Zacatecano Migrante destac\u00f3 la iniciativa del presidente Humberto Salazar Contreras para la realizaci\u00f3n de este festejo, lo que reafirma y enriquece los valores que dan identidad a nuestra comunidad migrante como zacatecanos. <\/p><p>Resalt\u00f3 la importante colaboraci\u00f3n de los paisanos en la econom\u00eda del pa\u00eds a trav\u00e9s de las remesas y como generadores de desarrollo y bienestar, con la inclusi\u00f3n de la cultura zacatecana, fortaleciendo el arraigo con sus comunidades en proyectos de infraestructura social b\u00e1sica y educativa. <\/p><p>La regidora Martha Alamillo Guzm\u00e1n dijo a los connacionales que son ellos la mitad m\u00e1s noble del coraz\u00f3n de esta patria y afirm\u00f3 que Jerez, Capital Migrante creci\u00f3 y seguir\u00e1 creciendo gracias a su compromiso, su trabajo y el amor por su tierra.<\/p>",
        "foto1": "img_1_O46O5A7INU_010820221350.PNG",
        "foto2": "img_2_O46O5A7INU_010820221350.PNG",
        "portada": 0
    }
]