[
    {
        "folio": 17,
        "fc": "Thu-Oct-2021 11:15",
        "random": "ZS97JKTTC9",
        "date": "211020211115",
        "title": "SERVICIOS P\u00daBLICOS CONTIN\u00daA LABORES DE LA CAMPA\u00d1A INTENSIVA DE BACHEO ",
        "note": "<p>Servicios P\u00fablicos del H. Ayuntamiento de Jerez contin\u00faan con las incansables labores de la Campa\u00f1a Intensiva de Bacheo. Siguen trabajando de forma ininterrumpida para entregar con eficiencia, velocidad y seguridad calles dignas para el libre tr\u00e1nsito de toda la poblaci\u00f3n jerezana. Las obras de las calles Hidalgo y Rosales avanzan activamente. <\/p><p>Ponemos manos a la obra para seguir #TransformandoJerez<\/p>",
        "foto1": "img_1_ZS97JKTTC9_211020211115.PNG",
        "foto2": "img_2_ZS97JKTTC9_211020211115.PNG",
        "portada": 0
    }
]