[
    {
        "folio": 197,
        "fc": "Fri-Oct-2022 15:16",
        "random": "X5O9P7CABY",
        "date": "211020221516",
        "title": "CONTIN\u00daA DIF DE JEREZ CON PREVENCI\u00d3N DEL ACOSO ESCOLAR",
        "note": "<blockquote>Para prevenir el acoso escolar, el DIF de Jerez que dirige la presidenta honor\u00edfica Bertha Alicia Garc\u00eda Duarte, contin\u00faa con visitas de concientizaci\u00f3n por primarias de comunidades y colonias del municipio.<\/blockquote><p>Psic\u00f3logos del Sistema ha visitado las escuelas b\u00e1sicas de las comunidades Jomulquillo, El Porvenir, Los Rodarte, El Huejote y la colonia CNOP haciendo \u00e9nfasis en la problem\u00e1tica tambi\u00e9n conocida como bullying.<\/p><p>Ante padres de familia y alumnos se ha explicado que el acoso escolar es una responsabilidad compartida, pues va en gran crecimiento en nuestro pa\u00eds, y afecta tanto a quien la provoca como a quien la padece. <\/p><p>Estas pl\u00e1ticas se han destinado a planteles identificados como vulnerables al problema social, y los que quieran acceder a ellas pueden acercarse al DIF a solicitarlas.<\/p>",
        "foto1": "img_1_X5O9P7CABY_211020221516.PNG",
        "foto2": "img_2_X5O9P7CABY_211020221516.PNG",
        "portada": 0
    }
]