[
    {
        "folio": 4,
        "fc": "Wed-Oct-2021 14:29",
        "random": "QVK05XVUJJ",
        "date": "131020211429",
        "title": "CON MODERNO EQUIPAMIENTO, JEREZ MEJORA EL SERVICIO DE AGUA POTABLE PARA LOS FRACCIONAMIENTOS",
        "note": "<blockquote><p>Con la instalaci\u00f3n de v\u00e1lvulas inteligentes se controla la presi\u00f3n y se evitan fugas de agua en los fraccionamientos San Isidro y Don Durito. <\/p><\/blockquote><p>Con el fin de brindar un mejor servicio a la ciudadan\u00eda, el Sistema Municipal de Agua Potable y Alcantarillado de Jerez (SIMAPAJ), a trav\u00e9s su Direcci\u00f3n Operativa, realiz\u00f3 la instalaci\u00f3n de una v\u00e1lvula de control hidr\u00e1ulico para regular la presi\u00f3n en los fraccionamientos Don Durito y Villas de San Isidro.<\/p><h2>El Director del SIMAPAJ, Marco Antonio Valenzuela, coment\u00f3 que en esa zona la presi\u00f3n de agua era muy elevada, lo que en un futuro traer\u00eda problemas graves de fugas, as\u00ed como posible desperdicio del vital l\u00edquido.<\/h2>",
        "foto1": "img_1_QVK05XVUJJ_131020211429.PNG",
        "foto2": "img_2_QVK05XVUJJ_131020211429.PNG",
        "portada": 0
    }
]