[
    {
        "folio": 280,
        "fc": "Fri-Jan-2023 15:04",
        "random": "WP000AYKEV",
        "date": "130120231504",
        "title": "ENTREGA EL DOCTOR SALAZAR 214 CALENTADORES SOLARES PARA FAMILIAS JEREZANAS",
        "note": "<blockquote><p>-\tPor primera vez se hace efectivo este apoyo s\u00f3lo con recursos municipales; la inversi\u00f3n fue de 2 millones de pesos<\/p><p>Jerez, Zac.- El alcalde Jos\u00e9 Humberto Salazar Contreras entreg\u00f3 214 calentadores solares, adquiridos con recursos municipales, en beneficio de familias jerezanas con mayor necesidad y que con oportunidad hab\u00edan hecho la solicitud respectiva a trav\u00e9s del departamento de Atenci\u00f3n Ciudadana y Gesti\u00f3n Social.<\/p><p>En un acto realizado en el auditorio Genaro Borrego Estrada, el presidente precis\u00f3 que, por vez primera, el gobierno municipal opt\u00f3 por impulsar este tipo de programas con recursos propios, pues anteriormente se hac\u00eda con el respaldo de otros niveles de gobierno, sin embargo, ante la necesidad manifiesta de las personas, se determin\u00f3 realizar la inversi\u00f3n de dos millones de pesos para adquirirlos por parte del municipio.<\/p><p>Afirm\u00f3 que su deseo es apoyar a m\u00e1s familias no obstante las circunstancias dif\u00edciles y los tiempos cr\u00edticos que se viven, sobre todo en lo econ\u00f3mico, pero ofreci\u00f3 luchar para incrementar el n\u00famero de beneficiarios, con este tipo de servicios que repercuten en la econom\u00eda familiar al representar un considerable ahorro en el consumo de gas.<\/p><p>Por su parte, el titular del \u00e1rea de Atenci\u00f3n Ciudadana David Josafat de la Torre Pinedo afirm\u00f3 que, luego de identificar las necesidades de las familias beneficiadas, con base en sus solicitudes, se dio cumplimiento a este compromiso del doctor Salazar, con la visi\u00f3n de que las familias a las que se apoya, mejoren su calidad de vida y sobre todo lo vean reflejado en el bolsillo.<\/p><p>Acompa\u00f1aron al presidente en la entrega de estos implementos, el secretario de Gobierno H\u00e9ctor Hugo Ram\u00edrez Escobedo, los directores de Obras P\u00fablicas Alfredo Mar\u00edn Luna y del Sistema Municipal de Agua Potable y Alcantarillado de Jerez (SIMAPAJ) Marco Antonio Valenzuela, as\u00ed como los regidores Martha Alamillo Guzm\u00e1n y Luis Mario Mart\u00ednez Aparicio.<\/p><\/blockquote>",
        "foto1": "img_1_WP000AYKEV_130120231504.PNG",
        "foto2": "img_2_WP000AYKEV_130120231504.PNG",
        "portada": 0
    }
]