[
    {
        "folio": 314,
        "fc": "Thu-Feb-2023 11:04",
        "random": "F5B3JSA3TI",
        "date": "160220231104",
        "title": "REALIZA CON \u00c9XITO EXPO-VENTA SAN VALENT\u00cdN EN JEREZ ",
        "note": "<blockquote>Jerez, Zac.- Domingo familiar lleno de ambiente rom\u00e1ntico y festivo se vivi\u00f3 en el andador Benito Ju\u00e1rez, en el centro hist\u00f3rico del bello pueblo m\u00e1gico de Jerez, donde emprendedores, artesanos, dise\u00f1adores de moda, joyeros, reposteros y comerciantes mostraron su creatividad y talento por medio de sus productos. Esta Expo Venta San Valent\u00edn fue organizada por la administraci\u00f3n municipal 20221-2024, por medio del Instituto Jerezano de Juventud (INJJUVE), con el objetivo de incentivar el comercio local y para quienes deseen obtener un detalle para amigos, familiares y parejas o para este pr\u00f3ximo 14 de febrero.<\/blockquote><p>Dentro de la exposici\u00f3n, los 30 emprendedores se permitieron presentar sus productos, explicar sobre su proceso de elaboraci\u00f3n, al mismo tiempo que promocionar sus servicios, artesan\u00edas, joyer\u00eda, ropa hecha a mano, bolsas, paletas de chocolate, bombones, caramelo, peluches, cosm\u00e9ticos, ate de membrillo, piezas de arte, no solo en esta exposici\u00f3n si no tambi\u00e9n para futuros servicios, mismos que pudieron encontrar para distintos gustos y presupuestos, muchos de ellos personalizables. <\/p><p>La titular del INJJUVE Ing. Marlinet D\u00edaz Carrillo expres\u00f3 que est\u00e1n buscando \u201cm\u00e1s oportunidades para seguir incentivando futuras exposiciones, por ello sigo invitando a la poblaci\u00f3n a estar atenta a las convocatorias, mismas que tomar\u00e1n en cuenta las exigencias de la ciudadan\u00eda y buscar\u00e1n colaborar con otras instituciones municipales\u201d. Al finalizar agradeci\u00f3 a los jerezanos por acudir a esta convocatoria y consumir lo local.<\/p>",
        "foto1": "img_1_F5B3JSA3TI_160220231104.PNG",
        "foto2": "img_2_F5B3JSA3TI_160220231104.PNG",
        "portada": 0
    }
]