[
    {
        "folio": 164,
        "fc": "Tue-Sep-2022 15:10",
        "random": "Z0M10G07ND",
        "date": "270920221510",
        "title": "CUMPLE LA ADMINISTRACI\u00d3N DE JEREZ CON LA FUMIGACI\u00d3N PERIODICA DEL MERCADO",
        "note": "<blockquote>Jerez, Zac.  C\u00f3mo parte de las acciones que peri\u00f3dicamente realiza el gobierno que encabeza el alcalde Jos\u00e9 Humberto Salazar Contreras, para por un municipio m\u00e1s sano, se desarroll\u00f3 una nueva fumigaci\u00f3n en el mercado municipal Benito Ju\u00e1rez.<\/blockquote><p>Cumpliendo con lo acordado con la directiva de locatarios, de llevar a cabo este proceso de control cada cuatro meses, personal especializado realiz\u00f3 el trabajo en la nave principal, patio, \u00e1rea de comidas, espacios comunes y en los locales independientes, cuyos propietarios solicitaron que se hiciera y mantuvieron abierto el espacio durante el horario previamente anunciado.<\/p><p>C\u00f3mo ha sido una constante en estos meses, el presidente de la mesa directiva y el administrador de Plazas y mercados Jes\u00fas Manuel Dorado supervisaron coordinadamente los trabajos.<\/p>",
        "foto1": "img_1_Z0M10G07ND_270920221510.PNG",
        "foto2": "img_2_Z0M10G07ND_270920221510.PNG",
        "portada": 0
    }
]