[
    {
        "folio": 34,
        "fc": "Thu-Dec-2021 11:07",
        "random": "NT9Q45K6NE",
        "date": "091220211107",
        "title": "H. AYUNTAMIENTO DE JEREZ PRESENTA PROGRAMA DEL FESTIVAL NAVIDE\u00d1O 2021",
        "note": "<blockquote>El H. Ayuntamiento de Jerez present\u00f3 el programa general de su Festival Navide\u00f1o 2021, el cual se pretende que sea una experiencia significativa para todos aquellos que asistan, que llene de c\u00e1lidos recuerdos a sus visitantes, pero, sobre todo, quieren crear espacios donde los jerezanos puedan compartir rodeados del amor de sus seres queridos.  En esta presentaci\u00f3n, el alcalde Humberto Salazar reconoci\u00f3 el esfuerzo del Sistema Municipal DIF, Instituto Jerezano de Cultura, Desarrollo Econ\u00f3mico, Turismo, Instituto Jerezano de la Juventud, Coordinaci\u00f3n de Educaci\u00f3n y Eventos Especiales, quienes trabajan en coordinaci\u00f3n en el dise\u00f1o de un programa de alta calidad en sus eventos y atractivos.<\/blockquote>",
        "foto1": "img_1_NT9Q45K6NE_091220211107.PNG",
        "foto2": "img_2_NT9Q45K6NE_091220211107.PNG",
        "portada": 0
    }
]