[
    {
        "folio": 133,
        "fc": "Thu-Sep-2022 13:27",
        "random": "LNP0RP3DR9",
        "date": "010920221327",
        "title": "INICIA LA LIMPIEZA DE PANTEONES DE JEREZ DE CARA A LAS FESTIVIDADES DEL 2 DE NOVIEMBRE",
        "note": "<blockquote>Personal de <b>Parques y Jardines corta<\/b> y retira la maleza en el Pante\u00f3n-Museo de Dolores<br>Se programa atenci\u00f3n peri\u00f3dica durante estos dos meses sin descuidar las \u00e1reas verdes.<\/blockquote><p>Jerez, Zac. Personal del \u00e1rea de Parques y Jardines. del Ayuntamiento que encabeza el alcalde Jos\u00e9 Humberto Salazar Contreras, inici\u00f3 los trabajos de limpieza en el Pante\u00f3n-Museo de Dolores, como parte de la programaci\u00f3n de actividades que desarrolla en forma peri\u00f3dica la Subdirecci\u00f3n de Servicios P\u00fablicos Municipales.<\/p><p>Se estima que los trabajos para cortar y retirar la maleza acumulada en este lugar tardar\u00e1n aproximadamente una semana comenzando por el primer cuadro que comprende los andadores de lo que es el recorrido tur\u00edstico y posteriormente el resto del inmueble.<\/p><p>De igual manera, el responsable de Servicios P\u00fablicos Jos\u00e9 Manuel Garc\u00eda dio a conocer que est\u00e1 programada la atenci\u00f3n al resto de los panteones, a dos meses de la conmemoraci\u00f3n del D\u00eda de Difuntos, por lo que, a partir de la fecha, se considera trabajar dos d\u00edas por semana en los mismos, de manera permanente, con el objeto de que est\u00e9n en buenas condiciones para la festividad mencionada que es cuando se registra la mayor cantidad de visitantes.<\/p><p>Con esta planeaci\u00f3n, se busca tambi\u00e9n no descuidar el resto de las \u00e1reas verdes del municipio, puesto que el tipo de trabajo principal que en este tiempo se requiere en los cementerios es el retiro de la hierba que durante la etapa de lluvias crece considerablemente y quien efect\u00faa este tipo de acciones es el personal de Parques y Jardines.<\/p>",
        "foto1": "img_1_LNP0RP3DR9_010920221327.PNG",
        "foto2": "img_2_LNP0RP3DR9_010920221327.PNG",
        "portada": 0
    }
]