[
    {
        "folio": 229,
        "fc": "Mon-Nov-2022 12:01",
        "random": "K4CJIJDUAQ",
        "date": "141120221201",
        "title": "TARDE DE BUENA M\u00daSICA CON EL CUARTETO DE CUERDAS ALDEBAR\u00c1N Y EL GUITARRISTA CARLOS MART\u00cdN V\u00c1ZQUEZ",
        "note": "<blockquote>-\tEngalanaron el escenario de los Domingos Familiares en el edificio Alk\u00e1zar<\/blockquote><p>Jerez, Zac.- El Cuarteto de Cuerdas Aldebar\u00e1n llen\u00f3 de armon\u00eda la antigua casona conocida como edificio Alk\u00e1zar, sede del Instituto Jerezano de Cultura (IJC), durante la celebraci\u00f3n de los Domingos Familiares, proyecto del Ayuntamiento que encabeza el doctor Jos\u00e9 Humberto Salazar Contreras.<\/p><p>En un evento auspiciado por el gobierno municipal de Jerez, el Instituto Zacatecano de Cultura (IZC) y el IJC, la agrupaci\u00f3n zacatecana present\u00f3 su concierto denominado Traves\u00eda, en el que sus integrantes, Daniel Alejandro de la Torre Reveles, viol\u00edn primero, Fabi\u00e1n Rivas de Santiago, viol\u00edn segundo, Jorge Alberto Gonz\u00e1lez Mora en la viola y Nohem\u00ed Jim\u00e9nez en el violonchelo, regalaron 50 minutos de buena m\u00fasica al p\u00fablico que se congreg\u00f3 en este patio t\u00edpico jerezano y a muchos que lo disfrutaron a trav\u00e9s de las redes sociales; como artista invitado, se sum\u00f3 el guitarrista Carlos Mart\u00edn V\u00e1zquez D\u00edaz.<\/p><p>El programa consisti\u00f3 en la ejecuci\u00f3n de las obras La vida no es muy seria en sus cosas, de \u00d3scar Alcal\u00e1; Las presencias N\u00famero 6 \u201cJeromita Linares\u201d de Carlos Guastavino y el cierre con el Quinteto en Re Mayor de Luigi Bocherini.<\/p><p>Al realizar la entrega del reconocimiento a los participantes, el director del IJC V\u00edctor Hugo Hu\u00edzar Iturriaga agradeci\u00f3 la participaci\u00f3n y calific\u00f3 como una magistral presentaci\u00f3n con la que engalanaron el escenario de Domingos Familiares; dijo que con esta m\u00fasica cl\u00e1sica y barroca, los asistentes pudieron evocar diferentes atm\u00f3sferas, como temas de pel\u00edculas. Fue enf\u00e1tico en el profesionalismo mostrado por los cinco m\u00fasicos provenientes de Zacatecas y Aguascalientes.<\/p>",
        "foto1": "img_1_K4CJIJDUAQ_141120221201.PNG",
        "foto2": "img_2_K4CJIJDUAQ_141120221201.PNG",
        "portada": 0
    }
]