[
    {
        "folio": 7,
        "fc": "Thu-Oct-2021 14:07",
        "random": "LXFNRXUZ0N",
        "date": "141020211407",
        "title": "BUSCA ACTUAL ADMINISTRACI\u00d3N DE JEREZ INSTRUMENTOS DE PAGO PARA ADEUDOS DE LA FERIA DE PRIMAVERA 2020",
        "note": "<blockquote>Ante la inquietud expresada a este Ayuntamiento, por parte de personas que en su momento hicieron el pago de tapancos para la Feria de Primavera 2020 y que, tras su cancelaci\u00f3n, no recibieron el reembolso de la cantidad que erogaron para dicho servicio, se les hace la invitaci\u00f3n a que acudan a la Secretar\u00eda de Gobierno Municipal y presenten su recibo de pago y el contrato respectivo.<\/blockquote><p><br><\/p><p>Esto es con el objetivo de estructurar una base de datos de los afectados y promover, ante las instancias respectivas, un procedimiento de investigaci\u00f3n correspondiente para encontrar soluci\u00f3n al adeudo de estos montos. A pesar de que la actual administraci\u00f3n no adquiri\u00f3 esta deuda, busca solidarizarse con los afectados y ayudarlos a formar mecanismos para que su dinero sea reintegrado. <\/p><p><br><\/p><p>A fin de resarcir los da\u00f1os a la econom\u00eda de los contratantes de la forma m\u00e1s expedita posible, se les solicita que se presenten personalmente con los documentos mencionados, en horario de 8:30 a 15:00 horas, en la citada secretar\u00eda. Con la intensi\u00f3n de agilizar estos procedimientos, el periodo para recepci\u00f3n de documentos cierra el mi\u00e9rcoles 20 de octubre del a\u00f1o en curso.<\/p>",
        "foto1": "img_1_LXFNRXUZ0N_141020211407.PNG",
        "foto2": null,
        "portada": 0
    }
]