[
    {
        "folio": 125,
        "fc": "Tue-Aug-2022 10:24",
        "random": "D0TDTW8EOY",
        "date": "020820221024",
        "title": "LA FIESTA M\u00c1S MEXICANA REUNE A LOS PAISANOS EN EL TORNEO NACIONAL CHARRO JEREZ CAPITAL MIGRANTE",
        "note": "<p>Jerez, Zac.- El presidente Jos\u00e9 Humberto Salazar Contreras salud\u00f3 a la familia charra de M\u00e9xico y Estados Unidos, en el Torneo Jerez Capital Migrante, que por vez primera se lleva cabo en el Lienzo Charro Pokar de Ases, donde el mun\u00edcipe confirm\u00f3 que a partir de este 2022, qued\u00f3 instituido por el Cabildo, el primer d\u00eda del mes de agosto como D\u00eda del Migrante, un reconocimiento a los paisanos que se encuentran de aquel lado de la frontera y que, a pesar de la distancia, mantienen el arraigo y el amor por su tierra.<\/p><p>Acompa\u00f1ado de su esposa la presidenta honor\u00edfica del Sistema Municipal DIF Bertha Alicia Garc\u00eda Duarte y en presencia del presidente de la Uni\u00f3n de Asociaciones Charras del estado de Zacatecas Victoriano Maldonado Ibarra, el doctor Salazar encabez\u00f3 la ceremonia inaugural, en la que tambi\u00e9n estuvieron presentes los integrantes del comit\u00e9 organizador, Alicia de la Cruz Miranda, Jorge Acevedo, Rafael Cabral y Miguel Escamilla.<\/p><p>El Torneo Charro Migrante se program\u00f3 en tres competencias de alto nivel, por la ma\u00f1ana los equipos El Jerezano de Nebraska, Charros de la Loma de USA y Selecci\u00f3n Jerez; previo a la segunda competencia se dio paso a la ceremonia protocolaria y los honores de ordenanza, para el inicio de la competencia entre los Tres Potrillos de Jalisco, El Soyate de Pepe Aguilar, Charro 1 Wear de California y la escaramuza Jerezana de California. En la tercera corresponde a Rancho las Cuatas, Nayarit; Charros de la Laguna A de Durango y El Pitayo de Quer\u00e9taro, con la intervenci\u00f3n de Finca Acevedo de California.<\/p><p>Ambiente de primera en el Lienzo Charro Pokar de Ases con una gran cantidad de p\u00fablico que disfrutaron las competencias en un digno escenario para charreadas y escaramuzas de alto nivel, en el marco de la primera Semana del Migrante.<\/p>",
        "foto1": "img_1_D0TDTW8EOY_020820221024.PNG",
        "foto2": "img_2_D0TDTW8EOY_020820221024.PNG",
        "portada": 0
    }
]