[
    {
        "folio": 286,
        "fc": "Tue-Jan-2023 13:54",
        "random": "Z445V57P0Z",
        "date": "170120231354",
        "title": "OBRAS Y SERVICIOS P\u00daBLICOS DE JEREZ REHABILITAN DRENAJES DE LA ERMITA DE GUADALUPE",
        "note": "<blockquote>La Direcci\u00f3n de Obras y Servicios P\u00fablicos de Jerez,  alineados al proyecto de infraestructura del Ayuntamiento, bajo la supervisi\u00f3n del director Alfredo Mar\u00edn, llev\u00f3 a cabo, en la Ermita de Guadalupe, trabajos de rehabilitaci\u00f3n de drenaje. <\/blockquote><p>Las obras iniciaron en la calle San Jos\u00e9, posteriormente se realizaron labores en el alcantarillado en la calle del Durazno y, finalmente, se hizo la ampliaci\u00f3n de drenaje en la calle Felipe \u00c1ngeles.<\/p><p>Los trabajos se realizaron por instrucciones del Presidente municipal Dr. Humberto Salazar Conteras, quien atendi\u00f3 la solicitud de los vecinos y, de esta manera, ahora son beneficiados cerca de 300 habitantes de esta comunidad.<\/p>",
        "foto1": "img_1_Z445V57P0Z_170120231354.PNG",
        "foto2": "img_2_Z445V57P0Z_170120231354.PNG",
        "portada": 0
    }
]