[
    {
        "folio": 1,
        "fc": "Wed-Oct-2021 14:25",
        "random": "SFP8PN90M6",
        "date": "131020211425",
        "title": "JEREZ REGRESA A CLASES CON RESPONSABILIDAD SANITARIA: HUMBERTO SALAZAR",
        "note": "<blockquote><p>Como m\u00e9dico tengo un juramento hipocr\u00e1tico que tambi\u00e9n ejercer\u00e9 como presidente municipal<\/p><\/blockquote><p>Coment\u00f3 el alcalde de Jerez Humberto Salazar Contreras al realizar la entrega de Kits de Limpieza para el sector educativo que regresa a clases presenciales durante este per\u00edodo escolar en etapa de sem\u00e1foro verde. Fue en el edificio Alk\u00e1zar donde se hizo la entrega simb\u00f3lica de los paquetes, destacando que la salud de los y las jerezanas es una prioridad para la actual administraci\u00f3n.<\/p><p>Finalmente, el alcalde reconoci\u00f3 el esfuerzo sobrehumano que los docentes han puesto para adaptarse a los retos de las clases a distancia pues, \\\"su vocaci\u00f3n magisterial ha permitido que, pese al distanciamiento, la formaci\u00f3n de nuestros j\u00f3venes no se detenga\\\", coment\u00f3 tras refrendar el compromiso con la salud de los estudiantes y docentes con total responsabilidad sanitaria.<\/p><h2>#ReactivandoJerez<\/h2>",
        "foto1": "img_1_SFP8PN90M6_131020211425.PNG",
        "foto2": "img_2_SFP8PN90M6_131020211425.PNG",
        "portada": 0
    }
]