[
    {
        "folio": 18,
        "fc": "Mon-Oct-2021 12:07",
        "random": "GHEQIHS8XX",
        "date": "251020211207",
        "title": "LA PRESIDENCIA MUNICIPAL DE JEREZ SE VISTE DE ROSA EN LA LUCHA CONTRA EL C\u00c1NCER DE MAMA ",
        "note": "<p>En conmemoraci\u00f3n del D\u00eda Mundial de Lucha Contra el C\u00e1ncer de Mama, el H. Ayuntamiento de Jerez, presidido por el doctor Humberto Salazar Contreras, convoc\u00f3 a una marcha para la concientizaci\u00f3n sobre esta enfermedad. Dicho evento, coordinado por Sistema Municipal DIF de Jerez, concluy\u00f3 con la iluminaci\u00f3n conmemorativa del edificio de la presidencia municipal. <\/p><p>En su mensaje, la presidenta honorifica del SMDIF, Bertha Alicia Garc\u00eda Duarte, recalc\u00f3 que este padecimiento no discrimina raza, edad o clase social y, por tanto, es imperativo construir una cultura de la prevenci\u00f3n para luchar contra este mal oncol\u00f3gico. Por su parte, secretario de Gobierno Marco Vargas Duarte plante\u00f3 que el Mes Rosa tiene tres objetivos esenciales: \u201cla promoci\u00f3n de la salud para una detecci\u00f3n precoz; el diagn\u00f3stico oportuno; y la atenci\u00f3n integral del c\u00e1ncer de mama\u201d.<\/p><p>La presidenta honor\u00edfica del DIF enfatiz\u00f3 que este tipo de c\u00e1ncer es el m\u00e1s com\u00fan, as\u00ed como una de las principales causas de muerte entre mujeres, por ello es responsabilidad de los gobiernos crear los mecanismos, as\u00ed como instrumentos accesibles a todas las jerezanas para poder realizar detecciones tempranas, que reduzcan, todo lo posible, el \u00edndice de mortalidad. <\/p><p>De igual manera, el secretario de Gobierno aprovech\u00f3 la oportunidad para reconocer \u201cincansable trabajo de las espectaculares y admirables mujeres que luchan a diario por la salud de las jerezanas\u201d, celebrando todo el empe\u00f1o puesto a lo largo de este Mes Rosa y en esta Campa\u00f1a que busca crear conciencia sobre una enfermedad que padecer\u00e1 1 de cada 8 mujeres a lo largo de su vida.<\/p><p>Se concluy\u00f3 mencionando la importancia del compromiso social necesario para afrontar las causas y consecuencias de este padecimiento. Recalcando, tambi\u00e9n, lo fundamental de involucrar a toda la poblaci\u00f3n en esta lucha, ya que \u201cs\u00f3lo con un esfuerzo colectivo poder dar esta batalla para salvar vidas<\/p>",
        "foto1": "img_1_GHEQIHS8XX_251020211207.PNG",
        "foto2": "img_2_GHEQIHS8XX_251020211207.PNG",
        "portada": 0
    }
]