[
    {
        "folio": 240,
        "fc": "Mon-Nov-2022 12:29",
        "random": "YPOG5UDMVW",
        "date": "141120221229",
        "title": "DIF DE JEREZ SE SOLIDARIZA CON MUNICIPIOS PARA SOLUCIONAR SUS NECESIDADES PRIORITARIAS ",
        "note": "<blockquote>A fin de solidarizarse con las necesidades prioritarias de municipios colindantes y lograr un hermanamiento con ellos, el DIF de Jerez don\u00f3 aparatos ortop\u00e9dicos al DIF de Calera.<\/blockquote><p>La presidenta del DIF Municipal, Bertha Alicia Garc\u00eda Duarte, hizo la entrega de una gr\u00faa hospitalaria al alcalde de Calera, \u00c1ngel Gerardo Hern\u00e1ndez V\u00e1zquez, y a la presidenta de su Sistema DIF, Yolanda Delgado, tomando en cuenta la gran necesidad que ten\u00edan de contar con el aparato.<\/p><p>Debido al caso urgente en el que ser\u00e1 usada y la antig\u00fcedad con que la ven\u00edan solicitando, el DIF de Jerez decidi\u00f3 traspasar a dicho municipio una de las gr\u00faas hospitalarias que forman parte del inventario recibido por clubes migrantes.<\/p><p>Con esta acci\u00f3n, el gobierno jerezano muestra una vez m\u00e1s su voluntad de ayudar a solucionar problem\u00e1ticas apremiantes de la demarcaci\u00f3n y la regi\u00f3n, y de mejorar la calidad de vida de zacatecanos en situaci\u00f3n de alta vulnerabilidad.<\/p>",
        "foto1": "img_1_YPOG5UDMVW_141120221229.PNG",
        "foto2": "img_2_YPOG5UDMVW_141120221229.PNG",
        "portada": 0
    }
]