[
    {
        "folio": 274,
        "fc": "Thu-Dec-2022 15:03",
        "random": "DT8R2RAIO7",
        "date": "081220221503",
        "title": "SEGURIDAD P\u00daBLICA DE JEREZ LLAMA A LA POBLACI\u00d3N A SU CAMPA\u00d1A ANUAL DE REGALA UNA SONRISA Y DONA UN JUGUETE  ",
        "note": "<blockquote>-La campa\u00f1a estar\u00e1 activa hasta el pr\u00f3ximo 5 de enero.<\/blockquote><p>Jerez, Zac.- Esta semana, en el jard\u00edn frente al portal Inguanzo, se dio inicio a la campa\u00f1a anual, organizada por el departamento de Prevenci\u00f3n del Delito y la Violencia de la direcci\u00f3n de Seguridad P\u00fablica Municipal, titulada  \u201cRegala una sonrisa y dona un juguete\u201d. \u00c9sta tiene como objetivo el acopio de juguetes donados por la ciudadan\u00eda que no inciten a la violencia y no requieran bater\u00edas, de igual manera los integrantes del departamento brindan informaci\u00f3n a la ciudadan\u00eda acerca  de la prevenci\u00f3n de extorsiones telef\u00f3nicas as\u00ed como la el programa Mujer Segura y las l\u00edneas de atenci\u00f3n.<\/p><p>Es por ello que invitan a la ciudadan\u00eda en general a unirse a esta campa\u00f1a con el fin de compartir alegr\u00eda a ni\u00f1os jerezanos de escasos recursos. Estar\u00e1 vigente hasta el pr\u00f3ximo 5 de enero, los juguetes que pueden ser usados en buen estado o nuevos, que no sean b\u00e9licos ni usen pilas,  mismos que se estar\u00e1n recibiendo en el stand colocado en el jard\u00edn principal frente al portal Inguanzo; las donaciones ser\u00e1n entregadas en colonias de escasos recursos por el personal de la direcci\u00f3n.<\/p><p>Asimismo, dentro del m\u00f3dulo se est\u00e1 brindando orientaci\u00f3n a la cuidada acerca del programa Mujer Segura, prevenci\u00f3n de extorsi\u00f3n en llamadas telef\u00f3nicas y c\u00f3mo actuar ante esos casos, as\u00ed como el uso de las l\u00edneas de atenci\u00f3n para emergencias como el 911, el 494949450269 que es otra l\u00ednea directa y para denuncias v\u00eda whatsapp 4941168640.<\/p>",
        "foto1": "img_1_DT8R2RAIO7_081220221503.PNG",
        "foto2": "img_2_DT8R2RAIO7_081220221503.PNG",
        "portada": 0
    }
]