[
    {
        "folio": 38,
        "fc": "Mon-Dec-2021 13:02",
        "random": "CUK1NWDW33",
        "date": "201220211302",
        "title": "EMOTIVO DESFILE DE NAVIDAD PROTAGONIZARON LOS DIVERSOS DEPARTAMENTOS DE LA ADMINISTRACI\u00d3N MUNICIPAL",
        "note": "<blockquote>El alcalde Jos\u00e9 Humberto Salazar Contreras y su esposa Bertha Alicia Garc\u00eda Duarte presenciaron este domingo el Desfile Navide\u00f1o que organiz\u00f3 el Sistema Municipal DIF, con el apoyo de los diversos departamentos de la Presidencia Municipal y la Preparatoria V de la Universidad Aut\u00f3noma de Zacatecas (UAZ).<\/blockquote><p>Alegor\u00edas que ilustraban diversos momentos acordes con la tradici\u00f3n navide\u00f1a y diversos s\u00edmbolos de la fiesta, tanto a nivel nacional como internacional, se presentaron durante el recorrido apreciado por miles de personas que se ubicaron a lo largo del trayecto, que inici\u00f3 en la Glorieta Garc\u00eda Salinas y concluy\u00f3 en el Puente del R\u00edo Grande.<\/p><p>El contingente fue encabezado por la Direcci\u00f3n de Seguridad P\u00fablica Municipal (DSPM) y la banda de M\u00fasica Candelario Hu\u00edzar, para dar paso a los veh\u00edculos adornados para la ocasi\u00f3n, el cami\u00f3n de Bomberos que en la parte superior llevaba al personaje de Santa Claus, el Instituto Jerezano de Cultura que represent\u00f3 el pasaje de la Anunciaci\u00f3n, luego la Unidad de Protecci\u00f3n Civil Municipal que mostraron el s\u00edmbolo de la estrella.<\/p><p>El Instituto de la Mujer Jerezana (INMUJE) coordin\u00f3 la personificaci\u00f3n de los tres Reyes Magos; la Direcci\u00f3n de Desarrollo Econ\u00f3mico y Social a los pastorcillos; mientras que el DIF municipal mont\u00f3 un gran nacimiento; a las \u00e1reas de Educaci\u00f3n, Instituto de la Juventud y el Deporte les correspondi\u00f3 simbolizar al diablo; el Sistema Municipal de Agua Potable y Alcantarillado con la huida a Egipto; el \u00e1rbol navide\u00f1o por parte de la Direcci\u00f3n de Obras P\u00fablicas y la pi\u00f1ata por parte del departamento de Alumbrado P\u00fablico.<\/p><p>A la marcha se sum\u00f3 tambi\u00e9n la preparatoria V de la Universidad Aut\u00f3noma de Zacatecas (UAZ), con la adaptaci\u00f3n de un colorido veh\u00edculo adaptado como trineo en el que Santa Claus preparaba los regalos, adem\u00e1s de bastoneras y diversos personajes; el cierre estuvo a cargo del departamento de Turismo, junto con la ambulancia de Protecci\u00f3n Civil y una patrulla de Seguridad P\u00fablica en la retaguardia.<\/p><p>En el palco especial el presidente Jos\u00e9 Humberto Salazar Contreras y su esposa estuvieron acompa\u00f1ados por regidores, directores y jefes de diversos departamentos del gobierno municipal. Simult\u00e1neamente, la pirotecnia se apreciaba en lo alto, complementando el toque de fiesta del Desfile Navide\u00f1o 2021.<\/p>",
        "foto1": "img_1_CUK1NWDW33_201220211302.PNG",
        "foto2": "img_2_CUK1NWDW33_201220211302.PNG",
        "portada": 0
    }
]