[
    {
        "folio": 70,
        "fc": "Tue-Apr-2022 09:46",
        "random": "VRWD4C8R4T",
        "date": "190420220946",
        "title": "INAUGURAN MUESTRA COLECTIVA DE ARTE DENTRO DEL PROGRAMA DE FERIA DE JEREZ",
        "note": "<blockquote> - Artistas locales exponen pintura, escultura y fotograf\u00eda en el Edificio Alk\u00e1zar. <\/blockquote><p>En el marco de las actividades culturales de la Feria de Primavera Jerez 2022, se inaugur\u00f3 una exposici\u00f3n colectiva de arte, con la tem\u00e1tica de los 450 a\u00f1os del poblamiento definitivo de Jerez y su fundaci\u00f3n, que consta de pintura, escultura y fotograf\u00eda, la cual se lleva a cabo en el edificio Alk\u00e1zar.<\/p><p>En representaci\u00f3n del alcalde Jos\u00e9 Humberto Salazar Contreras, el director del Instituto Jerezano de Cultura (IJC), Mart\u00edn Gerardo Luna Tumoine, conjuntamente, el presidente del Comit\u00e9 de Feria V\u00edctor Manuel de Santiago Gonz\u00e1lez, realizaron la apertura formal de la muestra en la que un grupo de jerezanos exponen algunos de sus trabajos que a final ser\u00e1n puestos a la venta en subasta.<\/p><p>La galer\u00eda se compone con artistas pl\u00e1sticos como Lidio Pinedo, <b>Ra\u00fal Rodr\u00edgue<\/b>z, Juan \u00c1vila, Abd\u00f3n Pinedo, Jaquel\u00edn Gurrola, Antonio Carrillo, Eduardo de la Cruz, Elizabeth Ch\u00e1vez, Yanira Franco, Juan Carlos Garc\u00eda, V\u00edctor Iturriaga y Amparo Berumen.<\/p><p>Durante la ceremonia, el presidente del comit\u00e9 de Feria V\u00edctor Manuel de Santiago Gonz\u00e1lez agradeci\u00f3 al Instituto Jerezano de Cultura la organizaci\u00f3n de este evento que es importante para la celebraci\u00f3n de la fiesta de los jerezanos; asimismo, destac\u00f3 la participaci\u00f3n de los artistas, que son una muestra de que Jerez es un pueblo cultural, adem\u00e1s de un motivo de orgullo que el talento de muchos jerezanos pueda darse a conocer.<\/p><p>Por su parte, Gerardo Luna Tumoine dio la bienvenida a los expositores y su obra; afirm\u00f3 que la antigua casona que alberga la muestra es un \u00edcono del municipio y por ende un lugar estrat\u00e9gico y simb\u00f3lico para que artistas de Jerez expongan y reconoci\u00f3, una vez m\u00e1s, que en esta tierra hay mucho talento en todos los sentidos<\/p><p>La exposici\u00f3n estar\u00e1 abierta al p\u00fablico esta semana de lunes a viernes, con horario de 9:00 a 15:00 horas. El pr\u00f3ximo lunes 25 a las 18 horas, se llevar\u00e1 a cabo la subasta en la que, de acuerdo con el coordinador y subdirector del IJC V\u00edctor Hugo Hu\u00edzar Iturriaga, se pondr\u00e1n a la venta los trabajos de la exposici\u00f3n y se invitar\u00e1 a otros artistas m\u00e1s.<\/p>",
        "foto1": "img_1_VRWD4C8R4T_190420220946.PNG",
        "foto2": "img_2_VRWD4C8R4T_190420220946.PNG",
        "portada": 0
    }
]