[
    {
        "folio": 114,
        "fc": "Fri-Jul-2022 15:10",
        "random": "YOKE1RFXFQ",
        "date": "220720221510",
        "title": "Constancia de la visita de la obra y la junta de aclaraciones: Rehabilitaci\u00f3n del Domo del Espacio Multideportivo Gimnasio Genaro Borrego Estrada, Jerez, Zacatecas",
        "note": "<p>Constancia de la visita de la obra y la junta de aclaraciones: Rehabilitaci\u00f3n del Domo del Espacio Multideportivo Gimnasio Genaro Borrego Estrada, Jerez, Zacatecas MJE2022\/04<\/p>",
        "foto1": "img_1_YOKE1RFXFQ_220720221510.PNG",
        "foto2": "img_2_YOKE1RFXFQ_220720221510.PNG",
        "portada": 0
    }
]