[
    {
        "folio": 199,
        "fc": "Fri-Oct-2022 15:21",
        "random": "NLZB1I91VG",
        "date": "211020221521",
        "title": "ACUERDA ALCALDE HUMBERTO SALAZAR ACCIONES DE MEJORAMIENTO EN SECUNDARIAS JEREZANAS  ",
        "note": "<blockquote>La ma\u00f1ana de este martes el presidente municipal de Jerez, el doctor Humberto Salazar Contreras recibi\u00f3 a representantes de dos escuelas de nivel secundaria, para escuchar las peticiones del plantel docente, as\u00ed como de la comunidad estudiantil de dichas instituciones educativas. <\/blockquote><p>Con la Telesecundaria Rosendo Guerrero, a solicitud de directivos y padres de familia, se acord\u00f3 buscar un espacio m\u00e1s amplio para los alumnos, pues, con los que se cuentan actualmente no permiten actividades f\u00edsicas, al aire libre, adem\u00e1s de estar sobrepasadas en t\u00e9rminos de matr\u00edcula.<\/p><p>Por su parte, los estudiantes de la Secundaria Federal Constituyentes de 1917 solicitaron la pavimentaci\u00f3n de las vialidades en la que se encuentra su escuela, esto a fin de facilitar el acceso al plantel, evitar accidentes y encharcamientos. <\/p><p>El doctor Salazar se comprometi\u00f3 a dar soluci\u00f3n a ambas peticiones, dado que el mejoramiento de las condiciones educativos del municipio tiene una alta prioridad en su proyecto de gobierno.<\/p>",
        "foto1": "img_1_NLZB1I91VG_211020221521.PNG",
        "foto2": "img_2_NLZB1I91VG_211020221521.PNG",
        "portada": 0
    }
]