[
    {
        "folio": 242,
        "fc": "Mon-Nov-2022 12:30",
        "random": "COI1WNQ9RB",
        "date": "141120221230",
        "title": "EL COLEGIO DE BACHILLERES DE LA ERMITA DE GUADALUPE ES PARTE DE LA HISTORIA Y PILAR DE NUESTRO PRESENTE: DOCTOR SALAZAR",
        "note": "<blockquote>-\tEncabez\u00f3 el alcalde el festejo por los 35 a\u00f1os de la instituci\u00f3n que ha sido factor de desarrollo en la juventud<br>Jerez, Zac.- El Colegio de Bachilleres de la Ermita de Guadalupe es parte de nuestra historia, es un pilar de nuestro presente y es una herramienta cargada de mucho futuro, asegur\u00f3 el presidente Jos\u00e9 Humberto Salazar Contreras, en el marco de la celebraci\u00f3n por los 35 a\u00f1os de vida de este plantel educativo.<\/blockquote><p>Con este objetivo, se desarroll\u00f3 un evento en la plaza c\u00edvica de la instituci\u00f3n, donde se congregaron autoridades municipales, de la Direcci\u00f3n de Colegios de Bachilleres en el estado, directivos de instituciones educativas de ese lugar y secundarias de la ciudad, padres de familia, exalumnos, alumnos, maestros y personal de la instituci\u00f3n, para recordar parte de la historia que inici\u00f3 el a\u00f1o de 1987.<\/p><p>En su oportunidad, el doctor Salazar celebr\u00f3 que la instituci\u00f3n siga creciendo con el apoyo y trabajo de todo el personal y afirm\u00f3 que el Colegio de Bachilleres, durante 35 a\u00f1os, ha sido un factor educativo en el desarrollo de las y los j\u00f3venes; ha formado personas con visi\u00f3n y talento, en un espacio de ense\u00f1anza que ha dado a Jerez una larga lista de hombres y mujeres que han hecho valiosos aportes a la vida p\u00fablica del municipio.<\/p><p>El director C\u00e9sar Gonz\u00e1lez Marcial record\u00f3 que, en 1987, el Colegio de Bachilleres de Ermita de Guadalupe surgi\u00f3 como un crisol de distintas realidades sociales, que recibi\u00f3 a j\u00f3venes de Tepetongo, Susticac\u00e1n y naturalmente de Jerez y entre esos muros est\u00e1 la memoria de miles de alumnos, formados desde estas aulas, como buenos ciudadanos, comprometidos con el entorno social, entre ellos cientos de profesionistas con trayectorias exitosas dentro de los distintos ramos, laborando aqu\u00ed y en el extranjero.<\/p><p>La conmemoraci\u00f3n se desarroll\u00f3 mediante un festival art\u00edstico y cultural, protagonizado por alumnos de esta escuela y como invitado el plantel del municipio de Morelos.<\/p><p>Entre los asistentes destac\u00f3 la presencia del representante de la Direcci\u00f3n de Colegios de Bachilleres Carlos Espino Salazar, los regidores y exalumnos Jackie Ultreras y Luis Mario Mart\u00ednez Aparicio; la coordinadora municipal de Educaci\u00f3n Mar\u00eda Esther Ibarra Guzm\u00e1n, el titular de Atenci\u00f3n Ciudadana Josafat de la Torre Pinedo, el delegado municipal Jos\u00e9 \u00c1ngel Soriano Garc\u00eda, directores de preescolar, primaria y secundaria en la poblaci\u00f3n, la sociedad de padres de familia y un grupo de exalumnos.<\/p>",
        "foto1": "img_1_COI1WNQ9RB_141120221230.PNG",
        "foto2": "img_2_COI1WNQ9RB_141120221230.PNG",
        "portada": 0
    }
]