[
    {
        "id" : "cuartos",
        "type" : "integer",
        "name" : "Cuartos",
        "icon" : "fas fa-cube"
    },
    {
        "id" : "jacuzzi",
        "type" : "boolean",
        "name" : "Jacuzzi",
        "icon" : "fas fa-hot-tub"
    },
    {
        "id" : "air",
        "type" : "boolean",
        "name" : "Aire Acondicionado",
        "icon" : "fas fa-wind"
    },
    {
        "id" : "jardin",
        "type" : "boolean",
        "name" : "Jardin Delantero",
        "icon" : "fas fa-tree"
    },
    {
        "id" : "trasero",
        "type" : "boolean",
        "name" : "Jardin Trasero",
        "icon" : "fas fa-tree"
    },
    {
        "id" : "banos",
        "type" : "integer",
        "name" : "# Baños",
        "icon" : "fas fa-bath"
    },
    {
        "id" : "chimenea",
        "type" : "boolean",
        "name" : "Chimenea",
        "icon" : "fas fa-fire-alt"
    },
    {
        "id" : "cochera",
        "type" : "integer",
        "name" : "# Autos",
        "icon" : "fas fa-car-side"
    },
    {
        "id" : "piscina",
        "type" : "boolean",
        "name" : "Piscina",
        "icon" : "fas fa-swimmer"
    },
    {
        "id" : "terraza",
        "type" : "boolean",
        "name" : "Terraza",
        "icon" : "fas fa-person-booth"
    },
    {
        "id" : "balcon",
        "type" : "boolean",
        "name" : "Balcon",
        "icon" : "fab fa-microsoft"
    },
    {
        "id" : "seguridad",
        "type" : "boolean",
        "name" : "Seguridad",
        "icon" : "fas fa-user-shield"
    },
    {
        "id" : "recepcion",
        "type" : "boolean",
        "name" : "Recepcion",
        "icon" : "fas fa-concierge-bell"
    },
    {
        "id" : "gimnasio",
        "type" : "boolean",
        "name" : "Gimnasio",
        "icon" : "fas fa-dumbbell"
    }
]
