{
    "menu-2" : [
        {
            "Dashboard" : "dashboard",
            "Reportes" : "reportes"
        }
    ],
    "menu-3" : [
        {
            "Dashboard" : "dashboard",
            "Referidos" : "referidos",
            "Reportes" : "reportes"
        }
    ],
    "menu-4" : [
        {
            "Dashboard" : "dashboard",
            "Clientes" : "clientes",
            "Vendedores" : "vendedores",
            "Reportes" : "reportes"
        }
    ],
    "menu-1" : [
        {
            "Dashboard" : "dashboard",
            "Clientes" : "clientes",
            "Vendedores" : "vendedores",
            "Reportes" : "reportes",
            "Plantilla" : "plantilla"
        }
    ]
}