[
    {
        "id": 0,
        "title": "Pinturas Don Pepe",
        "message": "Mucha pintura para la casa! HEY!",
        "services": "Hacemos de los hechos una realidad! Si se\u00f1or!! Hacemos de los hechos una realidad! Si se\u00f1or!! Hacemos de los hechos una realidad! Si se\u00f1or!! Hacemos de los hechos una realidad! Si se\u00f1or!! Hacemos de los hechos una realidad! Si se\u00f1or!!",
        "address": "Calle Logan #12 San Diego CA 921200"
    }
]