[
    {
        "id": "p7Q9sNwq",
        "creation": "2022-04-13 20:44:22",
        "modified": "2022-04-13 20:44:22",
        "title": "Pasillo",
        "message": "Pasillo que va para abajo  Proin molestie ante diam. Etiam luctus felis vel augue blandit lacinia. Nulla laoreet nisi non condimentum semper. Donec tempus tortor vehicula gravida semper. Ut mattis suscipit tincidunt. Aliquam erat volutpat. Quisque efficitur urna ipsum, non vehicula diam consectetur sed. Suspendisse posuere finibus mi ut dictum. Vestibulum ante ipsum primis in faucibus orci luctus et ultrices posuere cubilia curae; Class aptent taciti sociosqu ad litora torquent per conubia nostra, per inceptos himenaeos.\\r\\n\\r\\nDonec at nunc hendrerit, hendrerit lorem at, accumsan purus. Phasellus sit amet laoreet velit. Nunc pretium eros a diam interdum, et sodales quam eleifend. Phasellus justo eros, viverra eget dolor at, accumsan convallis diam. Mauris ut diam id enim tempus venenatis nec eget ipsum. Suspendisse potenti. Aenean non nisl id velit tristique posuere vitae ut ante. Morbi dui ipsum, molestie luctus tellus ut, egestas rutrum ante. Duis malesuada quam ultricies, condimentum lorem ut, vestibulum odio. Lorem ipsum dolor sit amet, consectetur adipiscing elit. Cras mattis ex sit amet ultrices finibus. Donec id molestie mi, nec efficitur odio. Curabitur suscipit felis libero, ut consectetur nisl pellentesque vitae. Integer malesuada elementum sem, sit amet luctus ipsum vestibulum in. ",
        "foto": "img_p7Q9sNwq.PNG",
        "portada": 1
    }
]