[
    {
        "id": "bzAVlhX1o",
        "flag": 3,
        "name": "fgh",
        "mail": "dfghd",
        "message": "fdfghdfgh",
        "date": "2022-04-14 15:52:14",
        "answer": "jghjfghj"
    },
    {
        "id": "8gDurkqAK",
        "flag": 3,
        "name": "cx",
        "mail": "vbxcvb",
        "message": "cxvbxcvb",
        "date": "2022-04-14 15:52:21",
        "answer": "gfhjfghjfghj"
    },
    {
        "id": "RaTs0upP1",
        "flag": 3,
        "name": "xcvb",
        "mail": "bcxvb",
        "message": "xcvbxcvb",
        "date": "2022-04-14 15:54:43",
        "answer": "Hoal"
    },
    {
        "id": "Vfgpx7PpE",
        "flag": 1,
        "name": "Hola soy nuevo",
        "mail": "Este es mi amail",
        "message": "hoasdfladsfladsfa sdf asdf asdf asdf ds",
        "date": "2022-04-14 15:57:29",
        "answer": "Hoaldlsdkjsdjkdas "
    },
    {
        "id": "NFHhEQ3g7",
        "flag": 3,
        "name": "mhgkgjhg",
        "mail": "jhgjhgjg",
        "message": "jhgjhgjh",
        "date": "2022-04-19 10:57:11",
        "answer": ""
    }
]