[
    {
        "id": "kGMwSPLFY25h",
        "flag": "1",
        "name": "asf",
        "poc": "asdf",
        "message": "asdfasdf",
        "date": "2022-05-27 17:27:42",
        "answer": ""
    }
]