[
    {
        "id": "e2MOdvwXEdio",
        "flag": 4,
        "name": "Roberto Valdez",
        "poc": "499494949",
        "message": "Heello, how are you? Great services!",
        "date": "2022-05-27 17:51:38",
        "answer": ""
    }
]