[
    {
        "id": "LTLN08nQ",
        "creation": "2022-04-21 14:49:26",
        "modified": "2022-04-21 14:49:26",
        "title": "Bathroom Interiors",
        "message": "We finely detail your amenities inside your home",
        "foto": "img_LTLN08nQ.PNG",
        "portada": 1
    }
]