[
    {
        "id": "JJtYXLEfNCI2",
        "flag": "1",
        "name": "Emminiela",
        "poc": "mail@mail.com",
        "message": "Bla bla bla blabla",
        "date": "2022-04-19 10:13:53",
        "answer": ""
    }
]