[
    {
        "id": "CYGfBqch7",
        "flag": 1,
        "name": "Beto",
        "mail": "bqt\u00e6@undfas.com",
        "message": "Hola soy un mensajito, mandame el pack",
        "date": "2022-04-15 13:38:43",
        "answer": "hOLA AHI TE VA!"
    }
]