[
    {
        "id": "LqbGBehI",
        "creation": "2022-04-21 14:50:40",
        "modified": "2022-04-21 14:50:40",
        "title": "Interior Bedroom",
        "message": "Great or small rooms, require the quality and fine detailing we can provide",
        "foto": "img_LqbGBehI.PNG",
        "portada": 1
    }
]