[
    {
        "id": "eD5dXIz6PJ61",
        "flag": "2",
        "name": "Betote",
        "poc": "mail@mail.com",
        "message": "Hola Beto, soy beto... otra ves!",
        "date": "2022-04-19 10:13:53",
        "answer": ""
    }
]