[
    {
        "id": "NoUJwJXQ",
        "creation": "2022-04-21 14:45:06",
        "modified": "2022-04-21 14:45:06",
        "title": "Interior Bathroom Detailing",
        "message": "Your bathrooms will look wonderful with the professional detailing we provide",
        "foto": "img_NoUJwJXQ.PNG",
        "portada": 1
    }
]