[
    {
        "id": "2E07Ul0n",
        "creation": "2022-04-13 20:26:27",
        "modified": "2022-04-13 20:26:27",
        "title": "Eso es un Logazon",
        "message": "Verdad? es un mega loco  Lorem ipsum dolor sit amet, consectetur adipiscing elit. Ut ultricies mauris sed nibh pretium, sed lobortis enim dictum. Pellentesque quis rhoncus est. Sed rutrum neque sed massa tempor, vitae lacinia nulla hendrerit. Nulla sed vulputate nisl. Cras eu tempus turpis. Fusce ex magna, fermentum in mattis non, vehicula et lectus. Orci varius natoque penatibus et magnis dis parturient montes, nascetur ridiculus mus. Curabitur placerat nisl in diam bibendum viverra. Etiam in enim mi. Praesent quam orci, elementum sit amet maximus vel, tempor ut ex. Nullam consequat bibendum nibh in cursus. Etiam tortor nisi, vulputate ac mi ut, sollicitudin sodales ipsum. Nunc vulputate urna sed dolor maximus eleifend. Morbi congue sodales orci sed dignissim. Vivamus vehicula felis non pulvinar sagittis.\\r\\n\\r\\nProin molestie ante diam. Etiam luctus felis vel augue blandit lacinia. Nulla laoreet nisi non condimentum semper. Donec tempus tortor vehicula gravida semper. Ut mattis suscipit tincidunt. Aliquam erat volutpat. Quisque efficitur urna ipsum, non vehicula diam consectetur sed. Suspendisse posuere finibus mi ut dictum. Vestibulum ante ipsum primis in faucibus orci luctus et ultrices posuere cubilia curae; Class aptent taciti sociosqu ad litora torquent per conubia nostra, per inceptos himenaeos. ",
        "foto": "img_2E07Ul0n.PNG",
        "portada": 1
    }
]