key_resp_Consent1.keys,key_resp_Consent1.rt,key_resp_Consent2.keys,key_resp_Consent2.rt,key_resp_Consent3.keys,key_resp_Consent3.rt,key_resp_2.keys,key_resp_2.rt,ConsentResponse.keys,ConsentResponse.rt,key_resp.keys,key_resp.rt,key_expIntroSpacebar.keys,key_expIntroSpacebar.rt,key_practiceIntroSpacebar.keys,key_practiceIntroSpacebar.rt,Rating.response,Rating.rt,PerceivedInput,practiceTrials.thisRepN,practiceTrials.thisTrialN,practiceTrials.thisN,practiceTrials.thisIndex,practiceTrials.ran,Word,Type,Soundfile,SoundfileOriginal,participant,Age,Gender,NativeLanguage,Country of Residence,date,expName,psychopyVersion,OS,frameRate,STUDY_ID,SESSION_ID,key_testIntroSpacebar.keys,key_testIntroSpacebar.rt,testTrials.thisRepN,testTrials.thisTrialN,testTrials.thisN,testTrials.thisIndex,testTrials.ran,List,stimuli,ClusterType,Onset,GrossStatus,NeighborhoodDensity,OriginalRating,ScholesJudgments,SourceStudy
space,0.525,space,1.131,space,1.267,space,1.389,y,2.068,space,1.516,space,1.748,space,4.801,3,8.407,twig,0,0,0,4,1,KLIHG,practice,audio/practice/KLIHG.practice.wav,practice/KLIHG.practice.wav,5f2c760dfff10e03206a686b,20,Female,English,United States,2020-09-07_14h28.11.092,Experiment1,2020.1.2,Win32,60,5f567f87b176470ae9507f22,5f5687a4e7b06a0d7ffada76,,,,,,,,,,,,,,,,
,,,,,,,,,,,,,,,,2.984126984,10.41,bible,0,1,1,0,1,BIHBL,practice,audio/practice/BIHBL.practice.wav,practice/BIHBL.practice.wav,5f2c760dfff10e03206a686b,20,Female,English,United States,2020-09-07_14h28.11.092,Experiment1,2020.1.2,Win32,60,5f567f87b176470ae9507f22,5f5687a4e7b06a0d7ffada76,,,,,,,,,,,,,,,,
,,,,,,,,,,,,,,,,6.96031746,4.685,zoinks,0,2,2,8,1,ZOYNKS,practice,audio/practice/ZOYNKS.practice.wav,practice/ZOYNKS.practice.wav,5f2c760dfff10e03206a686b,20,Female,English,United States,2020-09-07_14h28.11.092,Experiment1,2020.1.2,Win32,60,5f567f87b176470ae9507f22,5f5687a4e7b06a0d7ffada76,,,,,,,,,,,,,,,,
,,,,,,,,,,,,,,,,6.888888889,4.906,blue,0,3,3,9,1,PLUWT,practice,audio/practice/PLUWT.practice.wav,practice/PLUWT.practice.wav,5f2c760dfff10e03206a686b,20,Female,English,United States,2020-09-07_14h28.11.092,Experiment1,2020.1.2,Win32,60,5f567f87b176470ae9507f22,5f5687a4e7b06a0d7ffada76,,,,,,,,,,,,,,,,
,,,,,,,,,,,,,,,,3.103174603,7.189,zeen,0,4,4,2,1,BZIYN,practice,audio/practice/BZIYN.practice.wav,practice/BZIYN.practice.wav,5f2c760dfff10e03206a686b,20,Female,English,United States,2020-09-07_14h28.11.092,Experiment1,2020.1.2,Win32,60,5f567f87b176470ae9507f22,5f5687a4e7b06a0d7ffada76,,,,,,,,,,,,,,,,
,,,,,,,,,,,,,,,,5.055555556,7.705,wad,0,5,5,1,1,BWAAD,practice,audio/practice/BWAAD.practice.wav,practice/BWAAD.practice.wav,5f2c760dfff10e03206a686b,20,Female,English,United States,2020-09-07_14h28.11.092,Experiment1,2020.1.2,Win32,60,5f567f87b176470ae9507f22,5f5687a4e7b06a0d7ffada76,,,,,,,,,,,,,,,,
,,,,,,,,,,,,,,,,2.880952381,5.305,frendth,0,6,6,5,1,KREHNTH,practice,audio/practice/KREHNTH.practice.wav,practice/KREHNTH.practice.wav,5f2c760dfff10e03206a686b,20,Female,English,United States,2020-09-07_14h28.11.092,Experiment1,2020.1.2,Win32,60,5f567f87b176470ae9507f22,5f5687a4e7b06a0d7ffada76,,,,,,,,,,,,,,,,
,,,,,,,,,,,,,,,,5.055555556,4.239,slain,0,7,7,7,1,SLEYM,practice,audio/practice/SLEYM.practice.wav,practice/SLEYM.practice.wav,5f2c760dfff10e03206a686b,20,Female,English,United States,2020-09-07_14h28.11.092,Experiment1,2020.1.2,Win32,60,5f567f87b176470ae9507f22,5f5687a4e7b06a0d7ffada76,,,,,,,,,,,,,,,,
,,,,,,,,,,,,,,,,3.992063492,8.843,press,0,8,8,10,1,PREHSP,practice,audio/practice/PREHSP.practice.wav,practice/PREHSP.practice.wav,5f2c760dfff10e03206a686b,20,Female,English,United States,2020-09-07_14h28.11.092,Experiment1,2020.1.2,Win32,60,5f567f87b176470ae9507f22,5f5687a4e7b06a0d7ffada76,,,,,,,,,,,,,,,,
,,,,,,,,,,,,,,,,5,5.624,greed,0,9,9,3,1,GLIYD,practice,audio/practice/GLIYD.practice.wav,practice/GLIYD.practice.wav,5f2c760dfff10e03206a686b,20,Female,English,United States,2020-09-07_14h28.11.092,Experiment1,2020.1.2,Win32,60,5f567f87b176470ae9507f22,5f5687a4e7b06a0d7ffada76,,,,,,,,,,,,,,,,
,,,,,,,,,,,,,,,,4.111111111,5.454,lamb,0,10,10,6,1,LAHM,practice,audio/practice/LAHM.practice.wav,practice/LAHM.practice.wav,5f2c760dfff10e03206a686b,20,Female,English,United States,2020-09-07_14h28.11.092,Experiment1,2020.1.2,Win32,60,5f567f87b176470ae9507f22,5f5687a4e7b06a0d7ffada76,,,,,,,,,,,,,,,,
,,,,,,,,,,,,,,,,3.984126984,6.702,met,,,,,,,no,audio/stimuli/FMEHT_no.wav,,5f2c760dfff10e03206a686b,20,Female,English,United States,2020-09-07_14h28.11.092,Experiment1,2020.1.2,Win32,60,5f567f87b176470ae9507f22,5f5687a4e7b06a0d7ffada76,space,2.282,0,0,0,26,1,List1,FMEHT,fric/liquid,FM,invalid,2,bad,2,SCHOLES
,,,,,,,,,,,,,,,,3.071428571,9.475,straff,,,,,,,filler,audio/fillers/STRAEF.wav,,5f2c760dfff10e03206a686b,20,Female,English,United States,2020-09-07_14h28.11.092,Experiment1,2020.1.2,Win32,60,5f567f87b176470ae9507f22,5f5687a4e7b06a0d7ffada76,,,0,1,1,30,1,List1,STRAEF,fric/stop/liquid,STR,NA,NA,NA,NA,NA
,,,,,,,,,,,,,,,,3.182539683,6.127,tish,,,,,,,no,audio/stimuli/STIHSH_no.wav,,5f2c760dfff10e03206a686b,20,Female,English,United States,2020-09-07_14h28.11.092,Experiment1,2020.1.2,Win32,60,5f567f87b176470ae9507f22,5f5687a4e7b06a0d7ffada76,,,0,2,2,2,1,List1,STIHSH,fric/stop,ST,valid,9,good,33,SCHOLES
,,,,,,,,,,,,,,,,1,4.672,veneushe,,,,,,,full,audio/stimuli/VNUWSH_full.wav,,5f2c760dfff10e03206a686b,20,Female,English,United States,2020-09-07_14h28.11.092,Experiment1,2020.1.2,Win32,60,5f567f87b176470ae9507f22,5f5687a4e7b06a0d7ffada76,,,0,3,3,23,1,List1,VNUWSH,fric/nasal,VN,invalid,0,bad,1,SCHOLES
,,,,,,,,,,,,,,,,5.03968254,4.589,neuron,,,,,,,full,audio/stimuli/NRAANG_full.wav,,5f2c760dfff10e03206a686b,20,Female,English,United States,2020-09-07_14h28.11.092,Experiment1,2020.1.2,Win32,60,5f567f87b176470ae9507f22,5f5687a4e7b06a0d7ffada76,,,0,4,4,29,1,List1,NRAANG,nasal/liquid,NR,invalid,0,bad,8,SCHOLES
,,,,,,,,,,,,,,,,2.984126984,7.109,man,,,,,,,filler,audio/fillers/maent.wav,,5f2c760dfff10e03206a686b,20,Female,English,United States,2020-09-07_14h28.11.092,Experiment1,2020.1.2,Win32,60,5f567f87b176470ae9507f22,5f5687a4e7b06a0d7ffada76,,,0,5,5,53,1,List1,maent,nasal,M,NA,NA,NA,NA,ALBRIGHT/HAYESadapt
,,,,,,,,,,,,,,,,2.880952381,5.839,saph,,,,,,,filler,audio/fillers/SEHF.wav,,5f2c760dfff10e03206a686b,20,Female,English,United States,2020-09-07_14h28.11.092,Experiment1,2020.1.2,Win32,60,5f567f87b176470ae9507f22,5f5687a4e7b06a0d7ffada76,,,0,6,6,35,1,List1,SEHF,fric,S,NA,NA,NA,NA,NA
,,,,,,,,,,,,,,,,1.888888889,3.755,saff,,,,,,,filler,audio/fillers/SAEF.wav,,5f2c760dfff10e03206a686b,20,Female,English,United States,2020-09-07_14h28.11.092,Experiment1,2020.1.2,Win32,60,5f567f87b176470ae9507f22,5f5687a4e7b06a0d7ffada76,,,0,7,7,34,1,List1,SAEF,fric,S,NA,NA,NA,NA,NA
,,,,,,,,,,,,,,,,1.03968254,4.406,guron,,,,,,,full,audio/stimuli/GRAAN_full.wav,,5f2c760dfff10e03206a686b,20,Female,English,United States,2020-09-07_14h28.11.092,Experiment1,2020.1.2,Win32,60,5f567f87b176470ae9507f22,5f5687a4e7b06a0d7ffada76,,,0,8,8,1,1,List1,GRAAN,stop/liquid,GR,valid,13,good,33,SCHOLES
,,,,,,,,,,,,,,,,2.03968254,5.177,bweige,,,,,,,filler,audio/fillers/PWEYZH.wav,,5f2c760dfff10e03206a686b,20,Female,English,United States,2020-09-07_14h28.11.092,Experiment1,2020.1.2,Win32,60,5f567f87b176470ae9507f22,5f5687a4e7b06a0d7ffada76,,,0,9,9,46,1,List1,PWEYZH,stop/glide,PW,NA,NA,NA,NA,ALBRIGHTadapt
,,,,,,,,,,,,,,,,1.03968254,4.239,zon,,,,,,,filler,audio/fillers/bzaan.wav,,5f2c760dfff10e03206a686b,20,Female,English,United States,2020-09-07_14h28.11.092,Experiment1,2020.1.2,Win32,60,5f567f87b176470ae9507f22,5f5687a4e7b06a0d7ffada76,,,0,10,10,55,1,List1,bzaan,stop/fric,BZ,NA,NA,NA,NA,ALBRIGHT
,,,,,,,,,,,,,,,,3.142857143,5.222,furrow,,,,,,,full,audio/stimuli/FRUHL_full.wav,,5f2c760dfff10e03206a686b,20,Female,English,United States,2020-09-07_14h28.11.092,Experiment1,2020.1.2,Win32,60,5f567f87b176470ae9507f22,5f5687a4e7b06a0d7ffada76,,,0,11,11,5,1,List1,FRUHL,fric/liquid,FR,valid,3,good,29,SCHOLES
,,,,,,,,,,,,,,,,1.079365079,4.461,venish,,,,,,,no,audio/stimuli/VNIHSH_no.wav,,5f2c760dfff10e03206a686b,20,Female,English,United States,2020-09-07_14h28.11.092,Experiment1,2020.1.2,Win32,60,5f567f87b176470ae9507f22,5f5687a4e7b06a0d7ffada76,,,0,12,12,22,1,List1,VNIHSH,fric/nasal,VN,invalid,1,bad,1,SCHOLES
,,,,,,,,,,,,,,,,4,6.641,shall,,,,,,,no,audio/stimuli/FSHAEL_no.wav,,5f2c760dfff10e03206a686b,20,Female,English,United States,2020-09-07_14h28.11.092,Experiment1,2020.1.2,Win32,60,5f567f87b176470ae9507f22,5f5687a4e7b06a0d7ffada76,,,0,13,13,14,1,List1,FSHAEL,fric/fric,FSH,invalid,1,medium,11,SCHOLES
,,,,,,,,,,,,,,,,3.03968254,6.222,doil,,,,,,,filler,audio/fillers/choil.wav,,5f2c760dfff10e03206a686b,20,Female,English,United States,2020-09-07_14h28.11.092,Experiment1,2020.1.2,Win32,60,5f567f87b176470ae9507f22,5f5687a4e7b06a0d7ffada76,,,0,14,14,49,1,List1,choil,affric,CH,NA,NA,NA,NA,ALBRIGHT/HAYES
,,,,,,,,,,,,,,,,1.936507937,4.741,brun,,,,,,,no,audio/stimuli/VRAHN_no.wav,,5f2c760dfff10e03206a686b,20,Female,English,United States,2020-09-07_14h28.11.092,Experiment1,2020.1.2,Win32,60,5f567f87b176470ae9507f22,5f5687a4e7b06a0d7ffada76,,,0,15,15,10,1,List1,VRAHN,fric/liquid,VR,invalid,4,medium,19,SCHOLES
,,,,,,,,,,,,,,,,2.944444444,5.739,fatigue,,,,,,,full,audio/stimuli/FTEYT_full.wav,,5f2c760dfff10e03206a686b,20,Female,English,United States,2020-09-07_14h28.11.092,Experiment1,2020.1.2,Win32,60,5f567f87b176470ae9507f22,5f5687a4e7b06a0d7ffada76,,,0,16,16,17,1,List1,FTEYT,fric/stop,FT,invalid,4,medium,10,SCHOLES
,,,,,,,,,,,,,,,,1.96031746,4.101,satish,,,,,,,full,audio/stimuli/STIYSH_full.wav,,5f2c760dfff10e03206a686b,20,Female,English,United States,2020-09-07_14h28.11.092,Experiment1,2020.1.2,Win32,60,5f567f87b176470ae9507f22,5f5687a4e7b06a0d7ffada76,,,0,17,17,3,1,List1,STIYSH,fric/stop,ST,valid,9,good,33,SCHOLES
,,,,,,,,,,,,,,,,1,4.309,splurk,,,,,,,filler,audio/fillers/SPLERK.wav,,5f2c760dfff10e03206a686b,20,Female,English,United States,2020-09-07_14h28.11.092,Experiment1,2020.1.2,Win32,60,5f567f87b176470ae9507f22,5f5687a4e7b06a0d7ffada76,,,0,18,18,32,1,List1,SPLERK,fric/stop/liquid,SPL,NA,NA,NA,NA,NA
,,,,,,,,,,,,,,,,1,4.372,bwiz,,,,,,,filler,audio/fillers/PWIHZH.wav,,5f2c760dfff10e03206a686b,20,Female,English,United States,2020-09-07_14h28.11.092,Experiment1,2020.1.2,Win32,60,5f567f87b176470ae9507f22,5f5687a4e7b06a0d7ffada76,,,0,19,19,47,1,List1,PWIHZH,stop/glide,PW,NA,NA,NA,NA,ALBRIGTHadapt
,,,,,,,,,,,,,,,,2.944444444,4.188,guzz,,,,,,,filler,audio/fillers/guhz.wav,,5f2c760dfff10e03206a686b,20,Female,English,United States,2020-09-07_14h28.11.092,Experiment1,2020.1.2,Win32,60,5f567f87b176470ae9507f22,5f5687a4e7b06a0d7ffada76,,,0,20,20,51,1,List1,guhz,stop,GR,NA,NA,NA,NA,ALBRIGHT/HAYES
,,,,,,,,,,,,,,,,1.928571429,3.555,dinge,,,,,,,filler,audio/fillers/DEYNDH.wav,,5f2c760dfff10e03206a686b,20,Female,English,United States,2020-09-07_14h28.11.092,Experiment1,2020.1.2,Win32,60,5f567f87b176470ae9507f22,5f5687a4e7b06a0d7ffada76,,,0,21,21,40,1,List1,DEYNDH,stop,D,NA,NA,NA,NA,NA
,,,,,,,,,,,,,,,,4,6.356,femmet,,,,,,,full,audio/stimuli/FMEYT_full.wav,,5f2c760dfff10e03206a686b,20,Female,English,United States,2020-09-07_14h28.11.092,Experiment1,2020.1.2,Win32,60,5f567f87b176470ae9507f22,5f5687a4e7b06a0d7ffada76,,,0,22,22,27,1,List1,FMEYT,fric/liquid,FM,invalid,3,bad,2,SCHOLES
,,,,,,,,,,,,,,,,3.063492063,5.738,viped,,,,,,,filler,audio/fillers/VAIPT.wav,,5f2c760dfff10e03206a686b,20,Female,English,United States,2020-09-07_14h28.11.092,Experiment1,2020.1.2,Win32,60,5f567f87b176470ae9507f22,5f5687a4e7b06a0d7ffada76,,,0,23,23,38,1,List1,VAIPT,fric,V,NA,NA,NA,NA,NA
,,,,,,,,,,,,,,,,1.841269841,3.952,krog,,,,,,,filler,audio/fillers/KRAHLG.wav,,5f2c760dfff10e03206a686b,20,Female,English,United States,2020-09-07_14h28.11.092,Experiment1,2020.1.2,Win32,60,5f567f87b176470ae9507f22,5f5687a4e7b06a0d7ffada76,,,0,24,24,45,1,List1,KRAHLG,stop/liquid,KR,NA,NA,NA,NA,ALBRIGHT/HAYES
,,,,,,,,,,,,,,,,4.968253968,4.478,strept,,,,,,,filler,audio/fillers/STREHF.wav,,5f2c760dfff10e03206a686b,20,Female,English,United States,2020-09-07_14h28.11.092,Experiment1,2020.1.2,Win32,60,5f567f87b176470ae9507f22,5f5687a4e7b06a0d7ffada76,,,0,25,25,31,1,List1,STREHF,fric/stop/liquid,STR,NA,NA,NA,NA,NA
,,,,,,,,,,,,,,,,1.142857143,4.39,splick,,,,,,,filler,audio/fillers/SPLIHK.wav,,5f2c760dfff10e03206a686b,20,Female,English,United States,2020-09-07_14h28.11.092,Experiment1,2020.1.2,Win32,60,5f567f87b176470ae9507f22,5f5687a4e7b06a0d7ffada76,,,0,26,26,33,1,List1,SPLIHK,fric/stop/liquid,SPL,NA,NA,NA,NA,NA
,,,,,,,,,,,,,,,,1,3.358,sqisk,,,,,,,no,audio/stimuli/SKIHSH_no.wav,,5f2c760dfff10e03206a686b,20,Female,English,United States,2020-09-07_14h28.11.092,Experiment1,2020.1.2,Win32,60,5f567f87b176470ae9507f22,5f5687a4e7b06a0d7ffada76,,,0,27,27,12,1,List1,SKIHSH,fric/stop,SK,valid,8,medium,20,SCHOLES
,,,,,,,,,,,,,,,,3.888888889,6.909,cemment ,,,,,,,full,audio/stimuli/SMEYT_full.wav,,5f2c760dfff10e03206a686b,20,Female,English,United States,2020-09-07_14h28.11.092,Experiment1,2020.1.2,Win32,60,5f567f87b176470ae9507f22,5f5687a4e7b06a0d7ffada76,,,0,28,28,7,1,List1,SMEYT,fric/nasal,SM,valid,9,good,32,SCHOLES
,,,,,,,,,,,,,,,,1.03968254,5.023,bzin,,,,,,,filler,audio/fillers/bziyn.wav,,5f2c760dfff10e03206a686b,20,Female,English,United States,2020-09-07_14h28.11.092,Experiment1,2020.1.2,Win32,60,5f567f87b176470ae9507f22,5f5687a4e7b06a0d7ffada76,,,0,29,29,54,1,List1,bziyn,stop/fric,BZ,NA,NA,NA,NA,ALBRIGHT
,,,,,,,,,,,,,,,,2.031746032,5.58,zaquiche,,,,,,,full,audio/stimuli/SKIYSH_full.wav,,5f2c760dfff10e03206a686b,20,Female,English,United States,2020-09-07_14h28.11.092,Experiment1,2020.1.2,Win32,60,5f567f87b176470ae9507f22,5f5687a4e7b06a0d7ffada76,,,0,30,30,13,1,List1,SKIYSH,fric/stop,SK,valid,7,medium,20,SCHOLES
,,,,,,,,,,,,,,,,1,3.958,zappon,,,,,,,full,audio/stimuli/ZPAAN_full.wav,,5f2c760dfff10e03206a686b,20,Female,English,United States,2020-09-07_14h28.11.092,Experiment1,2020.1.2,Win32,60,5f567f87b176470ae9507f22,5f5687a4e7b06a0d7ffada76,,,0,31,31,21,1,List1,ZPAAN,fric/stop,ZP,invalid,3,bad,1,SCHOLES
,,,,,,,,,,,,,,,,1,3.99,zappun,,,,,,,no,audio/stimuli/ZPAHN_no.wav,,5f2c760dfff10e03206a686b,20,Female,English,United States,2020-09-07_14h28.11.092,Experiment1,2020.1.2,Win32,60,5f567f87b176470ae9507f22,5f5687a4e7b06a0d7ffada76,,,0,32,32,20,1,List1,ZPAHN,fric/stop,ZP,invalid,4,bad,1,SCHOLES
,,,,,,,,,,,,,,,,6.103174603,6.207,chore,,,,,,,filler,audio/fillers/chuwl.wav,,5f2c760dfff10e03206a686b,20,Female,English,United States,2020-09-07_14h28.11.092,Experiment1,2020.1.2,Win32,60,5f567f87b176470ae9507f22,5f5687a4e7b06a0d7ffada76,,,0,33,33,48,1,List1,chuwl,affric,CH,NA,NA,NA,NA,ALBRIGHT/HAYES
,,,,,,,,,,,,,,,,2.055555556,4.022,brun,,,,,,,no,audio/stimuli/GRAHN_no.wav,,5f2c760dfff10e03206a686b,20,Female,English,United States,2020-09-07_14h28.11.092,Experiment1,2020.1.2,Win32,60,5f567f87b176470ae9507f22,5f5687a4e7b06a0d7ffada76,,,0,34,34,0,1,List1,GRAHN,stop/liquid,GR,valid,18,good,33,SCHOLES
,,,,,,,,,,,,,,,,2.888888889,5.338,tat,,,,,,,no,audio/stimuli/FTEHT_no.wav,,5f2c760dfff10e03206a686b,20,Female,English,United States,2020-09-07_14h28.11.092,Experiment1,2020.1.2,Win32,60,5f567f87b176470ae9507f22,5f5687a4e7b06a0d7ffada76,,,0,35,35,16,1,List1,FTEHT,fric/stop,FT,invalid,2,medium,10,SCHOLES
,,,,,,,,,,,,,,,,1.103174603,4.158,murnt,,,,,,,filler,audio/fillers/mernt.wav,,5f2c760dfff10e03206a686b,20,Female,English,United States,2020-09-07_14h28.11.092,Experiment1,2020.1.2,Win32,60,5f567f87b176470ae9507f22,5f5687a4e7b06a0d7ffada76,,,0,36,36,52,1,List1,mernt,nasal,M,NA,NA,NA,NA,ALBRIGHT/HAYESadapt
,,,,,,,,,,,,,,,,1,4.189,lowon,,,,,,,full,audio/stimuli/VLAANG_full.wav,,5f2c760dfff10e03206a686b,20,Female,English,United States,2020-09-07_14h28.11.092,Experiment1,2020.1.2,Win32,60,5f567f87b176470ae9507f22,5f5687a4e7b06a0d7ffada76,,,0,37,37,19,1,List1,VLAANG,fric/liquid,VL,invalid,0,medium,14,SCHOLES
,,,,,,,,,,,,,,,,2.087301587,4.839,gaze,,,,,,,filler,audio/fillers/giyz.wav,,5f2c760dfff10e03206a686b,20,Female,English,United States,2020-09-07_14h28.11.092,Experiment1,2020.1.2,Win32,60,5f567f87b176470ae9507f22,5f5687a4e7b06a0d7ffada76,,,0,38,38,50,1,List1,giyz,stop,GR,NA,NA,NA,NA,ALBRIGHT/HAYES
,,,,,,,,,,,,,,,,1.071428571,4.44,grilg,,,,,,,filler,audio/fillers/KRIHLG.wav,,5f2c760dfff10e03206a686b,20,Female,English,United States,2020-09-07_14h28.11.092,Experiment1,2020.1.2,Win32,60,5f567f87b176470ae9507f22,5f5687a4e7b06a0d7ffada76,,,0,39,39,44,1,List1,KRIHLG,stop/liquid,KR,NA,NA,NA,NA,ALBRIGHT/HAYES
,,,,,,,,,,,,,,,,2.166666667,3.494,dunge,,,,,,,filler,audio/fillers/DAHNDH.wav,,5f2c760dfff10e03206a686b,20,Female,English,United States,2020-09-07_14h28.11.092,Experiment1,2020.1.2,Win32,60,5f567f87b176470ae9507f22,5f5687a4e7b06a0d7ffada76,,,0,40,40,41,1,List1,DAHNDH,stop,D,NA,NA,NA,NA,NA
,,,,,,,,,,,,,,,,2.76984127,6.258,balloon,,,,,,,full,audio/stimuli/BLAANG_full.wav,,5f2c760dfff10e03206a686b,20,Female,English,United States,2020-09-07_14h28.11.092,Experiment1,2020.1.2,Win32,60,5f567f87b176470ae9507f22,5f5687a4e7b06a0d7ffada76,,,0,41,41,9,1,List1,BLAANG,stop/liquid,BL,valid,5,good,31,SCHOLES
,,,,,,,,,,,,,,,,1,3.222,zernth,,,,,,,filler,audio/fillers/ZERNTH.wav,,5f2c760dfff10e03206a686b,20,Female,English,United States,2020-09-07_14h28.11.092,Experiment1,2020.1.2,Win32,60,5f567f87b176470ae9507f22,5f5687a4e7b06a0d7ffada76,,,0,42,42,37,1,List1,ZERNTH,fric,ZP,NA,NA,NA,NA,NA
,,,,,,,,,,,,,,,,1,5.425,vron,,,,,,,full,audio/stimuli/VRAAN_full.wav,,5f2c760dfff10e03206a686b,20,Female,English,United States,2020-09-07_14h28.11.092,Experiment1,2020.1.2,Win32,60,5f567f87b176470ae9507f22,5f5687a4e7b06a0d7ffada76,,,0,43,43,11,1,List1,VRAAN,fric/liquid,VR,invalid,2,medium,19,SCHOLES
,,,,,,,,,,,,,,,,2.76984127,3.874,loom,,,,,,,no,audio/stimuli/BLUWNG_no.wav,,5f2c760dfff10e03206a686b,20,Female,English,United States,2020-09-07_14h28.11.092,Experiment1,2020.1.2,Win32,60,5f567f87b176470ae9507f22,5f5687a4e7b06a0d7ffada76,,,0,44,44,8,1,List1,BLUWNG,stop/liquid,BL,valid,6,good,31,SCHOLES
,,,,,,,,,,,,,,,,1,6.24,regon,,,,,,,filler,audio/fillers/rgaan.wav,,5f2c760dfff10e03206a686b,20,Female,English,United States,2020-09-07_14h28.11.092,Experiment1,2020.1.2,Win32,60,5f567f87b176470ae9507f22,5f5687a4e7b06a0d7ffada76,,,0,45,45,56,1,List1,rgaan,liquid/stop,RG,NA,NA,NA,NA,SCHOLESadapt
,,,,,,,,,,,,,,,,1.007936508,2.956,zanth,,,,,,,filler,audio/fillers/ZAENTH.wav,,5f2c760dfff10e03206a686b,20,Female,English,United States,2020-09-07_14h28.11.092,Experiment1,2020.1.2,Win32,60,5f567f87b176470ae9507f22,5f5687a4e7b06a0d7ffada76,,,0,46,46,36,1,List1,ZAENTH,fric,ZP,NA,NA,NA,NA,NA
,,,,,,,,,,,,,,,,1.023809524,3.711,phral,,,,,,,no,audio/stimuli/FRAEL_no.wav,,5f2c760dfff10e03206a686b,20,Female,English,United States,2020-09-07_14h28.11.092,Experiment1,2020.1.2,Win32,60,5f567f87b176470ae9507f22,5f5687a4e7b06a0d7ffada76,,,0,47,47,4,1,List1,FRAEL,fric/liquid,FR,valid,3,good,29,SCHOLES
,,,,,,,,,,,,,,,,4.928571429,6.356,for sure,,,,,,,full,audio/stimuli/FSHUHL_full.wav,,5f2c760dfff10e03206a686b,20,Female,English,United States,2020-09-07_14h28.11.092,Experiment1,2020.1.2,Win32,60,5f567f87b176470ae9507f22,5f5687a4e7b06a0d7ffada76,,,0,48,48,15,1,List1,FSHUHL,fric/fric,FSH,invalid,1,medium,11,SCHOLES
,,,,,,,,,,,,,,,,3.888888889,4.808,cemment,,,,,,,no,audio/stimuli/SMEHT_no.wav,,5f2c760dfff10e03206a686b,20,Female,English,United States,2020-09-07_14h28.11.092,Experiment1,2020.1.2,Win32,60,5f567f87b176470ae9507f22,5f5687a4e7b06a0d7ffada76,,,0,49,49,6,1,List1,SMEHT,fric/nasal,SM,valid,8,good,32,SCHOLES
,,,,,,,,,,,,,,,,3.888888889,4.407,maroon,,,,,,,no,audio/stimuli/NRUWNG_no.wav,,5f2c760dfff10e03206a686b,20,Female,English,United States,2020-09-07_14h28.11.092,Experiment1,2020.1.2,Win32,60,5f567f87b176470ae9507f22,5f5687a4e7b06a0d7ffada76,,,0,50,50,28,1,List1,NRUWNG,nasal/liquid,NR,invalid,0,bad,8,SCHOLES
,,,,,,,,,,,,,,,,4.015873016,4.274,result,,,,,,,full,audio/stimuli/VZAHL_full.wav,,5f2c760dfff10e03206a686b,20,Female,English,United States,2020-09-07_14h28.11.092,Experiment1,2020.1.2,Win32,60,5f567f87b176470ae9507f22,5f5687a4e7b06a0d7ffada76,,,0,51,51,25,1,List1,VZAHL,fric/fric,VZ,invalid,0,bad,6,SCHOLES
,,,,,,,,,,,,,,,,4.03968254,4.672,bloom,,,,,,,no,audio/stimuli/VLUWNG_no.wav,,5f2c760dfff10e03206a686b,20,Female,English,United States,2020-09-07_14h28.11.092,Experiment1,2020.1.2,Win32,60,5f567f87b176470ae9507f22,5f5687a4e7b06a0d7ffada76,,,0,52,52,18,1,List1,VLUWNG,fric/liquid,VL,invalid,0,medium,14,SCHOLES
,,,,,,,,,,,,,,,,3.896825397,5.356,smirks,,,,,,,filler,audio/fillers/SNERKS.wav,,5f2c760dfff10e03206a686b,20,Female,English,United States,2020-09-07_14h28.11.092,Experiment1,2020.1.2,Win32,60,5f567f87b176470ae9507f22,5f5687a4e7b06a0d7ffada76,,,0,53,53,43,1,List1,SNERKS,fric/nasal,SN,NA,NA,NA,NA,ALBRIGHT/HAYES
,,,,,,,,,,,,,,,,1,4.808,zit,,,,,,,no,audio/stimuli/VZAEL_no.wav,,5f2c760dfff10e03206a686b,20,Female,English,United States,2020-09-07_14h28.11.092,Experiment1,2020.1.2,Win32,60,5f567f87b176470ae9507f22,5f5687a4e7b06a0d7ffada76,,,0,54,54,24,1,List1,VZAEL,fric/fric,VZ,invalid,1,bad,6,SCHOLES
,,,,,,,,,,,,,,,,3.103174603,4.512,regoon,,,,,,,filler,audio/fillers/rguwn.wav,,5f2c760dfff10e03206a686b,20,Female,English,United States,2020-09-07_14h28.11.092,Experiment1,2020.1.2,Win32,60,5f567f87b176470ae9507f22,5f5687a4e7b06a0d7ffada76,,,0,55,55,57,1,List1,rguwn,liquid/stop,RG,NA,NA,NA,NA,SCHOLESadapt
,,,,,,,,,,,,,,,,1.865079365,6.223,vouked,,,,,,,filler,audio/fillers/VOWPT.wav,,5f2c760dfff10e03206a686b,20,Female,English,United States,2020-09-07_14h28.11.092,Experiment1,2020.1.2,Win32,60,5f567f87b176470ae9507f22,5f5687a4e7b06a0d7ffada76,,,0,56,56,39,1,List1,VOWPT,fric,V,NA,NA,NA,NA,NA
,,,,,,,,,,,,,,,,2.007936508,4.128,snoinks,,,,,,,filler,audio/fillers/SNOIKS.wav,,5f2c760dfff10e03206a686b,20,Female,English,United States,2020-09-07_14h28.11.092,Experiment1,2020.1.2,Win32,60,5f567f87b176470ae9507f22,5f5687a4e7b06a0d7ffada76,,,0,57,57,42,1,List1,SNOIKS,fric/nasal,SN,NA,NA,NA,NA,ALBRIGHT/HAYES
