key_resp_Consent1.keys,key_resp_Consent1.rt,key_resp_Consent2.keys,key_resp_Consent2.rt,key_resp_Consent3.keys,key_resp_Consent3.rt,key_resp_2.keys,key_resp_2.rt,ConsentResponse.keys,ConsentResponse.rt,key_resp.keys,key_resp.rt,key_expIntroSpacebar.keys,key_expIntroSpacebar.rt,key_practiceIntroSpacebar.keys,key_practiceIntroSpacebar.rt,Rating.response,Rating.rt,PerceivedInput,practiceTrials.thisRepN,practiceTrials.thisTrialN,practiceTrials.thisN,practiceTrials.thisIndex,practiceTrials.ran,Word,Type,Soundfile,SoundfileOriginal,participant,Age,Gender,NativeLanguage,Country of Residence,date,expName,psychopyVersion,OS,frameRate,STUDY_ID,SESSION_ID,key_testIntroSpacebar.keys,key_testIntroSpacebar.rt,testTrials.thisRepN,testTrials.thisTrialN,testTrials.thisN,testTrials.thisIndex,testTrials.ran,List,stimuli,ClusterType,Onset,GrossStatus,NeighborhoodDensity,OriginalRating,ScholesJudgments,SourceStudy
space,0.747,space,0.457,space,0.952,space,0.694,y,1.913,space,0.577,space,0.803,space,0.936,4.071428571,7.835,printh,0,0,0,5,1,KREHNTH,practice,audio/practice/KREHNTH.practice.wav,practice/KREHNTH.practice.wav,5f2e3dface6a3a1ad688a223,32,male,english,united states,2020-09-07_16h16.34.553,Experiment1,2020.1.2,Win32,60,5f567f87b176470ae9507f22,5f56a31e0661d20fc5fbe78f,,,,,,,,,,,,,,,,
,,,,,,,,,,,,,,,,5.96031746,4.566,lum,0,1,1,6,1,LAHM,practice,audio/practice/LAHM.practice.wav,practice/LAHM.practice.wav,5f2e3dface6a3a1ad688a223,32,male,english,united states,2020-09-07_16h16.34.553,Experiment1,2020.1.2,Win32,60,5f567f87b176470ae9507f22,5f56a31e0661d20fc5fbe78f,,,,,,,,,,,,,,,,
,,,,,,,,,,,,,,,,2.047619048,5.043,kleg,0,2,2,4,1,KLIHG,practice,audio/practice/KLIHG.practice.wav,practice/KLIHG.practice.wav,5f2e3dface6a3a1ad688a223,32,male,english,united states,2020-09-07_16h16.34.553,Experiment1,2020.1.2,Win32,60,5f567f87b176470ae9507f22,5f56a31e0661d20fc5fbe78f,,,,,,,,,,,,,,,,
,,,,,,,,,,,,,,,,6.888888889,4.098,slain,0,3,3,7,1,SLEYM,practice,audio/practice/SLEYM.practice.wav,practice/SLEYM.practice.wav,5f2e3dface6a3a1ad688a223,32,male,english,united states,2020-09-07_16h16.34.553,Experiment1,2020.1.2,Win32,60,5f567f87b176470ae9507f22,5f56a31e0661d20fc5fbe78f,,,,,,,,,,,,,,,,
,,,,,,,,,,,,,,,,1.007936508,4.545,blut,0,4,4,9,1,PLUWT,practice,audio/practice/PLUWT.practice.wav,practice/PLUWT.practice.wav,5f2e3dface6a3a1ad688a223,32,male,english,united states,2020-09-07_16h16.34.553,Experiment1,2020.1.2,Win32,60,5f567f87b176470ae9507f22,5f56a31e0661d20fc5fbe78f,,,,,,,,,,,,,,,,
,,,,,,,,,,,,,,,,7,3.877,zoiks,0,5,5,8,1,ZOYNKS,practice,audio/practice/ZOYNKS.practice.wav,practice/ZOYNKS.practice.wav,5f2e3dface6a3a1ad688a223,32,male,english,united states,2020-09-07_16h16.34.553,Experiment1,2020.1.2,Win32,60,5f567f87b176470ae9507f22,5f56a31e0661d20fc5fbe78f,,,,,,,,,,,,,,,,
,,,,,,,,,,,,,,,,1,4.26,zeng,0,6,6,2,1,BZIYN,practice,audio/practice/BZIYN.practice.wav,practice/BZIYN.practice.wav,5f2e3dface6a3a1ad688a223,32,male,english,united states,2020-09-07_16h16.34.553,Experiment1,2020.1.2,Win32,60,5f567f87b176470ae9507f22,5f56a31e0661d20fc5fbe78f,,,,,,,,,,,,,,,,
,,,,,,,,,,,,,,,,3.158730159,4.383,presp,0,7,7,10,1,PREHSP,practice,audio/practice/PREHSP.practice.wav,practice/PREHSP.practice.wav,5f2e3dface6a3a1ad688a223,32,male,english,united states,2020-09-07_16h16.34.553,Experiment1,2020.1.2,Win32,60,5f567f87b176470ae9507f22,5f56a31e0661d20fc5fbe78f,,,,,,,,,,,,,,,,
,,,,,,,,,,,,,,,,1.944444444,4.828,bepo,0,8,8,0,1,BIHBL,practice,audio/practice/BIHBL.practice.wav,practice/BIHBL.practice.wav,5f2e3dface6a3a1ad688a223,32,male,english,united states,2020-09-07_16h16.34.553,Experiment1,2020.1.2,Win32,60,5f567f87b176470ae9507f22,5f56a31e0661d20fc5fbe78f,,,,,,,,,,,,,,,,
,,,,,,,,,,,,,,,,5.912698413,6.495,greed,0,9,9,3,1,GLIYD,practice,audio/practice/GLIYD.practice.wav,practice/GLIYD.practice.wav,5f2e3dface6a3a1ad688a223,32,male,english,united states,2020-09-07_16h16.34.553,Experiment1,2020.1.2,Win32,60,5f567f87b176470ae9507f22,5f56a31e0661d20fc5fbe78f,,,,,,,,,,,,,,,,
,,,,,,,,,,,,,,,,6.174603175,4.475,wide,0,10,10,1,1,BWAAD,practice,audio/practice/BWAAD.practice.wav,practice/BWAAD.practice.wav,5f2e3dface6a3a1ad688a223,32,male,english,united states,2020-09-07_16h16.34.553,Experiment1,2020.1.2,Win32,60,5f567f87b176470ae9507f22,5f56a31e0661d20fc5fbe78f,,,,,,,,,,,,,,,,
,,,,,,,,,,,,,,,,3.049649711,10.175,fanel,,,,,,,full,audio/stimuli/FRAEL_full.wav,,5f2e3dface6a3a1ad688a223,32,male,english,united states,2020-09-07_16h16.34.553,Experiment1,2020.1.2,Win32,60,5f567f87b176470ae9507f22,5f56a31e0661d20fc5fbe78f,space,1.042,0,0,0,4,1,List2,FRAEL,fric/liquid,FR,valid,3,good,29,SCHOLES
,,,,,,,,,,,,,,,,1.130673165,7.008,sasph,,,,,,,filler,audio/fillers/SAEF.wav,,5f2e3dface6a3a1ad688a223,32,male,english,united states,2020-09-07_16h16.34.553,Experiment1,2020.1.2,Win32,60,5f567f87b176470ae9507f22,5f56a31e0661d20fc5fbe78f,,,0,1,1,34,1,List2,SAEF,fric,S,NA,NA,NA,NA,NA
,,,,,,,,,,,,,,,,7,4.298,ferment,,,,,,,full,audio/stimuli/FMEHT_full.wav,,5f2e3dface6a3a1ad688a223,32,male,english,united states,2020-09-07_16h16.34.553,Experiment1,2020.1.2,Win32,60,5f567f87b176470ae9507f22,5f56a31e0661d20fc5fbe78f,,,0,2,2,26,1,List2,FMEHT,fric/liquid,FM,invalid,2,bad,2,SCHOLES
,,,,,,,,,,,,,,,,4.932074322,7.322,guam,,,,,,,no,audio/stimuli/VLAANG_no.wav,,5f2e3dface6a3a1ad688a223,32,male,english,united states,2020-09-07_16h16.34.553,Experiment1,2020.1.2,Win32,60,5f567f87b176470ae9507f22,5f56a31e0661d20fc5fbe78f,,,0,3,3,19,1,List2,VLAANG,fric/liquid,VL,invalid,0,medium,14,SCHOLES
,,,,,,,,,,,,,,,,1.021017362,5.636,mernt,,,,,,,filler,audio/fillers/mernt.wav,,5f2e3dface6a3a1ad688a223,32,male,english,united states,2020-09-07_16h16.34.553,Experiment1,2020.1.2,Win32,60,5f567f87b176470ae9507f22,5f56a31e0661d20fc5fbe78f,,,0,4,4,52,1,List2,mernt,nasal,M,NA,NA,NA,NA,ALBRIGHT/HAYESadapt
,,,,,,,,,,,,,,,,1.021017362,3.285,pwese,,,,,,,filler,audio/fillers/PWIHZH.wav,,5f2e3dface6a3a1ad688a223,32,male,english,united states,2020-09-07_16h16.34.553,Experiment1,2020.1.2,Win32,60,5f567f87b176470ae9507f22,5f56a31e0661d20fc5fbe78f,,,0,5,5,47,1,List2,PWIHZH,stop/glide,PW,NA,NA,NA,NA,ALBRIGTHadapt
,,,,,,,,,,,,,,,,6.915016753,4.04,teet,,,,,,,no,audio/stimuli/FTEYT_no.wav,,5f2e3dface6a3a1ad688a223,32,male,english,united states,2020-09-07_16h16.34.553,Experiment1,2020.1.2,Win32,60,5f567f87b176470ae9507f22,5f56a31e0661d20fc5fbe78f,,,0,6,6,17,1,List2,FTEYT,fric/stop,FT,invalid,4,medium,10,SCHOLES
,,,,,,,,,,,,,,,,6.915016753,3.871,fershal,,,,,,,full,audio/stimuli/FSHAEL_full.wav,,5f2e3dface6a3a1ad688a223,32,male,english,united states,2020-09-07_16h16.34.553,Experiment1,2020.1.2,Win32,60,5f567f87b176470ae9507f22,5f56a31e0661d20fc5fbe78f,,,0,7,7,14,1,List2,FSHAEL,fric/fric,FSH,invalid,1,medium,11,SCHOLES
,,,,,,,,,,,,,,,,4.018275967,7.336,mant,,,,,,,filler,audio/fillers/maent.wav,,5f2e3dface6a3a1ad688a223,32,male,english,united states,2020-09-07_16h16.34.553,Experiment1,2020.1.2,Win32,60,5f567f87b176470ae9507f22,5f56a31e0661d20fc5fbe78f,,,0,8,8,53,1,List2,maent,nasal,M,NA,NA,NA,NA,ALBRIGHT/HAYESadapt
,,,,,,,,,,,,,,,,1.203777033,4.551,skeesh,,,,,,,no,audio/stimuli/SKIYSH_no.wav,,5f2e3dface6a3a1ad688a223,32,male,english,united states,2020-09-07_16h16.34.553,Experiment1,2020.1.2,Win32,60,5f567f87b176470ae9507f22,5f56a31e0661d20fc5fbe78f,,,0,9,9,13,1,List2,SKIYSH,fric/stop,SK,valid,7,medium,20,SCHOLES
,,,,,,,,,,,,,,,,4.922936339,4.671,satesh,,,,,,,full,audio/stimuli/STIHSH_full.wav,,5f2e3dface6a3a1ad688a223,32,male,english,united states,2020-09-07_16h16.34.553,Experiment1,2020.1.2,Win32,60,5f567f87b176470ae9507f22,5f56a31e0661d20fc5fbe78f,,,0,10,10,2,1,List2,STIHSH,fric/stop,ST,valid,9,good,33,SCHOLES
,,,,,,,,,,,,,,,,1.039293329,4.223,moroung,,,,,,,no,audio/stimuli/NRAANG_no.wav,,5f2e3dface6a3a1ad688a223,32,male,english,united states,2020-09-07_16h16.34.553,Experiment1,2020.1.2,Win32,60,5f567f87b176470ae9507f22,5f56a31e0661d20fc5fbe78f,,,0,11,11,29,1,List2,NRAANG,nasal/liquid,NR,invalid,0,bad,8,SCHOLES
,,,,,,,,,,,,,,,,1.039293329,3.177,zenpint,,,,,,,full,audio/stimuli/ZPAHN_full.wav,,5f2e3dface6a3a1ad688a223,32,male,english,united states,2020-09-07_16h16.34.553,Experiment1,2020.1.2,Win32,60,5f567f87b176470ae9507f22,5f56a31e0661d20fc5fbe78f,,,0,12,12,20,1,List2,ZPAHN,fric/stop,ZP,invalid,4,bad,1,SCHOLES
,,,,,,,,,,,,,,,,4.027413951,4.453,valpt,,,,,,,filler,audio/fillers/VOWPT.wav,,5f2e3dface6a3a1ad688a223,32,male,english,united states,2020-09-07_16h16.34.553,Experiment1,2020.1.2,Win32,60,5f567f87b176470ae9507f22,5f56a31e0661d20fc5fbe78f,,,0,13,13,39,1,List2,VOWPT,fric,V,NA,NA,NA,NA,NA
,,,,,,,,,,,,,,,,5.982942431,5.9,grilled,,,,,,,filler,audio/fillers/KRIHLG.wav,,5f2e3dface6a3a1ad688a223,32,male,english,united states,2020-09-07_16h16.34.553,Experiment1,2020.1.2,Win32,60,5f567f87b176470ae9507f22,5f56a31e0661d20fc5fbe78f,,,0,14,14,44,1,List2,KRIHLG,stop/liquid,KR,NA,NA,NA,NA,ALBRIGHT/HAYES
,,,,,,,,,,,,,,,,1,5.334,fersherl,,,,,,,no,audio/stimuli/FSHUHL_no.wav,,5f2e3dface6a3a1ad688a223,32,male,english,united states,2020-09-07_16h16.34.553,Experiment1,2020.1.2,Win32,60,5f567f87b176470ae9507f22,5f56a31e0661d20fc5fbe78f,,,0,15,15,15,1,List2,FSHUHL,fric/fric,FSH,invalid,1,medium,11,SCHOLES
,,,,,,,,,,,,,,,,4.968626256,6.691,snoinks,,,,,,,filler,audio/fillers/SNOIKS.wav,,5f2e3dface6a3a1ad688a223,32,male,english,united states,2020-09-07_16h16.34.553,Experiment1,2020.1.2,Win32,60,5f567f87b176470ae9507f22,5f56a31e0661d20fc5fbe78f,,,0,16,16,42,1,List2,SNOIKS,fric/nasal,SN,NA,NA,NA,NA,ALBRIGHT/HAYES
,,,,,,,,,,,,,,,,5.160523911,4.975,dange,,,,,,,filler,audio/fillers/DEYNDH.wav,,5f2e3dface6a3a1ad688a223,32,male,english,united states,2020-09-07_16h16.34.553,Experiment1,2020.1.2,Win32,60,5f567f87b176470ae9507f22,5f56a31e0661d20fc5fbe78f,,,0,17,17,40,1,List2,DEYNDH,stop,D,NA,NA,NA,NA,NA
,,,,,,,,,,,,,,,,1,4.802,krog,,,,,,,filler,audio/fillers/KRAHLG.wav,,5f2e3dface6a3a1ad688a223,32,male,english,united states,2020-09-07_16h16.34.553,Experiment1,2020.1.2,Win32,60,5f567f87b176470ae9507f22,5f56a31e0661d20fc5fbe78f,,,0,18,18,45,1,List2,KRAHLG,stop/liquid,KR,NA,NA,NA,NA,ALBRIGHT/HAYES
,,,,,,,,,,,,,,,,6.978982638,4.717,vipt,,,,,,,filler,audio/fillers/VAIPT.wav,,5f2e3dface6a3a1ad688a223,32,male,english,united states,2020-09-07_16h16.34.553,Experiment1,2020.1.2,Win32,60,5f567f87b176470ae9507f22,5f56a31e0661d20fc5fbe78f,,,0,19,19,38,1,List2,VAIPT,fric,V,NA,NA,NA,NA,NA
,,,,,,,,,,,,,,,,6.978982638,2.995,sans,,,,,,,filler,audio/fillers/ZAENTH.wav,,5f2e3dface6a3a1ad688a223,32,male,english,united states,2020-09-07_16h16.34.553,Experiment1,2020.1.2,Win32,60,5f567f87b176470ae9507f22,5f56a31e0661d20fc5fbe78f,,,0,20,20,36,1,List2,ZAENTH,fric,ZP,NA,NA,NA,NA,NA
,,,,,,,,,,,,,,,,6.978982638,2.849,straff,,,,,,,filler,audio/fillers/STRAEF.wav,,5f2e3dface6a3a1ad688a223,32,male,english,united states,2020-09-07_16h16.34.553,Experiment1,2020.1.2,Win32,60,5f567f87b176470ae9507f22,5f56a31e0661d20fc5fbe78f,,,0,21,21,30,1,List2,STRAEF,fric/stop/liquid,STR,NA,NA,NA,NA,NA
,,,,,,,,,,,,,,,,6.978982638,2.76,ballon,,,,,,,full,audio/stimuli/BLUWNG_full.wav,,5f2e3dface6a3a1ad688a223,32,male,english,united states,2020-09-07_16h16.34.553,Experiment1,2020.1.2,Win32,60,5f567f87b176470ae9507f22,5f56a31e0661d20fc5fbe78f,,,0,22,22,8,1,List2,BLUWNG,stop/liquid,BL,valid,6,good,31,SCHOLES
,,,,,,,,,,,,,,,,1.06670728,3.247,skplick,,,,,,,filler,audio/fillers/SPLIHK.wav,,5f2e3dface6a3a1ad688a223,32,male,english,united states,2020-09-07_16h16.34.553,Experiment1,2020.1.2,Win32,60,5f567f87b176470ae9507f22,5f56a31e0661d20fc5fbe78f,,,0,23,23,33,1,List2,SPLIHK,fric/stop/liquid,SPL,NA,NA,NA,NA,NA
,,,,,,,,,,,,,,,,1.8891258,6.521,geeze,,,,,,,filler,audio/fillers/giyz.wav,,5f2e3dface6a3a1ad688a223,32,male,english,united states,2020-09-07_16h16.34.553,Experiment1,2020.1.2,Win32,60,5f567f87b176470ae9507f22,5f56a31e0661d20fc5fbe78f,,,0,24,24,50,1,List2,giyz,stop,GR,NA,NA,NA,NA,ALBRIGHT/HAYES
,,,,,,,,,,,,,,,,3.195857447,3.633,fertet,,,,,,,full,audio/stimuli/FTEHT_full.wav,,5f2e3dface6a3a1ad688a223,32,male,english,united states,2020-09-07_16h16.34.553,Experiment1,2020.1.2,Win32,60,5f567f87b176470ae9507f22,5f56a31e0661d20fc5fbe78f,,,0,25,25,16,1,List2,FTEHT,fric/stop,FT,invalid,2,medium,10,SCHOLES
,,,,,,,,,,,,,,,,6.823636917,3.981,saph,,,,,,,filler,audio/fillers/SEHF.wav,,5f2e3dface6a3a1ad688a223,32,male,english,united states,2020-09-07_16h16.34.553,Experiment1,2020.1.2,Win32,60,5f567f87b176470ae9507f22,5f56a31e0661d20fc5fbe78f,,,0,26,26,35,1,List2,SEHF,fric,S,NA,NA,NA,NA,NA
,,,,,,,,,,,,,,,,1.011879379,4.141,vunush,,,,,,,no,audio/stimuli/VNUWSH_no.wav,,5f2e3dface6a3a1ad688a223,32,male,english,united states,2020-09-07_16h16.34.553,Experiment1,2020.1.2,Win32,60,5f567f87b176470ae9507f22,5f56a31e0661d20fc5fbe78f,,,0,27,27,23,1,List2,VNUWSH,fric/nasal,VN,invalid,0,bad,1,SCHOLES
,,,,,,,,,,,,,,,,5.069144076,4.079,cemet,,,,,,,full,audio/stimuli/SMEHT_full.wav,,5f2e3dface6a3a1ad688a223,32,male,english,united states,2020-09-07_16h16.34.553,Experiment1,2020.1.2,Win32,60,5f567f87b176470ae9507f22,5f56a31e0661d20fc5fbe78f,,,0,28,28,6,1,List2,SMEHT,fric/nasal,SM,valid,8,good,32,SCHOLES
,,,,,,,,,,,,,,,,3.908620164,4.633,gunrun,,,,,,,full,audio/stimuli/GRAHN_full.wav,,5f2e3dface6a3a1ad688a223,32,male,english,united states,2020-09-07_16h16.34.553,Experiment1,2020.1.2,Win32,60,5f567f87b176470ae9507f22,5f56a31e0661d20fc5fbe78f,,,0,29,29,0,1,List2,GRAHN,stop/liquid,GR,valid,18,good,33,SCHOLES
,,,,,,,,,,,,,,,,1.048431313,3.345,setsh,,,,,,,no,audio/stimuli/STIYSH_no.wav,,5f2e3dface6a3a1ad688a223,32,male,english,united states,2020-09-07_16h16.34.553,Experiment1,2020.1.2,Win32,60,5f567f87b176470ae9507f22,5f56a31e0661d20fc5fbe78f,,,0,30,30,3,1,List2,STIYSH,fric/stop,ST,valid,9,good,33,SCHOLES
,,,,,,,,,,,,,,,,1,4.252,zoal,,,,,,,no,audio/stimuli/VZAHL_no.wav,,5f2e3dface6a3a1ad688a223,32,male,english,united states,2020-09-07_16h16.34.553,Experiment1,2020.1.2,Win32,60,5f567f87b176470ae9507f22,5f56a31e0661d20fc5fbe78f,,,0,31,31,25,1,List2,VZAHL,fric/fric,VZ,invalid,0,bad,6,SCHOLES
,,,,,,,,,,,,,,,,2.163265306,4.025,neurug,,,,,,,full,audio/stimuli/NRUWNG_full.wav,,5f2e3dface6a3a1ad688a223,32,male,english,united states,2020-09-07_16h16.34.553,Experiment1,2020.1.2,Win32,60,5f567f87b176470ae9507f22,5f56a31e0661d20fc5fbe78f,,,0,32,32,28,1,List2,NRUWNG,nasal/liquid,NR,invalid,0,bad,8,SCHOLES
,,,,,,,,,,,,,,,,2.135851355,6.05,snerks,,,,,,,filler,audio/fillers/SNERKS.wav,,5f2e3dface6a3a1ad688a223,32,male,english,united states,2020-09-07_16h16.34.553,Experiment1,2020.1.2,Win32,60,5f567f87b176470ae9507f22,5f56a31e0661d20fc5fbe78f,,,0,33,33,43,1,List2,SNERKS,fric/nasal,SN,NA,NA,NA,NA,ALBRIGHT/HAYES
,,,,,,,,,,,,,,,,1.084983247,4.702,chaal,,,,,,,filler,audio/fillers/chuwl.wav,,5f2e3dface6a3a1ad688a223,32,male,english,united states,2020-09-07_16h16.34.553,Experiment1,2020.1.2,Win32,60,5f567f87b176470ae9507f22,5f56a31e0661d20fc5fbe78f,,,0,34,34,48,1,List2,chuwl,affric,CH,NA,NA,NA,NA,ALBRIGHT/HAYES
,,,,,,,,,,,,,,,,6.832774901,3.758,dungee,,,,,,,filler,audio/fillers/DAHNDH.wav,,5f2e3dface6a3a1ad688a223,32,male,english,united states,2020-09-07_16h16.34.553,Experiment1,2020.1.2,Win32,60,5f567f87b176470ae9507f22,5f56a31e0661d20fc5fbe78f,,,0,35,35,41,1,List2,DAHNDH,stop,D,NA,NA,NA,NA,NA
,,,,,,,,,,,,,,,,1,3.356,smat,,,,,,,no,audio/stimuli/SMEYT_no.wav,,5f2e3dface6a3a1ad688a223,32,male,english,united states,2020-09-07_16h16.34.553,Experiment1,2020.1.2,Win32,60,5f567f87b176470ae9507f22,5f56a31e0661d20fc5fbe78f,,,0,36,36,7,1,List2,SMEYT,fric/nasal,SM,valid,9,good,32,SCHOLES
,,,,,,,,,,,,,,,,4.054827901,4.633,verun,,,,,,,full,audio/stimuli/VRAHN_full.wav,,5f2e3dface6a3a1ad688a223,32,male,english,united states,2020-09-07_16h16.34.553,Experiment1,2020.1.2,Win32,60,5f567f87b176470ae9507f22,5f56a31e0661d20fc5fbe78f,,,0,37,37,10,1,List2,VRAHN,fric/liquid,VR,invalid,4,medium,19,SCHOLES
,,,,,,,,,,,,,,,,1.112397198,4.133,zien,,,,,,,filler,audio/fillers/bziyn.wav,,5f2e3dface6a3a1ad688a223,32,male,english,united states,2020-09-07_16h16.34.553,Experiment1,2020.1.2,Win32,60,5f567f87b176470ae9507f22,5f56a31e0661d20fc5fbe78f,,,0,38,38,54,1,List2,bziyn,stop/fric,BZ,NA,NA,NA,NA,ALBRIGHT
,,,,,,,,,,,,,,,,1.980505635,4.293,guz,,,,,,,filler,audio/fillers/guhz.wav,,5f2e3dface6a3a1ad688a223,32,male,english,united states,2020-09-07_16h16.34.553,Experiment1,2020.1.2,Win32,60,5f567f87b176470ae9507f22,5f56a31e0661d20fc5fbe78f,,,0,39,39,51,1,List2,guhz,stop,GR,NA,NA,NA,NA,ALBRIGHT/HAYES
,,,,,,,,,,,,,,,,4.968626256,5.553,trichil,,,,,,,filler,audio/fillers/choil.wav,,5f2e3dface6a3a1ad688a223,32,male,english,united states,2020-09-07_16h16.34.553,Experiment1,2020.1.2,Win32,60,5f567f87b176470ae9507f22,5f56a31e0661d20fc5fbe78f,,,0,40,40,49,1,List2,choil,affric,CH,NA,NA,NA,NA,ALBRIGHT/HAYES
,,,,,,,,,,,,,,,,1.971367652,4.49,guran,,,,,,,no,audio/stimuli/GRAAN_no.wav,,5f2e3dface6a3a1ad688a223,32,male,english,united states,2020-09-07_16h16.34.553,Experiment1,2020.1.2,Win32,60,5f567f87b176470ae9507f22,5f56a31e0661d20fc5fbe78f,,,0,41,41,1,1,List2,GRAAN,stop/liquid,GR,valid,13,good,33,SCHOLES
,,,,,,,,,,,,,,,,1,3.094,serplerk,,,,,,,filler,audio/fillers/SPLERK.wav,,5f2e3dface6a3a1ad688a223,32,male,english,united states,2020-09-07_16h16.34.553,Experiment1,2020.1.2,Win32,60,5f567f87b176470ae9507f22,5f56a31e0661d20fc5fbe78f,,,0,42,42,32,1,List2,SPLERK,fric/stop/liquid,SPL,NA,NA,NA,NA,NA
,,,,,,,,,,,,,,,,2.090161438,3.8,fmet,,,,,,,no,audio/stimuli/FMEYT_no.wav,,5f2e3dface6a3a1ad688a223,32,male,english,united states,2020-09-07_16h16.34.553,Experiment1,2020.1.2,Win32,60,5f567f87b176470ae9507f22,5f56a31e0661d20fc5fbe78f,,,0,43,43,27,1,List2,FMEYT,fric/liquid,FM,invalid,3,bad,2,SCHOLES
,,,,,,,,,,,,,,,,1.19463905,2.758,froll,,,,,,,no,audio/stimuli/FRUHL_no.wav,,5f2e3dface6a3a1ad688a223,32,male,english,united states,2020-09-07_16h16.34.553,Experiment1,2020.1.2,Win32,60,5f567f87b176470ae9507f22,5f56a31e0661d20fc5fbe78f,,,0,44,44,5,1,List2,FRUHL,fric/liquid,FR,valid,3,good,29,SCHOLES
,,,,,,,,,,,,,,,,4.996040207,4.342,vanesh,,,,,,,full,audio/stimuli/VNIHSH_full.wav,,5f2e3dface6a3a1ad688a223,32,male,english,united states,2020-09-07_16h16.34.553,Experiment1,2020.1.2,Win32,60,5f567f87b176470ae9507f22,5f56a31e0661d20fc5fbe78f,,,0,45,45,22,1,List2,VNIHSH,fric/nasal,VN,invalid,1,bad,1,SCHOLES
,,,,,,,,,,,,,,,,4.100517819,7.238,strif,,,,,,,filler,audio/fillers/STREHF.wav,,5f2e3dface6a3a1ad688a223,32,male,english,united states,2020-09-07_16h16.34.553,Experiment1,2020.1.2,Win32,60,5f567f87b176470ae9507f22,5f56a31e0661d20fc5fbe78f,,,0,46,46,31,1,List2,STREHF,fric/stop/liquid,STR,NA,NA,NA,NA,NA
,,,,,,,,,,,,,,,,1.176363083,3.357,pazan,,,,,,,filler,audio/fillers/bzaan.wav,,5f2e3dface6a3a1ad688a223,32,male,english,united states,2020-09-07_16h16.34.553,Experiment1,2020.1.2,Win32,60,5f567f87b176470ae9507f22,5f56a31e0661d20fc5fbe78f,,,0,47,47,55,1,List2,bzaan,stop/fric,BZ,NA,NA,NA,NA,ALBRIGHT
,,,,,,,,,,,,,,,,1.176363083,3.031,sekeash,,,,,,,full,audio/stimuli/SKIHSH_full.wav,,5f2e3dface6a3a1ad688a223,32,male,english,united states,2020-09-07_16h16.34.553,Experiment1,2020.1.2,Win32,60,5f567f87b176470ae9507f22,5f56a31e0661d20fc5fbe78f,,,0,48,48,12,1,List2,SKIHSH,fric/stop,SK,valid,8,medium,20,SCHOLES
,,,,,,,,,,,,,,,,1.021017362,3.769,zernneth,,,,,,,filler,audio/fillers/ZERNTH.wav,,5f2e3dface6a3a1ad688a223,32,male,english,united states,2020-09-07_16h16.34.553,Experiment1,2020.1.2,Win32,60,5f567f87b176470ae9507f22,5f56a31e0661d20fc5fbe78f,,,0,49,49,37,1,List2,ZERNTH,fric,ZP,NA,NA,NA,NA,NA
,,,,,,,,,,,,,,,,4.895522388,3.925,vizow,,,,,,,full,audio/stimuli/VZAEL_full.wav,,5f2e3dface6a3a1ad688a223,32,male,english,united states,2020-09-07_16h16.34.553,Experiment1,2020.1.2,Win32,60,5f567f87b176470ae9507f22,5f56a31e0661d20fc5fbe78f,,,0,50,50,24,1,List2,VZAEL,fric/fric,VZ,invalid,1,bad,6,SCHOLES
,,,,,,,,,,,,,,,,5.114833993,4.425,vizpawn,,,,,,,no,audio/stimuli/ZPAAN_no.wav,,5f2e3dface6a3a1ad688a223,32,male,english,united states,2020-09-07_16h16.34.553,Experiment1,2020.1.2,Win32,60,5f567f87b176470ae9507f22,5f56a31e0661d20fc5fbe78f,,,0,51,51,21,1,List2,ZPAAN,fric/stop,ZP,invalid,3,bad,1,SCHOLES
,,,,,,,,,,,,,,,,1,3.301,bloawn,,,,,,,no,audio/stimuli/BLAANG_no.wav,,5f2e3dface6a3a1ad688a223,32,male,english,united states,2020-09-07_16h16.34.553,Experiment1,2020.1.2,Win32,60,5f567f87b176470ae9507f22,5f56a31e0661d20fc5fbe78f,,,0,52,52,9,1,List2,BLAANG,stop/liquid,BL,valid,5,good,31,SCHOLES
,,,,,,,,,,,,,,,,4.210173622,4.459,phrewsh,,,,,,,filler,audio/fillers/PWEYZH.wav,,5f2e3dface6a3a1ad688a223,32,male,english,united states,2020-09-07_16h16.34.553,Experiment1,2020.1.2,Win32,60,5f567f87b176470ae9507f22,5f56a31e0661d20fc5fbe78f,,,0,53,53,46,1,List2,PWEYZH,stop/glide,PW,NA,NA,NA,NA,ALBRIGHTadapt
,,,,,,,,,,,,,,,,7,4.14,regan,,,,,,,filler,audio/fillers/rgaan.wav,,5f2e3dface6a3a1ad688a223,32,male,english,united states,2020-09-07_16h16.34.553,Experiment1,2020.1.2,Win32,60,5f567f87b176470ae9507f22,5f56a31e0661d20fc5fbe78f,,,0,54,54,56,1,List2,rgaan,liquid/stop,RG,NA,NA,NA,NA,SCHOLESadapt
,,,,,,,,,,,,,,,,1.953091684,3.693,vean,,,,,,,no,audio/stimuli/VRAAN_no.wav,,5f2e3dface6a3a1ad688a223,32,male,english,united states,2020-09-07_16h16.34.553,Experiment1,2020.1.2,Win32,60,5f567f87b176470ae9507f22,5f56a31e0661d20fc5fbe78f,,,0,55,55,11,1,List2,VRAAN,fric/liquid,VR,invalid,2,medium,19,SCHOLES
,,,,,,,,,,,,,,,,7,3.203,valoon,,,,,,,full,audio/stimuli/VLUWNG_full.wav,,5f2e3dface6a3a1ad688a223,32,male,english,united states,2020-09-07_16h16.34.553,Experiment1,2020.1.2,Win32,60,5f567f87b176470ae9507f22,5f56a31e0661d20fc5fbe78f,,,0,56,56,18,1,List2,VLUWNG,fric/liquid,VL,invalid,0,medium,14,SCHOLES
,,,,,,,,,,,,,,,,6.969844654,3.384,ragoon,,,,,,,filler,audio/fillers/rguwn.wav,,5f2e3dface6a3a1ad688a223,32,male,english,united states,2020-09-07_16h16.34.553,Experiment1,2020.1.2,Win32,60,5f567f87b176470ae9507f22,5f56a31e0661d20fc5fbe78f,,,0,57,57,57,1,List2,rguwn,liquid/stop,RG,NA,NA,NA,NA,SCHOLESadapt
