key_resp_Consent1.keys,key_resp_Consent1.rt,key_resp_Consent2.keys,key_resp_Consent2.rt,key_resp_Consent3.keys,key_resp_Consent3.rt,key_resp_2.keys,key_resp_2.rt,ConsentResponse.keys,ConsentResponse.rt,key_resp.keys,key_resp.rt,key_expIntroSpacebar.keys,key_expIntroSpacebar.rt,key_practiceIntroSpacebar.keys,key_practiceIntroSpacebar.rt,Rating.response,Rating.rt,PerceivedInput,practiceTrials.thisRepN,practiceTrials.thisTrialN,practiceTrials.thisN,practiceTrials.thisIndex,practiceTrials.ran,Word,Type,Soundfile,SoundfileOriginal,participant,Age,Gender,NativeLanguage,Country of Residence,date,expName,psychopyVersion,OS,frameRate,STUDY_ID,SESSION_ID,key_testIntroSpacebar.keys,key_testIntroSpacebar.rt,testTrials.thisRepN,testTrials.thisTrialN,testTrials.thisN,testTrials.thisIndex,testTrials.ran,List,stimuli,ClusterType,Onset,GrossStatus,NeighborhoodDensity,OriginalRating,ScholesJudgments,SourceStudy
space,55.20637,space,1.341475,space,0.83344,space,0.655645,y,1.23373,space,0.5357,space,1.71779,space,0.67815,6.098214286,7.365945,greet,0,0,0,3,1,GLIYD,practice,audio/practice/GLIYD.practice.wav,practice/GLIYD.practice.wav,5e02fea79b92b1e3b4d7f133,28,Male,English,United States of America,2020-09-07_12h19.12.808,Experiment1,2020.1.2,Win32,60,5f567f87b176470ae9507f22,5f56876a1f04740d3304819e,,,,,,,,,,,,,,,,
,,,,,,,,,,,,,,,,5.082589286,5.800475,bwad,0,1,1,1,1,BWAAD,practice,audio/practice/BWAAD.practice.wav,practice/BWAAD.practice.wav,5e02fea79b92b1e3b4d7f133,28,Male,English,United States of America,2020-09-07_12h19.12.808,Experiment1,2020.1.2,Win32,60,5f567f87b176470ae9507f22,5f56876a1f04740d3304819e,,,,,,,,,,,,,,,,
,,,,,,,,,,,,,,,,,,slame,0,2,2,7,1,SLEYM,practice,audio/practice/SLEYM.practice.wav,practice/SLEYM.practice.wav,5e02fea79b92b1e3b4d7f133,28,Male,English,United States of America,2020-09-07_12h19.12.808,Experiment1,2020.1.2,Win32,60,5f567f87b176470ae9507f22,5f56876a1f04740d3304819e,,,,,,,,,,,,,,,,
,,,,,,,,,,,,,,,,5.104910714,6.614955,clig,0,3,3,4,1,KLIHG,practice,audio/practice/KLIHG.practice.wav,practice/KLIHG.practice.wav,5e02fea79b92b1e3b4d7f133,28,Male,English,United States of America,2020-09-07_12h19.12.808,Experiment1,2020.1.2,Win32,60,5f567f87b176470ae9507f22,5f56876a1f04740d3304819e,,,,,,,,,,,,,,,,
,,,,,,,,,,,,,,,,6.042410714,5.82126,zime,0,4,4,2,1,BZIYN,practice,audio/practice/BZIYN.practice.wav,practice/BZIYN.practice.wav,5e02fea79b92b1e3b4d7f133,28,Male,English,United States of America,2020-09-07_12h19.12.808,Experiment1,2020.1.2,Win32,60,5f567f87b176470ae9507f22,5f56876a1f04740d3304819e,,,,,,,,,,,,,,,,
,,,,,,,,,,,,,,,,5.015625,9.4646,blut,0,5,5,9,1,PLUWT,practice,audio/practice/PLUWT.practice.wav,practice/PLUWT.practice.wav,5e02fea79b92b1e3b4d7f133,28,Male,English,United States of America,2020-09-07_12h19.12.808,Experiment1,2020.1.2,Win32,60,5f567f87b176470ae9507f22,5f56876a1f04740d3304819e,,,,,,,,,,,,,,,,
,,,,,,,,,,,,,,,,4.970982143,5.946525,zoinks,0,6,6,8,1,ZOYNKS,practice,audio/practice/ZOYNKS.practice.wav,practice/ZOYNKS.practice.wav,5e02fea79b92b1e3b4d7f133,28,Male,English,United States of America,2020-09-07_12h19.12.808,Experiment1,2020.1.2,Win32,60,5f567f87b176470ae9507f22,5f56876a1f04740d3304819e,,,,,,,,,,,,,,,,
,,,,,,,,,,,,,,,,4.993303571,5.514315,lum,0,7,7,6,1,LAHM,practice,audio/practice/LAHM.practice.wav,practice/LAHM.practice.wav,5e02fea79b92b1e3b4d7f133,28,Male,English,United States of America,2020-09-07_12h19.12.808,Experiment1,2020.1.2,Win32,60,5f567f87b176470ae9507f22,5f56876a1f04740d3304819e,,,,,,,,,,,,,,,,
,,,,,,,,,,,,,,,,4.066964286,5.16457,krenth,0,8,8,5,1,KREHNTH,practice,audio/practice/KREHNTH.practice.wav,practice/KREHNTH.practice.wav,5e02fea79b92b1e3b4d7f133,28,Male,English,United States of America,2020-09-07_12h19.12.808,Experiment1,2020.1.2,Win32,60,5f567f87b176470ae9507f22,5f56876a1f04740d3304819e,,,,,,,,,,,,,,,,
,,,,,,,,,,,,,,,,4.078125,3.999675,presp,0,9,9,10,1,PREHSP,practice,audio/practice/PREHSP.practice.wav,practice/PREHSP.practice.wav,5e02fea79b92b1e3b4d7f133,28,Male,English,United States of America,2020-09-07_12h19.12.808,Experiment1,2020.1.2,Win32,60,5f567f87b176470ae9507f22,5f56876a1f04740d3304819e,,,,,,,,,,,,,,,,
,,,,,,,,,,,,,,,,4.011160714,4.20303,bibel,0,10,10,0,1,BIHBL,practice,audio/practice/BIHBL.practice.wav,practice/BIHBL.practice.wav,5e02fea79b92b1e3b4d7f133,28,Male,English,United States of America,2020-09-07_12h19.12.808,Experiment1,2020.1.2,Win32,60,5f567f87b176470ae9507f22,5f56876a1f04740d3304819e,,,,,,,,,,,,,,,,
,,,,,,,,,,,,,,,,4.100446429,6.92691,smet,,,,,,,no,audio/stimuli/SMEHT_no.wav,,5e02fea79b92b1e3b4d7f133,28,Male,English,United States of America,2020-09-07_12h19.12.808,Experiment1,2020.1.2,Win32,60,5f567f87b176470ae9507f22,5f56876a1f04740d3304819e,space,0.891065,0,0,0,6,1,List1,SMEHT,fric/nasal,SM,valid,8,good,32,SCHOLES
,,,,,,,,,,,,,,,,4.044642857,4.02786,veron,,,,,,,full,audio/stimuli/VRAAN_full.wav,,5e02fea79b92b1e3b4d7f133,28,Male,English,United States of America,2020-09-07_12h19.12.808,Experiment1,2020.1.2,Win32,60,5f567f87b176470ae9507f22,5f56876a1f04740d3304819e,,,0,1,1,11,1,List1,VRAAN,fric/liquid,VR,invalid,2,medium,19,SCHOLES
,,,,,,,,,,,,,,,,4.066964286,4.830615,regone,,,,,,,filler,audio/fillers/rgaan.wav,,5e02fea79b92b1e3b4d7f133,28,Male,English,United States of America,2020-09-07_12h19.12.808,Experiment1,2020.1.2,Win32,60,5f567f87b176470ae9507f22,5f56876a1f04740d3304819e,,,0,2,2,56,1,List1,rgaan,liquid/stop,RG,NA,NA,NA,NA,SCHOLESadapt
,,,,,,,,,,,,,,,,2.917410714,4.32319,snoiks,,,,,,,filler,audio/fillers/SNOIKS.wav,,5e02fea79b92b1e3b4d7f133,28,Male,English,United States of America,2020-09-07_12h19.12.808,Experiment1,2020.1.2,Win32,60,5f567f87b176470ae9507f22,5f56876a1f04740d3304819e,,,0,3,3,42,1,List1,SNOIKS,fric/nasal,SN,NA,NA,NA,NA,ALBRIGHT/HAYES
,,,,,,,,,,,,,,,,4.167410714,7.12975,nuron,,,,,,,full,audio/stimuli/NRAANG_full.wav,,5e02fea79b92b1e3b4d7f133,28,Male,English,United States of America,2020-09-07_12h19.12.808,Experiment1,2020.1.2,Win32,60,5f567f87b176470ae9507f22,5f56876a1f04740d3304819e,,,0,4,4,29,1,List1,NRAANG,nasal/liquid,NR,invalid,0,bad,8,SCHOLES
,,,,,,,,,,,,,,,,3.073660714,4.502435,satish,,,,,,,full,audio/stimuli/STIYSH_full.wav,,5e02fea79b92b1e3b4d7f133,28,Male,English,United States of America,2020-09-07_12h19.12.808,Experiment1,2020.1.2,Win32,60,5f567f87b176470ae9507f22,5f56876a1f04740d3304819e,,,0,5,5,3,1,List1,STIYSH,fric/stop,ST,valid,9,good,33,SCHOLES
,,,,,,,,,,,,,,,,3.073660714,4.987805,choyle,,,,,,,filler,audio/fillers/choil.wav,,5e02fea79b92b1e3b4d7f133,28,Male,English,United States of America,2020-09-07_12h19.12.808,Experiment1,2020.1.2,Win32,60,5f567f87b176470ae9507f22,5f56876a1f04740d3304819e,,,0,6,6,49,1,List1,choil,affric,CH,NA,NA,NA,NA,ALBRIGHT/HAYES
,,,,,,,,,,,,,,,,3.129464286,4.547305,ragoon,,,,,,,filler,audio/fillers/rguwn.wav,,5e02fea79b92b1e3b4d7f133,28,Male,English,United States of America,2020-09-07_12h19.12.808,Experiment1,2020.1.2,Win32,60,5f567f87b176470ae9507f22,5f56876a1f04740d3304819e,,,0,7,7,57,1,List1,rguwn,liquid/stop,RG,NA,NA,NA,NA,SCHOLESadapt
,,,,,,,,,,,,,,,,1.991071429,4.46552,phemet,,,,,,,no,audio/stimuli/FMEHT_no.wav,,5e02fea79b92b1e3b4d7f133,28,Male,English,United States of America,2020-09-07_12h19.12.808,Experiment1,2020.1.2,Win32,60,5f567f87b176470ae9507f22,5f56876a1f04740d3304819e,,,0,8,8,26,1,List1,FMEHT,fric/liquid,FM,invalid,2,bad,2,SCHOLES
,,,,,,,,,,,,,,,,2.013392857,5.366485,geez,,,,,,,filler,audio/fillers/giyz.wav,,5e02fea79b92b1e3b4d7f133,28,Male,English,United States of America,2020-09-07_12h19.12.808,Experiment1,2020.1.2,Win32,60,5f567f87b176470ae9507f22,5f56876a1f04740d3304819e,,,0,9,9,50,1,List1,giyz,stop,GR,NA,NA,NA,NA,ALBRIGHT/HAYES
,,,,,,,,,,,,,,,,3.977678571,5.68499,saaf,,,,,,,filler,audio/fillers/SEHF.wav,,5e02fea79b92b1e3b4d7f133,28,Male,English,United States of America,2020-09-07_12h19.12.808,Experiment1,2020.1.2,Win32,60,5f567f87b176470ae9507f22,5f56876a1f04740d3304819e,,,0,10,10,35,1,List1,SEHF,fric,S,NA,NA,NA,NA,NA
,,,,,,,,,,,,,,,,4.970982143,4.68759,phitate,,,,,,,full,audio/stimuli/FTEYT_full.wav,,5e02fea79b92b1e3b4d7f133,28,Male,English,United States of America,2020-09-07_12h19.12.808,Experiment1,2020.1.2,Win32,60,5f567f87b176470ae9507f22,5f56876a1f04740d3304819e,,,0,11,11,17,1,List1,FTEYT,fric/stop,FT,invalid,4,medium,10,SCHOLES
,,,,,,,,,,,,,,,,2.995535714,4.43153,chewel,,,,,,,filler,audio/fillers/chuwl.wav,,5e02fea79b92b1e3b4d7f133,28,Male,English,United States of America,2020-09-07_12h19.12.808,Experiment1,2020.1.2,Win32,60,5f567f87b176470ae9507f22,5f56876a1f04740d3304819e,,,0,12,12,48,1,List1,chuwl,affric,CH,NA,NA,NA,NA,ALBRIGHT/HAYES
,,,,,,,,,,,,,,,,2.895089286,3.98322,nuroon,,,,,,,no,audio/stimuli/NRUWNG_no.wav,,5e02fea79b92b1e3b4d7f133,28,Male,English,United States of America,2020-09-07_12h19.12.808,Experiment1,2020.1.2,Win32,60,5f567f87b176470ae9507f22,5f56876a1f04740d3304819e,,,0,13,13,28,1,List1,NRUWNG,nasal/liquid,NR,invalid,0,bad,8,SCHOLES
,,,,,,,,,,,,,,,,1.912946429,4.31888,zepan,,,,,,,full,audio/stimuli/ZPAAN_full.wav,,5e02fea79b92b1e3b4d7f133,28,Male,English,United States of America,2020-09-07_12h19.12.808,Experiment1,2020.1.2,Win32,60,5f567f87b176470ae9507f22,5f56876a1f04740d3304819e,,,0,14,14,21,1,List1,ZPAAN,fric/stop,ZP,invalid,3,bad,1,SCHOLES
,,,,,,,,,,,,,,,,2.962053571,4.492955,dange,,,,,,,filler,audio/fillers/DEYNDH.wav,,5e02fea79b92b1e3b4d7f133,28,Male,English,United States of America,2020-09-07_12h19.12.808,Experiment1,2020.1.2,Win32,60,5f567f87b176470ae9507f22,5f56876a1f04740d3304819e,,,0,15,15,40,1,List1,DEYNDH,stop,D,NA,NA,NA,NA,NA
,,,,,,,,,,,,,,,,1.946428571,4.677115,splick,,,,,,,filler,audio/fillers/SPLIHK.wav,,5e02fea79b92b1e3b4d7f133,28,Male,English,United States of America,2020-09-07_12h19.12.808,Experiment1,2020.1.2,Win32,60,5f567f87b176470ae9507f22,5f56876a1f04740d3304819e,,,0,16,16,33,1,List1,SPLIHK,fric/stop/liquid,SPL,NA,NA,NA,NA,NA
,,,,,,,,,,,,,,,,3.017857143,4.0752,velong,,,,,,,full,audio/stimuli/VLAANG_full.wav,,5e02fea79b92b1e3b4d7f133,28,Male,English,United States of America,2020-09-07_12h19.12.808,Experiment1,2020.1.2,Win32,60,5f567f87b176470ae9507f22,5f56876a1f04740d3304819e,,,0,17,17,19,1,List1,VLAANG,fric/liquid,VL,invalid,0,medium,14,SCHOLES
,,,,,,,,,,,,,,,,4.15625,4.493535,bezine,,,,,,,filler,audio/fillers/bziyn.wav,,5e02fea79b92b1e3b4d7f133,28,Male,English,United States of America,2020-09-07_12h19.12.808,Experiment1,2020.1.2,Win32,60,5f567f87b176470ae9507f22,5f56876a1f04740d3304819e,,,0,18,18,54,1,List1,bziyn,stop/fric,BZ,NA,NA,NA,NA,ALBRIGHT
,,,,,,,,,,,,,,,,2.091517857,4.431315,grillg,,,,,,,filler,audio/fillers/KRIHLG.wav,,5e02fea79b92b1e3b4d7f133,28,Male,English,United States of America,2020-09-07_12h19.12.808,Experiment1,2020.1.2,Win32,60,5f567f87b176470ae9507f22,5f56876a1f04740d3304819e,,,0,19,19,44,1,List1,KRIHLG,stop/liquid,KR,NA,NA,NA,NA,ALBRIGHT/HAYES
,,,,,,,,,,,,,,,,2.995535714,3.93129,santh,,,,,,,filler,audio/fillers/ZAENTH.wav,,5e02fea79b92b1e3b4d7f133,28,Male,English,United States of America,2020-09-07_12h19.12.808,Experiment1,2020.1.2,Win32,60,5f567f87b176470ae9507f22,5f56876a1f04740d3304819e,,,0,20,20,36,1,List1,ZAENTH,fric,ZP,NA,NA,NA,NA,NA
,,,,,,,,,,,,,,,,3.140625,3.14947,zernthe,,,,,,,filler,audio/fillers/ZERNTH.wav,,5e02fea79b92b1e3b4d7f133,28,Male,English,United States of America,2020-09-07_12h19.12.808,Experiment1,2020.1.2,Win32,60,5f567f87b176470ae9507f22,5f56876a1f04740d3304819e,,,0,21,21,37,1,List1,ZERNTH,fric,ZP,NA,NA,NA,NA,NA
,,,,,,,,,,,,,,,,2.046875,3.898225,vinish,,,,,,,no,audio/stimuli/VNIHSH_no.wav,,5e02fea79b92b1e3b4d7f133,28,Male,English,United States of America,2020-09-07_12h19.12.808,Experiment1,2020.1.2,Win32,60,5f567f87b176470ae9507f22,5f56876a1f04740d3304819e,,,0,22,22,22,1,List1,VNIHSH,fric/nasal,VN,invalid,1,bad,1,SCHOLES
,,,,,,,,,,,,,,,,2.102678571,4.431285,snerks,,,,,,,filler,audio/fillers/SNERKS.wav,,5e02fea79b92b1e3b4d7f133,28,Male,English,United States of America,2020-09-07_12h19.12.808,Experiment1,2020.1.2,Win32,60,5f567f87b176470ae9507f22,5f56876a1f04740d3304819e,,,0,23,23,43,1,List1,SNERKS,fric/nasal,SN,NA,NA,NA,NA,ALBRIGHT/HAYES
,,,,,,,,,,,,,,,,2.839285714,4.023665,phemate,,,,,,,full,audio/stimuli/FMEYT_full.wav,,5e02fea79b92b1e3b4d7f133,28,Male,English,United States of America,2020-09-07_12h19.12.808,Experiment1,2020.1.2,Win32,60,5f567f87b176470ae9507f22,5f56876a1f04740d3304819e,,,0,24,24,27,1,List1,FMEYT,fric/liquid,FM,invalid,3,bad,2,SCHOLES
,,,,,,,,,,,,,,,,3.977678571,5.78012,tat,,,,,,,no,audio/stimuli/FTEHT_no.wav,,5e02fea79b92b1e3b4d7f133,28,Male,English,United States of America,2020-09-07_12h19.12.808,Experiment1,2020.1.2,Win32,60,5f567f87b176470ae9507f22,5f56876a1f04740d3304819e,,,0,25,25,16,1,List1,FTEHT,fric/stop,FT,invalid,2,medium,10,SCHOLES
,,,,,,,,,,,,,,,,3.888392857,4.415075,mant,,,,,,,filler,audio/fillers/maent.wav,,5e02fea79b92b1e3b4d7f133,28,Male,English,United States of America,2020-09-07_12h19.12.808,Experiment1,2020.1.2,Win32,60,5f567f87b176470ae9507f22,5f56876a1f04740d3304819e,,,0,26,26,53,1,List1,maent,nasal,M,NA,NA,NA,NA,ALBRIGHT/HAYESadapt
,,,,,,,,,,,,,,,,1.008928571,3.922395,venush,,,,,,,full,audio/stimuli/VNUWSH_full.wav,,5e02fea79b92b1e3b4d7f133,28,Male,English,United States of America,2020-09-07_12h19.12.808,Experiment1,2020.1.2,Win32,60,5f567f87b176470ae9507f22,5f56876a1f04740d3304819e,,,0,27,27,23,1,List1,VNUWSH,fric/nasal,VN,invalid,0,bad,1,SCHOLES
,,,,,,,,,,,,,,,,2.973214286,3.574845,brun,,,,,,,no,audio/stimuli/VRAHN_no.wav,,5e02fea79b92b1e3b4d7f133,28,Male,English,United States of America,2020-09-07_12h19.12.808,Experiment1,2020.1.2,Win32,60,5f567f87b176470ae9507f22,5f56876a1f04740d3304819e,,,0,28,28,10,1,List1,VRAHN,fric/liquid,VR,invalid,4,medium,19,SCHOLES
,,,,,,,,,,,,,,,,3.118303571,3.93957,brun,,,,,,,no,audio/stimuli/GRAHN_no.wav,,5e02fea79b92b1e3b4d7f133,28,Male,English,United States of America,2020-09-07_12h19.12.808,Experiment1,2020.1.2,Win32,60,5f567f87b176470ae9507f22,5f56876a1f04740d3304819e,,,0,29,29,0,1,List1,GRAHN,stop/liquid,GR,valid,18,good,33,SCHOLES
,,,,,,,,,,,,,,,,2.939732143,4.54076,viped,,,,,,,filler,audio/fillers/VAIPT.wav,,5e02fea79b92b1e3b4d7f133,28,Male,English,United States of America,2020-09-07_12h19.12.808,Experiment1,2020.1.2,Win32,60,5f567f87b176470ae9507f22,5f56876a1f04740d3304819e,,,0,30,30,38,1,List1,VAIPT,fric,V,NA,NA,NA,NA,NA
,,,,,,,,,,,,,,,,1.053571429,3.66921,puesh,,,,,,,filler,audio/fillers/PWIHZH.wav,,5e02fea79b92b1e3b4d7f133,28,Male,English,United States of America,2020-09-07_12h19.12.808,Experiment1,2020.1.2,Win32,60,5f567f87b176470ae9507f22,5f56876a1f04740d3304819e,,,0,31,31,47,1,List1,PWIHZH,stop/glide,PW,NA,NA,NA,NA,ALBRIGTHadapt
,,,,,,,,,,,,,,,,1.912946429,3.7982,saff,,,,,,,filler,audio/fillers/SAEF.wav,,5e02fea79b92b1e3b4d7f133,28,Male,English,United States of America,2020-09-07_12h19.12.808,Experiment1,2020.1.2,Win32,60,5f567f87b176470ae9507f22,5f56876a1f04740d3304819e,,,0,32,32,34,1,List1,SAEF,fric,S,NA,NA,NA,NA,NA
,,,,,,,,,,,,,,,,2.895089286,4.68998,fushul,,,,,,,full,audio/stimuli/FSHUHL_full.wav,,5e02fea79b92b1e3b4d7f133,28,Male,English,United States of America,2020-09-07_12h19.12.808,Experiment1,2020.1.2,Win32,60,5f567f87b176470ae9507f22,5f56876a1f04740d3304819e,,,0,33,33,15,1,List1,FSHUHL,fric/fric,FSH,invalid,1,medium,11,SCHOLES
,,,,,,,,,,,,,,,,2.102678571,3.45428,krulg,,,,,,,filler,audio/fillers/KRAHLG.wav,,5e02fea79b92b1e3b4d7f133,28,Male,English,United States of America,2020-09-07_12h19.12.808,Experiment1,2020.1.2,Win32,60,5f567f87b176470ae9507f22,5f56876a1f04740d3304819e,,,0,34,34,45,1,List1,KRAHLG,stop/liquid,KR,NA,NA,NA,NA,ALBRIGHT/HAYES
,,,,,,,,,,,,,,,,3.955357143,3.40996,skish,,,,,,,no,audio/stimuli/SKIHSH_no.wav,,5e02fea79b92b1e3b4d7f133,28,Male,English,United States of America,2020-09-07_12h19.12.808,Experiment1,2020.1.2,Win32,60,5f567f87b176470ae9507f22,5f56876a1f04740d3304819e,,,0,35,35,12,1,List1,SKIHSH,fric/stop,SK,valid,8,medium,20,SCHOLES
,,,,,,,,,,,,,,,,2.895089286,3.36857,pheshel,,,,,,,no,audio/stimuli/FSHAEL_no.wav,,5e02fea79b92b1e3b4d7f133,28,Male,English,United States of America,2020-09-07_12h19.12.808,Experiment1,2020.1.2,Win32,60,5f567f87b176470ae9507f22,5f56876a1f04740d3304819e,,,0,36,36,14,1,List1,FSHAEL,fric/fric,FSH,invalid,1,medium,11,SCHOLES
,,,,,,,,,,,,,,,,3.319196429,4.471515,vluum,,,,,,,no,audio/stimuli/VLUWNG_no.wav,,5e02fea79b92b1e3b4d7f133,28,Male,English,United States of America,2020-09-07_12h19.12.808,Experiment1,2020.1.2,Win32,60,5f567f87b176470ae9507f22,5f56876a1f04740d3304819e,,,0,37,37,18,1,List1,VLUWNG,fric/liquid,VL,invalid,0,medium,14,SCHOLES
,,,,,,,,,,,,,,,,1.020089286,3.971115,zepun,,,,,,,no,audio/stimuli/ZPAHN_no.wav,,5e02fea79b92b1e3b4d7f133,28,Male,English,United States of America,2020-09-07_12h19.12.808,Experiment1,2020.1.2,Win32,60,5f567f87b176470ae9507f22,5f56876a1f04740d3304819e,,,0,38,38,20,1,List1,ZPAHN,fric/stop,ZP,invalid,4,bad,1,SCHOLES
,,,,,,,,,,,,,,,,2.002232143,3.28248,vowped,,,,,,,filler,audio/fillers/VOWPT.wav,,5e02fea79b92b1e3b4d7f133,28,Male,English,United States of America,2020-09-07_12h19.12.808,Experiment1,2020.1.2,Win32,60,5f567f87b176470ae9507f22,5f56876a1f04740d3304819e,,,0,39,39,39,1,List1,VOWPT,fric,V,NA,NA,NA,NA,NA
,,,,,,,,,,,,,,,,5.908482143,4.36076,belong,,,,,,,full,audio/stimuli/BLAANG_full.wav,,5e02fea79b92b1e3b4d7f133,28,Male,English,United States of America,2020-09-07_12h19.12.808,Experiment1,2020.1.2,Win32,60,5f567f87b176470ae9507f22,5f56876a1f04740d3304819e,,,0,40,40,9,1,List1,BLAANG,stop/liquid,BL,valid,5,good,31,SCHOLES
,,,,,,,,,,,,,,,,2.169642857,3.468345,sekish,,,,,,,full,audio/stimuli/SKIYSH_full.wav,,5e02fea79b92b1e3b4d7f133,28,Male,English,United States of America,2020-09-07_12h19.12.808,Experiment1,2020.1.2,Win32,60,5f567f87b176470ae9507f22,5f56876a1f04740d3304819e,,,0,41,41,13,1,List1,SKIYSH,fric/stop,SK,valid,7,medium,20,SCHOLES
,,,,,,,,,,,,,,,,1.946428571,2.71172,gerun,,,,,,,full,audio/stimuli/GRAAN_full.wav,,5e02fea79b92b1e3b4d7f133,28,Male,English,United States of America,2020-09-07_12h19.12.808,Experiment1,2020.1.2,Win32,60,5f567f87b176470ae9507f22,5f56876a1f04740d3304819e,,,0,42,42,1,1,List1,GRAAN,stop/liquid,GR,valid,13,good,33,SCHOLES
,,,,,,,,,,,,,,,,1.991071429,4.316405,zan,,,,,,,filler,audio/fillers/bzaan.wav,,5e02fea79b92b1e3b4d7f133,28,Male,English,United States of America,2020-09-07_12h19.12.808,Experiment1,2020.1.2,Win32,60,5f567f87b176470ae9507f22,5f56876a1f04740d3304819e,,,0,43,43,55,1,List1,bzaan,stop/fric,BZ,NA,NA,NA,NA,ALBRIGHT
,,,,,,,,,,,,,,,,2.091517857,4.164655,mernt,,,,,,,filler,audio/fillers/mernt.wav,,5e02fea79b92b1e3b4d7f133,28,Male,English,United States of America,2020-09-07_12h19.12.808,Experiment1,2020.1.2,Win32,60,5f567f87b176470ae9507f22,5f56876a1f04740d3304819e,,,0,44,44,52,1,List1,mernt,nasal,M,NA,NA,NA,NA,ALBRIGHT/HAYESadapt
,,,,,,,,,,,,,,,,2.147321429,2.79282,treff,,,,,,,filler,audio/fillers/STREHF.wav,,5e02fea79b92b1e3b4d7f133,28,Male,English,United States of America,2020-09-07_12h19.12.808,Experiment1,2020.1.2,Win32,60,5f567f87b176470ae9507f22,5f56876a1f04740d3304819e,,,0,45,45,31,1,List1,STREHF,fric/stop/liquid,STR,NA,NA,NA,NA,NA
,,,,,,,,,,,,,,,,2.024553571,2.684295,pherul,,,,,,,full,audio/stimuli/FRUHL_full.wav,,5e02fea79b92b1e3b4d7f133,28,Male,English,United States of America,2020-09-07_12h19.12.808,Experiment1,2020.1.2,Win32,60,5f567f87b176470ae9507f22,5f56876a1f04740d3304819e,,,0,46,46,5,1,List1,FRUHL,fric/liquid,FR,valid,3,good,29,SCHOLES
,,,,,,,,,,,,,,,,2.002232143,2.64438,dunge,,,,,,,filler,audio/fillers/DAHNDH.wav,,5e02fea79b92b1e3b4d7f133,28,Male,English,United States of America,2020-09-07_12h19.12.808,Experiment1,2020.1.2,Win32,60,5f567f87b176470ae9507f22,5f56876a1f04740d3304819e,,,0,47,47,41,1,List1,DAHNDH,stop,D,NA,NA,NA,NA,NA
,,,,,,,,,,,,,,,,3.151785714,3.51617,straff,,,,,,,filler,audio/fillers/STRAEF.wav,,5e02fea79b92b1e3b4d7f133,28,Male,English,United States of America,2020-09-07_12h19.12.808,Experiment1,2020.1.2,Win32,60,5f567f87b176470ae9507f22,5f56876a1f04740d3304819e,,,0,48,48,30,1,List1,STRAEF,fric/stop/liquid,STR,NA,NA,NA,NA,NA
,,,,,,,,,,,,,,,,1.991071429,3.8822,phral,,,,,,,no,audio/stimuli/FRAEL_no.wav,,5e02fea79b92b1e3b4d7f133,28,Male,English,United States of America,2020-09-07_12h19.12.808,Experiment1,2020.1.2,Win32,60,5f567f87b176470ae9507f22,5f56876a1f04740d3304819e,,,0,49,49,4,1,List1,FRAEL,fric/liquid,FR,valid,3,good,29,SCHOLES
,,,,,,,,,,,,,,,,7,3.336865,semate,,,,,,,full,audio/stimuli/SMEYT_full.wav,,5e02fea79b92b1e3b4d7f133,28,Male,English,United States of America,2020-09-07_12h19.12.808,Experiment1,2020.1.2,Win32,60,5f567f87b176470ae9507f22,5f56876a1f04740d3304819e,,,0,50,50,7,1,List1,SMEYT,fric/nasal,SM,valid,9,good,32,SCHOLES
,,,,,,,,,,,,,,,,3.118303571,3.30316,vizol,,,,,,,full,audio/stimuli/VZAHL_full.wav,,5e02fea79b92b1e3b4d7f133,28,Male,English,United States of America,2020-09-07_12h19.12.808,Experiment1,2020.1.2,Win32,60,5f567f87b176470ae9507f22,5f56876a1f04740d3304819e,,,0,51,51,25,1,List1,VZAHL,fric/fric,VZ,invalid,0,bad,6,SCHOLES
,,,,,,,,,,,,,,,,1.857142857,3.07033,tish,,,,,,,no,audio/stimuli/STIHSH_no.wav,,5e02fea79b92b1e3b4d7f133,28,Male,English,United States of America,2020-09-07_12h19.12.808,Experiment1,2020.1.2,Win32,60,5f567f87b176470ae9507f22,5f56876a1f04740d3304819e,,,0,52,52,2,1,List1,STIHSH,fric/stop,ST,valid,9,good,33,SCHOLES
,,,,,,,,,,,,,,,,2.102678571,2.849185,loom,,,,,,,no,audio/stimuli/BLUWNG_no.wav,,5e02fea79b92b1e3b4d7f133,28,Male,English,United States of America,2020-09-07_12h19.12.808,Experiment1,2020.1.2,Win32,60,5f567f87b176470ae9507f22,5f56876a1f04740d3304819e,,,0,53,53,8,1,List1,BLUWNG,stop/liquid,BL,valid,6,good,31,SCHOLES
,,,,,,,,,,,,,,,,3.017857143,4.84758,splerk,,,,,,,filler,audio/fillers/SPLERK.wav,,5e02fea79b92b1e3b4d7f133,28,Male,English,United States of America,2020-09-07_12h19.12.808,Experiment1,2020.1.2,Win32,60,5f567f87b176470ae9507f22,5f56876a1f04740d3304819e,,,0,54,54,32,1,List1,SPLERK,fric/stop/liquid,SPL,NA,NA,NA,NA,NA
,,,,,,,,,,,,,,,,1.03125,3.252055,beigeleft,,,,,,,filler,audio/fillers/PWEYZH.wav,,5e02fea79b92b1e3b4d7f133,28,Male,English,United States of America,2020-09-07_12h19.12.808,Experiment1,2020.1.2,Win32,60,5f567f87b176470ae9507f22,5f56876a1f04740d3304819e,,,0,55,55,46,1,List1,PWEYZH,stop/glide,PW,NA,NA,NA,NA,ALBRIGHTadapt
,,,,,,,,,,,,,,,,1,4.78106,vzit,,,,,,,no,audio/stimuli/VZAEL_no.wav,,5e02fea79b92b1e3b4d7f133,28,Male,English,United States of America,2020-09-07_12h19.12.808,Experiment1,2020.1.2,Win32,60,5f567f87b176470ae9507f22,5f56876a1f04740d3304819e,,,0,56,56,24,1,List1,VZAEL,fric/fric,VZ,invalid,1,bad,6,SCHOLES
,,,,,,,,,,,,,,,,3.029017857,4.076575,guz,,,,,,,filler,audio/fillers/guhz.wav,,5e02fea79b92b1e3b4d7f133,28,Male,English,United States of America,2020-09-07_12h19.12.808,Experiment1,2020.1.2,Win32,60,5f567f87b176470ae9507f22,5f56876a1f04740d3304819e,,,0,57,57,51,1,List1,guhz,stop,GR,NA,NA,NA,NA,ALBRIGHT/HAYES
