key_resp_Consent1.keys,key_resp_Consent1.rt,key_resp_Consent2.keys,key_resp_Consent2.rt,key_resp_Consent3.keys,key_resp_Consent3.rt,key_resp_2.keys,key_resp_2.rt,ConsentResponse.keys,ConsentResponse.rt,key_resp.keys,key_resp.rt,key_expIntroSpacebar.keys,key_expIntroSpacebar.rt,key_practiceIntroSpacebar.keys,key_practiceIntroSpacebar.rt,Rating.response,Rating.rt,PerceivedInput,practiceTrials.thisRepN,practiceTrials.thisTrialN,practiceTrials.thisN,practiceTrials.thisIndex,practiceTrials.ran,Word,Type,Soundfile,SoundfileOriginal,participant,Age,Gender,NativeLanguage,Country of Residence,date,expName,psychopyVersion,OS,frameRate,key_testIntroSpacebar.keys,key_testIntroSpacebar.rt,testTrials.thisRepN,testTrials.thisTrialN,testTrials.thisN,testTrials.thisIndex,testTrials.ran,List,stimuli,ClusterType,Onset,GrossStatus,NeighborhoodDensity,OriginalRating,SourceStudy
space,1.68934,space,2.041935,space,0.54659,space,0.70138,y,1.718435,space,1.421695,space,1.66897,space,0.81646,5.922663802,7.598345,zoinks,0,0,0,8,1,ZOYNKS,practice,audio/practice/ZOYNKS.practice.wav,practice/ZOYNKS.practice.wav,5ec76194079cdc1b61767c3b,32,Male,English,United States,2020-08-13_12h21.41.878,Experiment1,2020.1.2,Linux x86_64,60,,,,,,,,,,,,,,,
,,,,,,,,,,,,,,,,4.859291085,7.308225,resp,0,1,1,10,1,PREHSP,practice,audio/practice/PREHSP.practice.wav,practice/PREHSP.practice.wav,5ec76194079cdc1b61767c3b,32,Male,English,United States,2020-08-13_12h21.41.878,Experiment1,2020.1.2,Linux x86_64,60,,,,,,,,,,,,,,,
,,,,,,,,,,,,,,,,4.053705693,4.57221,gleed,0,2,2,3,1,GLIYD,practice,audio/practice/GLIYD.practice.wav,practice/GLIYD.practice.wav,5ec76194079cdc1b61767c3b,32,Male,English,United States,2020-08-13_12h21.41.878,Experiment1,2020.1.2,Linux x86_64,60,,,,,,,,,,,,,,,
,,,,,,,,,,,,,,,,5.052631579,4.773335,slaim,0,3,3,7,1,SLEYM,practice,audio/practice/SLEYM.practice.wav,practice/SLEYM.practice.wav,5ec76194079cdc1b61767c3b,32,Male,English,United States,2020-08-13_12h21.41.878,Experiment1,2020.1.2,Linux x86_64,60,,,,,,,,,,,,,,,
,,,,,,,,,,,,,,,,5.890440387,4.42507,bwad,0,4,4,1,1,BWAAD,practice,audio/practice/BWAAD.practice.wav,practice/BWAAD.practice.wav,5ec76194079cdc1b61767c3b,32,Male,English,United States,2020-08-13_12h21.41.878,Experiment1,2020.1.2,Linux x86_64,60,,,,,,,,,,,,,,,
,,,,,,,,,,,,,,,,5.052631579,3.83685,zeev,0,5,5,2,1,BZIYN,practice,audio/practice/BZIYN.practice.wav,practice/BZIYN.practice.wav,5ec76194079cdc1b61767c3b,32,Male,English,United States,2020-08-13_12h21.41.878,Experiment1,2020.1.2,Linux x86_64,60,,,,,,,,,,,,,,,
,,,,,,,,,,,,,,,,3.892588614,6.86934,cleig,0,6,6,4,1,KLIHG,practice,audio/practice/KLIHG.practice.wav,practice/KLIHG.practice.wav,5ec76194079cdc1b61767c3b,32,Male,English,United States,2020-08-13_12h21.41.878,Experiment1,2020.1.2,Linux x86_64,60,,,,,,,,,,,,,,,
,,,,,,,,,,,,,,,,3.001074114,7.455295,vlue,0,7,7,9,1,PLUWT,practice,audio/practice/PLUWT.practice.wav,practice/PLUWT.practice.wav,5ec76194079cdc1b61767c3b,32,Male,English,United States,2020-08-13_12h21.41.878,Experiment1,2020.1.2,Linux x86_64,60,,,,,,,,,,,,,,,
,,,,,,,,,,,,,,,,4.064446831,4.389275,prenth,0,8,8,5,1,KREHNTH,practice,audio/practice/KREHNTH.practice.wav,practice/KREHNTH.practice.wav,5ec76194079cdc1b61767c3b,32,Male,English,United States,2020-08-13_12h21.41.878,Experiment1,2020.1.2,Linux x86_64,60,,,,,,,,,,,,,,,
,,,,,,,,,,,,,,,,6.062298604,4.02012,bibble,0,9,9,0,1,BIHBL,practice,audio/practice/BIHBL.practice.wav,practice/BIHBL.practice.wav,5ec76194079cdc1b61767c3b,32,Male,English,United States,2020-08-13_12h21.41.878,Experiment1,2020.1.2,Linux x86_64,60,,,,,,,,,,,,,,,
,,,,,,,,,,,,,,,,3.84962406,5.28033,lung,0,10,10,6,1,LAHM,practice,audio/practice/LAHM.practice.wav,practice/LAHM.practice.wav,5ec76194079cdc1b61767c3b,32,Male,English,United States,2020-08-13_12h21.41.878,Experiment1,2020.1.2,Linux x86_64,60,,,,,,,,,,,,,,,
,,,,,,,,,,,,,,,,3.151450054,6.135975,mant,,,,,,,filler,audio/fillers/maent.wav,,5ec76194079cdc1b61767c3b,32,Male,English,United States,2020-08-13_12h21.41.878,Experiment1,2020.1.2,Linux x86_64,60,space,0.763545,0,0,0,86,1,List2,maent,NA,,NA,NA,NA,ALBRIGHT/HAYESadapt
,,,,,,,,,,,,,,,,2.925886144,5.391125,mislake,,,,,,,filler,audio/fillers/VTLEYK.wav,,5ec76194079cdc1b61767c3b,32,Male,English,United States,2020-08-13_12h21.41.878,Experiment1,2020.1.2,Linux x86_64,60,,,0,1,1,50,1,List2,VTLEYK,NA,,NA,NA,NA,NA
,,,,,,,,,,,,,,,,4.107411386,6.4055,fmat,,,,,,,full,audio/stimuli/FMAET_full.wav,,5ec76194079cdc1b61767c3b,32,Male,English,United States,2020-08-13_12h21.41.878,Experiment1,2020.1.2,Linux x86_64,60,,,0,2,2,39,1,List2,FMAET,fric/liquid,FM,invalid,4,bad,SCHOLES
,,,,,,,,,,,,,,,,4.880773362,3.795285,satish,,,,,,,full,audio/stimuli/STIYSH_full.wav,,5ec76194079cdc1b61767c3b,32,Male,English,United States,2020-08-13_12h21.41.878,Experiment1,2020.1.2,Linux x86_64,60,,,0,3,3,5,1,List2,STIYSH,fric/stop,ST,valid,9,good,SCHOLES
,,,,,,,,,,,,,,,,4.193340494,4.92522,flung,,,,,,,no,audio/stimuli/BLAHNG_no.wav,,5ec76194079cdc1b61767c3b,32,Male,English,United States,2020-08-13_12h21.41.878,Experiment1,2020.1.2,Linux x86_64,60,,,0,4,4,12,1,List2,BLAHNG,stop/liquid,BL,valid,8,good,SCHOLES
,,,,,,,,,,,,,,,,3.065520945,5.364135,merong,,,,,,,no,audio/stimuli/NRAANG_no.wav,,5ec76194079cdc1b61767c3b,32,Male,English,United States,2020-08-13_12h21.41.878,Experiment1,2020.1.2,Linux x86_64,60,,,0,5,5,44,1,List2,NRAANG,nasal/liquid,NR,invalid,0,bad,SCHOLES
,,,,,,,,,,,,,,,,4.204081633,5.403445,viept,,,,,,,filler,audio/fillers/VAIPT.wav,,5ec76194079cdc1b61767c3b,32,Male,English,United States,2020-08-13_12h21.41.878,Experiment1,2020.1.2,Linux x86_64,60,,,0,6,6,63,1,List2,VAIPT,NA,,NA,NA,NA,NA
,,,,,,,,,,,,,,,,4.182599356,4.36083,dunge,,,,,,,filler,audio/fillers/DAHNDH.wav,,5ec76194079cdc1b61767c3b,32,Male,English,United States,2020-08-13_12h21.41.878,Experiment1,2020.1.2,Linux x86_64,60,,,0,7,7,67,1,List2,DAHNDH,NA,,NA,NA,NA,NA
,,,,,,,,,,,,,,,,3.108485499,4.546265,long,,,,,,,no,audio/stimuli/BLAANG_no.wav,,5ec76194079cdc1b61767c3b,32,Male,English,United States,2020-08-13_12h21.41.878,Experiment1,2020.1.2,Linux x86_64,60,,,0,8,8,14,1,List2,BLAANG,stop/liquid,BL,valid,5,good,SCHOLES
,,,,,,,,,,,,,,,,4.891514501,4.71282,phzine,,,,,,,filler,audio/fillers/bziyn.wav,,5ec76194079cdc1b61767c3b,32,Male,English,United States,2020-08-13_12h21.41.878,Experiment1,2020.1.2,Linux x86_64,60,,,0,9,9,87,1,List2,bziyn,NA,,NA,NA,NA,ALBRIGHT
,,,,,,,,,,,,,,,,2.925886144,5.368745,fmet,,,,,,,no,audio/stimuli/FMEHT_no.wav,,5ec76194079cdc1b61767c3b,32,Male,English,United States,2020-08-13_12h21.41.878,Experiment1,2020.1.2,Linux x86_64,60,,,0,10,10,40,1,List2,FMEHT,fric/liquid,FM,invalid,2,bad,SCHOLES
,,,,,,,,,,,,,,,,4.032223416,3.838645,skish,,,,,,,no,audio/stimuli/SKIHSH_no.wav,,5ec76194079cdc1b61767c3b,32,Male,English,United States,2020-08-13_12h21.41.878,Experiment1,2020.1.2,Linux x86_64,60,,,0,11,11,18,1,List2,SKIHSH,fric/stop,SK,valid,8,medium,SCHOLES
,,,,,,,,,,,,,,,,3.215896885,6.23074,gueez,,,,,,,filler,audio/fillers/gehz.wav,,5ec76194079cdc1b61767c3b,32,Male,English,United States,2020-08-13_12h21.41.878,Experiment1,2020.1.2,Linux x86_64,60,,,0,12,12,81,1,List2,gehz,NA,,NA,NA,NA,ALBRIGHT/HAYES
,,,,,,,,,,,,,,,,4.945220193,3.422475,stref,,,,,,,filler,audio/fillers/STREHF.wav,,5ec76194079cdc1b61767c3b,32,Male,English,United States,2020-08-13_12h21.41.878,Experiment1,2020.1.2,Linux x86_64,60,,,0,13,13,46,1,List2,STREHF,NA,,NA,NA,NA,NA
,,,,,,,,,,,,,,,,4.923737916,3.45608,vowpt,,,,,,,filler,audio/fillers/VOWPT.wav,,5ec76194079cdc1b61767c3b,32,Male,English,United States,2020-08-13_12h21.41.878,Experiment1,2020.1.2,Linux x86_64,60,,,0,14,14,64,1,List2,VOWPT,NA,,NA,NA,NA,NA
,,,,,,,,,,,,,,,,5.847475832,5.33809,mernt,,,,,,,filler,audio/fillers/mernt.wav,,5ec76194079cdc1b61767c3b,32,Male,English,United States,2020-08-13_12h21.41.878,Experiment1,2020.1.2,Linux x86_64,60,,,0,15,15,84,1,List2,mernt,NA,,NA,NA,NA,ALBRIGHT/HAYESadapt
,,,,,,,,,,,,,,,,5.858216971,3.81286,snerks,,,,,,,filler,audio/fillers/SNERKS.wav,,5ec76194079cdc1b61767c3b,32,Male,English,United States,2020-08-13_12h21.41.878,Experiment1,2020.1.2,Linux x86_64,60,,,0,16,16,70,1,List2,SNERKS,NA,,NA,NA,NA,ALBRIGHT/HAYES
,,,,,,,,,,,,,,,,4.042964554,4.087455,shaw,,,,,,,no,audio/stimuli/FSHAAL_no.wav,,5ec76194079cdc1b61767c3b,32,Male,English,United States,2020-08-13_12h21.41.878,Experiment1,2020.1.2,Linux x86_64,60,,,0,17,17,22,1,List2,FSHAAL,fric/fric,FSH,invalid,2,medium,SCHOLES
,,,,,,,,,,,,,,,,5.181525242,4.689595,joyal,,,,,,,filler,audio/fillers/choil.wav,,5ec76194079cdc1b61767c3b,32,Male,English,United States,2020-08-13_12h21.41.878,Experiment1,2020.1.2,Linux x86_64,60,,,0,18,18,79,1,List2,choil,NA,,NA,NA,NA,ALBRIGHT/HAYES
,,,,,,,,,,,,,,,,3.795918367,3.69025,saff,,,,,,,filler,audio/fillers/SEHF.wav,,5ec76194079cdc1b61767c3b,32,Male,English,United States,2020-08-13_12h21.41.878,Experiment1,2020.1.2,Linux x86_64,60,,,0,19,19,59,1,List2,SEHF,NA,,NA,NA,NA,NA
,,,,,,,,,,,,,,,,6.094522019,3.70923,snoiks,,,,,,,filler,audio/fillers/SNOIKS.wav,,5ec76194079cdc1b61767c3b,32,Male,English,United States,2020-08-13_12h21.41.878,Experiment1,2020.1.2,Linux x86_64,60,,,0,20,20,69,1,List2,SNOIKS,NA,,NA,NA,NA,ALBRIGHT/HAYES
,,,,,,,,,,,,,,,,4.128893663,4.940005,phishal,,,,,,,full,audio/stimuli/FSHAEL_full.wav,,5ec76194079cdc1b61767c3b,32,Male,English,United States,2020-08-13_12h21.41.878,Experiment1,2020.1.2,Linux x86_64,60,,,0,21,21,21,1,List2,FSHAEL,fric/fric,FSH,invalid,1,medium,SCHOLES
,,,,,,,,,,,,,,,,5.009667025,4.70724,grine,,,,,,,no,audio/stimuli/GRAHN_no.wav,,5ec76194079cdc1b61767c3b,32,Male,English,United States,2020-08-13_12h21.41.878,Experiment1,2020.1.2,Linux x86_64,60,,,0,22,22,0,1,List2,GRAHN,stop/liquid,GR,valid,18,good,SCHOLES
,,,,,,,,,,,,,,,,3.03329753,3.90623,bren,,,,,,,no,audio/stimuli/VREHN_no.wav,,5ec76194079cdc1b61767c3b,32,Male,English,United States,2020-08-13_12h21.41.878,Experiment1,2020.1.2,Linux x86_64,60,,,0,23,23,16,1,List2,VREHN,fric/liquid,VR,invalid,2,medium,SCHOLES
,,,,,,,,,,,,,,,,3.84962406,4.245555,saplick,,,,,,,filler,audio/fillers/SPLIHK.wav,,5ec76194079cdc1b61767c3b,32,Male,English,United States,2020-08-13_12h21.41.878,Experiment1,2020.1.2,Linux x86_64,60,,,0,24,24,53,1,List2,SPLIHK,NA,,NA,NA,NA,NA
,,,,,,,,,,,,,,,,3.967776584,3.576755,smate,,,,,,,full,audio/stimuli/SMEYT_full.wav,,5ec76194079cdc1b61767c3b,32,Male,English,United States,2020-08-13_12h21.41.878,Experiment1,2020.1.2,Linux x86_64,60,,,0,25,25,11,1,List2,SMEYT,fric/nasal,SM,valid,9,good,SCHOLES
,,,,,,,,,,,,,,,,5.954887218,4.653875,zapun,,,,,,,no,audio/stimuli/ZPAHN_full.wav,,5ec76194079cdc1b61767c3b,32,Male,English,United States,2020-08-13_12h21.41.878,Experiment1,2020.1.2,Linux x86_64,60,,,0,26,26,30,1,List2,ZPAHN,fric/stop,ZP,invalid,4,bad,SCHOLES
,,,,,,,,,,,,,,,,1.056928034,5.037515,vit,,,,,,,no,audio/stimuli/VZAEL_no.wav,,5ec76194079cdc1b61767c3b,32,Male,English,United States,2020-08-13_12h21.41.878,Experiment1,2020.1.2,Linux x86_64,60,,,0,27,27,36,1,List2,VZAEL,fric/fric,VZ,invalid,1,bad,SCHOLES
,,,,,,,,,,,,,,,,3.989258861,5.3617,regone,,,,,,,filler,audio/fillers/rgaan.wav,,5ec76194079cdc1b61767c3b,32,Male,English,United States,2020-08-13_12h21.41.878,Experiment1,2020.1.2,Linux x86_64,60,,,0,28,28,90,1,List2,rgaan,NA,,NA,NA,NA,SCHOLESadapt
,,,,,,,,,,,,,,,,4.859291085,4.355975,melong,,,,,,,full,audio/stimuli/VLAANG_full.wav,,5ec76194079cdc1b61767c3b,32,Male,English,United States,2020-08-13_12h21.41.878,Experiment1,2020.1.2,Linux x86_64,60,,,0,29,29,29,1,List2,VLAANG,fric/liquid,VL,invalid,0,medium,SCHOLES
,,,,,,,,,,,,,,,,4.128893663,4.212065,deange,,,,,,,filler,audio/fillers/DEYNDH.wav,,5ec76194079cdc1b61767c3b,32,Male,English,United States,2020-08-13_12h21.41.878,Experiment1,2020.1.2,Linux x86_64,60,,,0,30,30,66,1,List2,DEYNDH,NA,,NA,NA,NA,NA
,,,,,,,,,,,,,,,,4.118152524,3.7099,weige,,,,,,,filler,audio/fillers/PWIHZH.wav,,5ec76194079cdc1b61767c3b,32,Male,English,United States,2020-08-13_12h21.41.878,Experiment1,2020.1.2,Linux x86_64,60,,,0,31,31,77,1,List2,PWIHZH,NA,,NA,NA,NA,ALBRIGTHadapt
,,,,,,,,,,,,,,,,4.085929108,4.17329,phatette,,,,,,,full,audio/stimuli/FTEHT_full.wav,,5ec76194079cdc1b61767c3b,32,Male,English,United States,2020-08-13_12h21.41.878,Experiment1,2020.1.2,Linux x86_64,60,,,0,32,32,25,1,List2,FTEHT,fric/stop,FT,invalid,2,medium,SCHOLES
,,,,,,,,,,,,,,,,4.988184748,6.140105,vrol,,,,,,,no,audio/stimuli/FRUHL_no.wav,,5ec76194079cdc1b61767c3b,32,Male,English,United States,2020-08-13_12h21.41.878,Experiment1,2020.1.2,Linux x86_64,60,,,0,33,33,8,1,List2,FRUHL,fric/liquid,FR,valid,3,good,SCHOLES
,,,,,,,,,,,,,,,,2.850698174,5.236325,phatate,,,,,,,no,audio/stimuli/FTEYT_no.wav,,5ec76194079cdc1b61767c3b,32,Male,English,United States,2020-08-13_12h21.41.878,Experiment1,2020.1.2,Linux x86_64,60,,,0,34,34,26,1,List2,FTEYT,fric/stop,FT,invalid,4,medium,SCHOLES
,,,,,,,,,,,,,,,,4.923737916,3.970235,cheol,,,,,,,filler,audio/fillers/chuwl.wav,,5ec76194079cdc1b61767c3b,32,Male,English,United States,2020-08-13_12h21.41.878,Experiment1,2020.1.2,Linux x86_64,60,,,0,35,35,78,1,List2,chuwl,NA,,NA,NA,NA,ALBRIGHT/HAYES
,,,,,,,,,,,,,,,,4.15037594,3.47593,garen,,,,,,,full,audio/stimuli/GREHN_full.wav,,5ec76194079cdc1b61767c3b,32,Male,English,United States,2020-08-13_12h21.41.878,Experiment1,2020.1.2,Linux x86_64,60,,,0,36,36,1,1,List2,GREHN,stop/liquid,GR,valid,11,good,SCHOLES
,,,,,,,,,,,,,,,,5.825993555,4.471725,doonge,,,,,,,filler,audio/fillers/DUWNDH.wav,,5ec76194079cdc1b61767c3b,32,Male,English,United States,2020-08-13_12h21.41.878,Experiment1,2020.1.2,Linux x86_64,60,,,0,37,37,68,1,List2,DUWNDH,NA,,NA,NA,NA,NA
,,,,,,,,,,,,,,,,3.957035446,4.188685,brung,,,,,,,full,audio/stimuli/VRAAN_full.wav,,5ec76194079cdc1b61767c3b,32,Male,English,United States,2020-08-13_12h21.41.878,Experiment1,2020.1.2,Linux x86_64,60,,,0,38,38,17,1,List2,VRAAN,fric/liquid,VR,invalid,2,medium,SCHOLES
,,,,,,,,,,,,,,,,4.22556391,10.097045,phatat,,,,,,,no,audio/stimuli/FTAET_no.wav,,5ec76194079cdc1b61767c3b,32,Male,English,United States,2020-08-13_12h21.41.878,Experiment1,2020.1.2,Linux x86_64,60,,,0,39,39,24,1,List2,FTAET,fric/stop,FT,invalid,5,medium,SCHOLES
,,,,,,,,,,,,,,,,3.172932331,5.313455,vanesh,,,,,,,full,audio/stimuli/VNIHSH_full.wav,,5ec76194079cdc1b61767c3b,32,Male,English,United States,2020-08-13_12h21.41.878,Experiment1,2020.1.2,Linux x86_64,60,,,0,40,40,33,1,List2,VNIHSH,fric/nasal,VN,invalid,1,bad,SCHOLES
,,,,,,,,,,,,,,,,3.151450054,3.67664,stoosh,,,,,,,no,audio/stimuli/STUWSH_no.wav,,5ec76194079cdc1b61767c3b,32,Male,English,United States,2020-08-13_12h21.41.878,Experiment1,2020.1.2,Linux x86_64,60,,,0,41,41,4,1,List2,STUWSH,fric/stop,ST,valid,10,good,SCHOLES
,,,,,,,,,,,,,,,,4.784103115,3.522015,skeesh,,,,,,,no,audio/stimuli/SKIYSH_no.wav,,5ec76194079cdc1b61767c3b,32,Male,English,United States,2020-08-13_12h21.41.878,Experiment1,2020.1.2,Linux x86_64,60,,,0,42,42,20,1,List2,SKIYSH,fric/stop,SK,valid,7,medium,SCHOLES
,,,,,,,,,,,,,,,,3.935553169,3.84868,grielg,,,,,,,filler,audio/fillers/KRIHLG.wav,,5ec76194079cdc1b61767c3b,32,Male,English,United States,2020-08-13_12h21.41.878,Experiment1,2020.1.2,Linux x86_64,60,,,0,43,43,72,1,List2,KRIHLG,NA,,NA,NA,NA,ALBRIGHT/HAYES
,,,,,,,,,,,,,,,,3.140708915,5.223295,bwage,,,,,,,filler,audio/fillers/PWEYZH.wav,,5ec76194079cdc1b61767c3b,32,Male,English,United States,2020-08-13_12h21.41.878,Experiment1,2020.1.2,Linux x86_64,60,,,0,44,44,76,1,List2,PWEYZH,NA,,NA,NA,NA,ALBRIGHTadapt
,,,,,,,,,,,,,,,,3.215896885,4.55586,greelg,,,,,,,filler,audio/fillers/KRAHLG.wav,,5ec76194079cdc1b61767c3b,32,Male,English,United States,2020-08-13_12h21.41.878,Experiment1,2020.1.2,Linux x86_64,60,,,0,45,45,73,1,List2,KRAHLG,NA,,NA,NA,NA,ALBRIGHT/HAYES
,,,,,,,,,,,,,,,,4.848549946,3.970945,smat,,,,,,,full,audio/stimuli/SMAET_full.wav,,5ec76194079cdc1b61767c3b,32,Male,English,United States,2020-08-13_12h21.41.878,Experiment1,2020.1.2,Linux x86_64,60,,,0,46,46,9,1,List2,SMAET,fric/nasal,SM,valid,13,good,SCHOLES
,,,,,,,,,,,,,,,,5.235230934,4.128655,straf,,,,,,,filler,audio/fillers/STRAEF.wav,,5ec76194079cdc1b61767c3b,32,Male,English,United States,2020-08-13_12h21.41.878,Experiment1,2020.1.2,Linux x86_64,60,,,0,47,47,45,1,List2,STRAEF,NA,,NA,NA,NA,NA
,,,,,,,,,,,,,,,,3.935553169,3.74245,twick,,,,,,,filler,audio/fillers/VTLIHK.wav,,5ec76194079cdc1b61767c3b,32,Male,English,United States,2020-08-13_12h21.41.878,Experiment1,2020.1.2,Linux x86_64,60,,,0,48,48,48,1,List2,VTLIHK,NA,,NA,NA,NA,NA
,,,,,,,,,,,,,,,,4,4.98809,baneesh,,,,,,,full,audio/stimuli/VNIYSH_full.wav,,5ec76194079cdc1b61767c3b,32,Male,English,United States,2020-08-13_12h21.41.878,Experiment1,2020.1.2,Linux x86_64,60,,,0,49,49,35,1,List2,VNIYSH,fric/nasal,VN,invalid,0,bad,SCHOLES
,,,,,,,,,,,,,,,,3.205155747,5.56118,regun,,,,,,,filler,audio/fillers/rgahn.wav,,5ec76194079cdc1b61767c3b,32,Male,English,United States,2020-08-13_12h21.41.878,Experiment1,2020.1.2,Linux x86_64,60,,,0,50,50,91,1,List2,rgahn,NA,,NA,NA,NA,SCHOLESadapt
,,,,,,,,,,,,,,,,3.892588614,3.42678,geuz,,,,,,,filler,audio/fillers/guhz.wav,,5ec76194079cdc1b61767c3b,32,Male,English,United States,2020-08-13_12h21.41.878,Experiment1,2020.1.2,Linux x86_64,60,,,0,51,51,83,1,List2,guhz,NA,,NA,NA,NA,ALBRIGHT/HAYES
,,,,,,,,,,,,,,,,4.96670247,5.360375,fluckt,,,,,,,filler,audio/fillers/VAHPT.wav,,5ec76194079cdc1b61767c3b,32,Male,English,United States,2020-08-13_12h21.41.878,Experiment1,2020.1.2,Linux x86_64,60,,,0,52,52,65,1,List2,VAHPT,NA,,NA,NA,NA,NA
,,,,,,,,,,,,,,,,3.967776584,4.223085,loon,,,,,,,no,audio/stimuli/VLUWNG_no.wav,,5ec76194079cdc1b61767c3b,32,Male,English,United States,2020-08-13_12h21.41.878,Experiment1,2020.1.2,Linux x86_64,60,,,0,53,53,28,1,List2,VLUWNG,fric/liquid,VL,invalid,0,medium,SCHOLES
,,,,,,,,,,,,,,,,3.817400644,3.37682,vrawl,,,,,,,full,audio/stimuli/FRAAL_full.wav,,5ec76194079cdc1b61767c3b,32,Male,English,United States,2020-08-13_12h21.41.878,Experiment1,2020.1.2,Linux x86_64,60,,,0,54,54,7,1,List2,FRAAL,fric/liquid,FR,valid,12,good,SCHOLES
,,,,,,,,,,,,,,,,4.053705693,3.271255,soof,,,,,,,filler,audio/fillers/SUWF.wav,,5ec76194079cdc1b61767c3b,32,Male,English,United States,2020-08-13_12h21.41.878,Experiment1,2020.1.2,Linux x86_64,60,,,0,55,55,58,1,List2,SUWF,NA,,NA,NA,NA,NA
,,,,,,,,,,,,,,,,3.065520945,3.50584,balub,,,,,,,full,audio/stimuli/BLUWNG_full.wav,,5ec76194079cdc1b61767c3b,32,Male,English,United States,2020-08-13_12h21.41.878,Experiment1,2020.1.2,Linux x86_64,60,,,0,56,56,13,1,List2,BLUWNG,stop/liquid,BL,valid,6,good,SCHOLES
,,,,,,,,,,,,,,,,3.957035446,4.656475,zapon,,,,,,,no,audio/stimuli/ZPAAN_no.wav,,5ec76194079cdc1b61767c3b,32,Male,English,United States,2020-08-13_12h21.41.878,Experiment1,2020.1.2,Linux x86_64,60,,,0,57,57,32,1,List2,ZPAAN,fric/stop,ZP,invalid,3,bad,SCHOLES
,,,,,,,,,,,,,,,,3.151450054,4.37894,zerm,,,,,,,filler,audio/fillers/ZERNTH.wav,,5ec76194079cdc1b61767c3b,32,Male,English,United States,2020-08-13_12h21.41.878,Experiment1,2020.1.2,Linux x86_64,60,,,0,58,58,62,1,List2,ZERNTH,NA,,NA,NA,NA,NA
,,,,,,,,,,,,,,,,3.871106337,4.556445,tlern,,,,,,,filler,audio/fillers/FTLERN.wav,,5ec76194079cdc1b61767c3b,32,Male,English,United States,2020-08-13_12h21.41.878,Experiment1,2020.1.2,Linux x86_64,60,,,0,59,59,55,1,List2,FTLERN,NA,,NA,NA,NA,NA
,,,,,,,,,,,,,,,,3.03329753,4.879095,inteen,,,,,,,filler,audio/fillers/FTLIYN.wav,,5ec76194079cdc1b61767c3b,32,Male,English,United States,2020-08-13_12h21.41.878,Experiment1,2020.1.2,Linux x86_64,60,,,0,60,60,56,1,List2,FTLIYN,NA,,NA,NA,NA,NA
,,,,,,,,,,,,,,,,4.085929108,5.053245,zon,,,,,,,filler,audio/fillers/bzaan.wav,,5ec76194079cdc1b61767c3b,32,Male,English,United States,2020-08-13_12h21.41.878,Experiment1,2020.1.2,Linux x86_64,60,,,0,61,61,88,1,List2,bzaan,NA,,NA,NA,NA,ALBRIGHT
,,,,,,,,,,,,,,,,2.925886144,5.510385,noosh,,,,,,,no,audio/stimuli/VNUWSH_no.wav,,5ec76194079cdc1b61767c3b,32,Male,English,United States,2020-08-13_12h21.41.878,Experiment1,2020.1.2,Linux x86_64,60,,,0,62,62,34,1,List2,VNUWSH,fric/nasal,VN,invalid,0,bad,SCHOLES
,,,,,,,,,,,,,,,,4.07518797,6.42723,tlun,,,,,,,filler,audio/fillers/FTLAHN.wav,,5ec76194079cdc1b61767c3b,32,Male,English,United States,2020-08-13_12h21.41.878,Experiment1,2020.1.2,Linux x86_64,60,,,0,63,63,54,1,List2,FTLAHN,NA,,NA,NA,NA,NA
,,,,,,,,,,,,,,,,3.967776584,8.21107,splerk,,,,,,,filler,audio/fillers/SPLERK.wav,,5ec76194079cdc1b61767c3b,32,Male,English,United States,2020-08-13_12h21.41.878,Experiment1,2020.1.2,Linux x86_64,60,,,0,64,64,51,1,List2,SPLERK,NA,,NA,NA,NA,NA
,,,,,,,,,,,,,,,,4.096670247,3.96802,grillg,,,,,,,filler,audio/fillers/KROILG.wav,,5ec76194079cdc1b61767c3b,32,Male,English,United States,2020-08-13_12h21.41.878,Experiment1,2020.1.2,Linux x86_64,60,,,0,65,65,74,1,List2,KROILG,NA,,NA,NA,NA,ALBRIGHT/HAYES
,,,,,,,,,,,,,,,,3.108485499,3.803795,vrawl,,,,,,,no,audio/stimuli/FRAEL_no.wav,,5ec76194079cdc1b61767c3b,32,Male,English,United States,2020-08-13_12h21.41.878,Experiment1,2020.1.2,Linux x86_64,60,,,0,66,66,6,1,List2,FRAEL,fric/liquid,FR,valid,3,good,SCHOLES
,,,,,,,,,,,,,,,,3.957035446,4.771725,flage,,,,,,,filler,audio/fillers/PWAAZH.wav,,5ec76194079cdc1b61767c3b,32,Male,English,United States,2020-08-13_12h21.41.878,Experiment1,2020.1.2,Linux x86_64,60,,,0,67,67,75,1,List2,PWAAZH,NA,,NA,NA,NA,ALBRIGHTadapt
,,,,,,,,,,,,,,,,2.936627282,3.32408,zanth,,,,,,,filler,audio/fillers/ZAENTH.wav,,5ec76194079cdc1b61767c3b,32,Male,English,United States,2020-08-13_12h21.41.878,Experiment1,2020.1.2,Linux x86_64,60,,,0,68,68,61,1,List2,ZAENTH,NA,,NA,NA,NA,NA
,,,,,,,,,,,,,,,,2.839957035,5.6928,phashal,,,,,,,full,audio/stimuli/FSHUHL_full.wav,,5ec76194079cdc1b61767c3b,32,Male,English,United States,2020-08-13_12h21.41.878,Experiment1,2020.1.2,Linux x86_64,60,,,0,69,69,23,1,List2,FSHUHL,fric/fric,FSH,invalid,1,medium,SCHOLES
,,,,,,,,,,,,,,,,2.839957035,5.041555,phamate,,,,,,,full,audio/stimuli/FMEYT_full.wav,,5ec76194079cdc1b61767c3b,32,Male,English,United States,2020-08-13_12h21.41.878,Experiment1,2020.1.2,Linux x86_64,60,,,0,70,70,41,1,List2,FMEYT,fric/liquid,FM,invalid,3,bad,SCHOLES
,,,,,,,,,,,,,,,,3.838882922,3.585535,saff,,,,,,,filler,audio/fillers/SAEF.wav,,5ec76194079cdc1b61767c3b,32,Male,English,United States,2020-08-13_12h21.41.878,Experiment1,2020.1.2,Linux x86_64,60,,,0,71,71,57,1,List2,SAEF,NA,,NA,NA,NA,NA
,,,,,,,,,,,,,,,,4.687432868,4.21998,snix,,,,,,,filler,audio/fillers/SNIHKS.wav,,5ec76194079cdc1b61767c3b,32,Male,English,United States,2020-08-13_12h21.41.878,Experiment1,2020.1.2,Linux x86_64,60,,,0,72,72,71,1,List2,SNIHKS,NA,,NA,NA,NA,ALBRIGHT/HAYES
,,,,,,,,,,,,,,,,3.957035446,4.347145,brung,,,,,,,no,audio/stimuli/GRAAN_no.wav,,5ec76194079cdc1b61767c3b,32,Male,English,United States,2020-08-13_12h21.41.878,Experiment1,2020.1.2,Linux x86_64,60,,,0,73,73,2,1,List2,GRAAN,stop/liquid,GR,valid,13,good,SCHOLES
,,,,,,,,,,,,,,,,3.087003222,3.536375,bazal,,,,,,,full,audio/stimuli/VZAAL_full.wav,,5ec76194079cdc1b61767c3b,32,Male,English,United States,2020-08-13_12h21.41.878,Experiment1,2020.1.2,Linux x86_64,60,,,0,74,74,37,1,List2,VZAAL,fric/fric,VZ,invalid,2,bad,SCHOLES
,,,,,,,,,,,,,,,,4.859291085,4.829825,barun,,,,,,,full,audio/stimuli/VRAHN_full.wav,,5ec76194079cdc1b61767c3b,32,Male,English,United States,2020-08-13_12h21.41.878,Experiment1,2020.1.2,Linux x86_64,60,,,0,75,75,15,1,List2,VRAHN,fric/liquid,VR,invalid,4,medium,SCHOLES
,,,,,,,,,,,,,,,,4.010741139,4.62639,marun,,,,,,,no,audio/stimuli/NRAHNG_no.wav,,5ec76194079cdc1b61767c3b,32,Male,English,United States,2020-08-13_12h21.41.878,Experiment1,2020.1.2,Linux x86_64,60,,,0,76,76,42,1,List2,NRAHNG,nasal/liquid,NR,invalid,1,bad,SCHOLES
,,,,,,,,,,,,,,,,3.097744361,3.691765,sacoosh,,,,,,,full,audio/stimuli/SKUWSH_full.wav,,5ec76194079cdc1b61767c3b,32,Male,English,United States,2020-08-13_12h21.41.878,Experiment1,2020.1.2,Linux x86_64,60,,,0,77,77,19,1,List2,SKUWSH,fric/stop,SK,valid,4,medium,SCHOLES
,,,,,,,,,,,,,,,,5.11707841,4.38753,zen,,,,,,,filler,audio/fillers/bzehn.wav,,5ec76194079cdc1b61767c3b,32,Male,English,United States,2020-08-13_12h21.41.878,Experiment1,2020.1.2,Linux x86_64,60,,,0,78,78,89,1,List2,bzehn,NA,,NA,NA,NA,ALBRIGHT
,,,,,,,,,,,,,,,,2.668098818,6.47823,zapen,,,,,,,full,audio/stimuli/ZPEHN_full.wav,,5ec76194079cdc1b61767c3b,32,Male,English,United States,2020-08-13_12h21.41.878,Experiment1,2020.1.2,Linux x86_64,60,,,0,79,79,31,1,List2,ZPEHN,fric/stop,ZP,invalid,2,bad,SCHOLES
,,,,,,,,,,,,,,,,3.77443609,3.68149,naroon,,,,,,,full,audio/stimuli/NRUWNG_full.wav,,5ec76194079cdc1b61767c3b,32,Male,English,United States,2020-08-13_12h21.41.878,Experiment1,2020.1.2,Linux x86_64,60,,,0,80,80,43,1,List2,NRUWNG,nasal/liquid,NR,invalid,0,bad,SCHOLES
,,,,,,,,,,,,,,,,4.07518797,4.604415,zull,,,,,,,no,audio/stimuli/VZAHL_no.wav,,5ec76194079cdc1b61767c3b,32,Male,English,United States,2020-08-13_12h21.41.878,Experiment1,2020.1.2,Linux x86_64,60,,,0,81,81,38,1,List2,VZAHL,fric/fric,VZ,invalid,0,bad,SCHOLES
,,,,,,,,,,,,,,,,3.215896885,3.539865,satish,,,,,,,full,audio/stimuli/STIHSH_full.wav,,5ec76194079cdc1b61767c3b,32,Male,English,United States,2020-08-13_12h21.41.878,Experiment1,2020.1.2,Linux x86_64,60,,,0,82,82,3,1,List2,STIHSH,fric/stop,ST,valid,9,good,SCHOLES
,,,,,,,,,,,,,,,,3.763694952,3.361105,regoon,,,,,,,filler,audio/fillers/rguwn.wav,,5ec76194079cdc1b61767c3b,32,Male,English,United States,2020-08-13_12h21.41.878,Experiment1,2020.1.2,Linux x86_64,60,,,0,83,83,92,1,List2,rguwn,NA,,NA,NA,NA,SCHOLESadapt
,,,,,,,,,,,,,,,,4.945220193,4.086295,zunn,,,,,,,filler,audio/fillers/ZAHNTH.wav,,5ec76194079cdc1b61767c3b,32,Male,English,United States,2020-08-13_12h21.41.878,Experiment1,2020.1.2,Linux x86_64,60,,,0,84,84,60,1,List2,ZAHNTH,NA,,NA,NA,NA,NA
,,,,,,,,,,,,,,,,4.955961332,5.22116,jail,,,,,,,filler,audio/fillers/cheyl.wav,,5ec76194079cdc1b61767c3b,32,Male,English,United States,2020-08-13_12h21.41.878,Experiment1,2020.1.2,Linux x86_64,60,,,0,85,85,80,1,List2,cheyl,NA,,NA,NA,NA,ALBRIGHT/HAYES
,,,,,,,,,,,,,,,,4.257787325,4.35519,smet,,,,,,,no,audio/stimuli/SMEHT_no.wav,,5ec76194079cdc1b61767c3b,32,Male,English,United States,2020-08-13_12h21.41.878,Experiment1,2020.1.2,Linux x86_64,60,,,0,86,86,10,1,List2,SMEHT,fric/nasal,SM,valid,8,good,SCHOLES
,,,,,,,,,,,,,,,,3.215896885,6.103545,lunt,,,,,,,filler,audio/fillers/muwnt.wav,,5ec76194079cdc1b61767c3b,32,Male,English,United States,2020-08-13_12h21.41.878,Experiment1,2020.1.2,Linux x86_64,60,,,0,87,87,85,1,List2,muwnt,NA,,NA,NA,NA,ALBRIGHT/HAYESadapt
,,,,,,,,,,,,,,,,4.880773362,5.611225,balong,,,,,,,full,audio/stimuli/VLAHNG_full.wav,,5ec76194079cdc1b61767c3b,32,Male,English,United States,2020-08-13_12h21.41.878,Experiment1,2020.1.2,Linux x86_64,60,,,0,88,88,27,1,List2,VLAHNG,fric/liquid,VL,invalid,4,medium,SCHOLES
,,,,,,,,,,,,,,,,3.001074114,3.58027,stroof,,,,,,,filler,audio/fillers/STRUWF.wav,,5ec76194079cdc1b61767c3b,32,Male,English,United States,2020-08-13_12h21.41.878,Experiment1,2020.1.2,Linux x86_64,60,,,0,89,89,47,1,List2,STRUWF,NA,,NA,NA,NA,NA
,,,,,,,,,,,,,,,,3.77443609,3.435515,spluck,,,,,,,filler,audio/fillers/SPLAHK.wav,,5ec76194079cdc1b61767c3b,32,Male,English,United States,2020-08-13_12h21.41.878,Experiment1,2020.1.2,Linux x86_64,60,,,0,90,90,52,1,List2,SPLAHK,NA,,NA,NA,NA,NA
,,,,,,,,,,,,,,,,3.935553169,4.10401,geez,,,,,,,filler,audio/fillers/giyz.wav,,5ec76194079cdc1b61767c3b,32,Male,English,United States,2020-08-13_12h21.41.878,Experiment1,2020.1.2,Linux x86_64,60,,,0,91,91,82,1,List2,giyz,NA,,NA,NA,NA,ALBRIGHT/HAYES
,,,,,,,,,,,,,,,,6.116004296,3.8106,tlack,,,,,,,filler,audio/fillers/VTLAEK.wav,,5ec76194079cdc1b61767c3b,32,Male,English,United States,2020-08-13_12h21.41.878,Experiment1,2020.1.2,Linux x86_64,60,,,0,92,92,49,1,List2,VTLAEK,NA,,NA,NA,NA,NA
