key_resp_Consent1.keys,key_resp_Consent1.rt,key_resp_Consent2.keys,key_resp_Consent2.rt,key_resp_Consent3.keys,key_resp_Consent3.rt,key_resp_2.keys,key_resp_2.rt,ConsentResponse.keys,ConsentResponse.rt,key_resp.keys,key_resp.rt,key_expIntroSpacebar.keys,key_expIntroSpacebar.rt,key_practiceIntroSpacebar.keys,key_practiceIntroSpacebar.rt,Rating.response,Rating.rt,PerceivedInput,practiceTrials.thisRepN,practiceTrials.thisTrialN,practiceTrials.thisN,practiceTrials.thisIndex,practiceTrials.ran,Word,Type,Soundfile,SoundfileOriginal,participant,Age,Gender,NativeLanguage,Country of Residence,date,expName,psychopyVersion,OS,frameRate,STUDY_ID,SESSION_ID,key_testIntroSpacebar.keys,testTrials.thisRepN,testTrials.thisTrialN,testTrials.thisN,testTrials.thisIndex,testTrials.ran,List,stimuli,ClusterType,Onset,GrossStatus,NeighborhoodDensity,OriginalRating,ScholesJudgments,SourceStudy
space,5.18902,space,1.641435,space,1.73213,space,7.37619,y,5.016355,space,1.832445,space,0.635845,space,1.56249,1.087053571,9.439455,eeeh,0,0,0,3,1,GLIYD,practice,audio/practice/GLIYD.practice.wav,practice/GLIYD.practice.wav,5caa0fdf92fdc200019ea297,35,male,English,United States,2020-09-07_17h17.45.829,Experiment1,2020.1.2,Win32,60,5f567f87b176470ae9507f22,5f56a31faa728c10a728e605,,,,,,,,,,,,,,,
,,,,,,,,,,,,,,,,7,5.81419,run,0,1,1,6,1,LAHM,practice,audio/practice/LAHM.practice.wav,practice/LAHM.practice.wav,5caa0fdf92fdc200019ea297,35,male,English,United States,2020-09-07_17h17.45.829,Experiment1,2020.1.2,Win32,60,5f567f87b176470ae9507f22,5f56a31faa728c10a728e605,,,,,,,,,,,,,,,
,,,,,,,,,,,,,,,,6.05078125,4.319595,thing,0,2,2,4,1,KLIHG,practice,audio/practice/KLIHG.practice.wav,practice/KLIHG.practice.wav,5caa0fdf92fdc200019ea297,35,male,English,United States,2020-09-07_17h17.45.829,Experiment1,2020.1.2,Win32,60,5f567f87b176470ae9507f22,5f56a31faa728c10a728e605,,,,,,,,,,,,,,,
,,,,,,,,,,,,,,,,1,5.015145,zee,0,3,3,2,1,BZIYN,practice,audio/practice/BZIYN.practice.wav,practice/BZIYN.practice.wav,5caa0fdf92fdc200019ea297,35,male,English,United States,2020-09-07_17h17.45.829,Experiment1,2020.1.2,Win32,60,5f567f87b176470ae9507f22,5f56a31faa728c10a728e605,,,,,,,,,,,,,,,
,,,,,,,,,,,,,,,,6.854352679,4.248485,preesed,0,4,4,10,1,PREHSP,practice,audio/practice/PREHSP.practice.wav,practice/PREHSP.practice.wav,5caa0fdf92fdc200019ea297,35,male,English,United States,2020-09-07_17h17.45.829,Experiment1,2020.1.2,Win32,60,5f567f87b176470ae9507f22,5f56a31faa728c10a728e605,,,,,,,,,,,,,,,
,,,,,,,,,,,,,,,,6.795758929,3.91429,slain,0,5,5,7,1,SLEYM,practice,audio/practice/SLEYM.practice.wav,practice/SLEYM.practice.wav,5caa0fdf92fdc200019ea297,35,male,English,United States,2020-09-07_17h17.45.829,Experiment1,2020.1.2,Win32,60,5f567f87b176470ae9507f22,5f56a31faa728c10a728e605,,,,,,,,,,,,,,,
,,,,,,,,,,,,,,,,1,4.312145,zoins,0,6,6,8,1,ZOYNKS,practice,audio/practice/ZOYNKS.practice.wav,practice/ZOYNKS.practice.wav,5caa0fdf92fdc200019ea297,35,male,English,United States,2020-09-07_17h17.45.829,Experiment1,2020.1.2,Win32,60,5f567f87b176470ae9507f22,5f56a31faa728c10a728e605,,,,,,,,,,,,,,,
,,,,,,,,,,,,,,,,6.963169643,3.716005,friend,0,7,7,5,1,KREHNTH,practice,audio/practice/KREHNTH.practice.wav,practice/KREHNTH.practice.wav,5caa0fdf92fdc200019ea297,35,male,English,United States,2020-09-07_17h17.45.829,Experiment1,2020.1.2,Win32,60,5f567f87b176470ae9507f22,5f56a31faa728c10a728e605,,,,,,,,,,,,,,,
,,,,,,,,,,,,,,,,7,4.28074,boo,0,8,8,9,1,PLUWT,practice,audio/practice/PLUWT.practice.wav,practice/PLUWT.practice.wav,5caa0fdf92fdc200019ea297,35,male,English,United States,2020-09-07_17h17.45.829,Experiment1,2020.1.2,Win32,60,5f567f87b176470ae9507f22,5f56a31faa728c10a728e605,,,,,,,,,,,,,,,
,,,,,,,,,,,,,,,,,,giggle,0,9,9,0,1,BIHBL,practice,audio/practice/BIHBL.practice.wav,practice/BIHBL.practice.wav,5caa0fdf92fdc200019ea297,35,male,English,United States,2020-09-07_17h17.45.829,Experiment1,2020.1.2,Win32,60,5f567f87b176470ae9507f22,5f56a31faa728c10a728e605,,,,,,,,,,,,,,,
,,,,,,,,,,,,,,,,6.135861962,3.738255,wad,0,10,10,1,1,BWAAD,practice,audio/practice/BWAAD.practice.wav,practice/BWAAD.practice.wav,5caa0fdf92fdc200019ea297,35,male,English,United States,2020-09-07_17h17.45.829,Experiment1,2020.1.2,Win32,60,5f567f87b176470ae9507f22,5f56a31faa728c10a728e605,,,,,,,,,,,,,,,
,,,,,,,,,,,,,,,,1.090004663,5.5553,zeen,,,,,,,filler,audio/fillers/bziyn.wav,,5caa0fdf92fdc200019ea297,35,male,English,United States,2020-09-07_17h17.45.829,Experiment1,2020.1.2,Win32,60,5f567f87b176470ae9507f22,5f56a31faa728c10a728e605,,0,0,0,54,1,List2,bziyn,stop/fric,BZ,NA,NA,NA,NA,ALBRIGHT
,,,,,,,,,,,,,,,,1.043370123,4.17454,zurthed,,,,,,,filler,audio/fillers/ZERNTH.wav,,5caa0fdf92fdc200019ea297,35,male,English,United States,2020-09-07_17h17.45.829,Experiment1,2020.1.2,Win32,60,5f567f87b176470ae9507f22,5f56a31faa728c10a728e605,,0,1,1,37,1,List2,ZERNTH,fric,ZP,NA,NA,NA,NA,NA
,,,,,,,,,,,,,,,,7,3.72986,maroonnum,,,,,,,full,audio/stimuli/NRUWNG_full.wav,,5caa0fdf92fdc200019ea297,35,male,English,United States,2020-09-07_17h17.45.829,Experiment1,2020.1.2,Win32,60,5f567f87b176470ae9507f22,5f56a31faa728c10a728e605,,0,2,2,28,1,List2,NRUWNG,nasal/liquid,NR,invalid,0,bad,8,SCHOLES
,,,,,,,,,,,,,,,,7,6.126495,zoe,,,,,,,no,audio/stimuli/VZAHL_no.wav,,5caa0fdf92fdc200019ea297,35,male,English,United States,2020-09-07_17h17.45.829,Experiment1,2020.1.2,Win32,60,5f567f87b176470ae9507f22,5f56a31faa728c10a728e605,,0,3,3,25,1,List2,VZAHL,fric/fric,VZ,invalid,0,bad,6,SCHOLES
,,,,,,,,,,,,,,,,5.837400902,4.456535,straffed,,,,,,,filler,audio/fillers/STRAEF.wav,,5caa0fdf92fdc200019ea297,35,male,English,United States,2020-09-07_17h17.45.829,Experiment1,2020.1.2,Win32,60,5f567f87b176470ae9507f22,5f56a31faa728c10a728e605,,0,4,4,30,1,List2,STRAEF,fric/stop/liquid,STR,NA,NA,NA,NA,NA
,,,,,,,,,,,,,,,,1,4.17578,smate,,,,,,,no,audio/stimuli/SMEYT_no.wav,,5caa0fdf92fdc200019ea297,35,male,English,United States,2020-09-07_17h17.45.829,Experiment1,2020.1.2,Win32,60,5f567f87b176470ae9507f22,5f56a31faa728c10a728e605,,0,5,5,7,1,List2,SMEYT,fric/nasal,SM,valid,9,good,32,SCHOLES
,,,,,,,,,,,,,,,,4.876729364,5.8824,meant,,,,,,,filler,audio/fillers/maent.wav,,5caa0fdf92fdc200019ea297,35,male,English,United States,2020-09-07_17h17.45.829,Experiment1,2020.1.2,Win32,60,5f567f87b176470ae9507f22,5f56a31faa728c10a728e605,,0,6,6,53,1,List2,maent,nasal,M,NA,NA,NA,NA,ALBRIGHT/HAYESadapt
,,,,,,,,,,,,,,,,6.84470698,4.09824,mate,,,,,,,no,audio/stimuli/FMEYT_no.wav,,5caa0fdf92fdc200019ea297,35,male,English,United States,2020-09-07_17h17.45.829,Experiment1,2020.1.2,Win32,60,5f567f87b176470ae9507f22,5f56a31faa728c10a728e605,,0,7,7,27,1,List2,FMEYT,fric/liquid,FM,invalid,3,bad,2,SCHOLES
,,,,,,,,,,,,,,,,7,5.76848,brawn,,,,,,,no,audio/stimuli/VRAAN_no.wav,,5caa0fdf92fdc200019ea297,35,male,English,United States,2020-09-07_17h17.45.829,Experiment1,2020.1.2,Win32,60,5f567f87b176470ae9507f22,5f56a31faa728c10a728e605,,0,8,8,11,1,List2,VRAAN,fric/liquid,VR,invalid,2,medium,19,SCHOLES
,,,,,,,,,,,,,,,,1.062023939,3.37789,gorun,,,,,,,full,audio/stimuli/GRAHN_full.wav,,5caa0fdf92fdc200019ea297,35,male,English,United States,2020-09-07_17h17.45.829,Experiment1,2020.1.2,Win32,60,5f567f87b176470ae9507f22,5f56a31faa728c10a728e605,,0,9,9,0,1,List2,GRAHN,stop/liquid,GR,valid,18,good,33,SCHOLES
,,,,,,,,,,,,,,,,1,5.490315,joyal,,,,,,,filler,audio/fillers/choil.wav,,5caa0fdf92fdc200019ea297,35,male,English,United States,2020-09-07_17h17.45.829,Experiment1,2020.1.2,Win32,60,5f567f87b176470ae9507f22,5f56a31faa728c10a728e605,,0,10,10,49,1,List2,choil,affric,CH,NA,NA,NA,NA,ALBRIGHT/HAYES
,,,,,,,,,,,,,,,,1,3.979265,vopt,,,,,,,filler,audio/fillers/VOWPT.wav,,5caa0fdf92fdc200019ea297,35,male,English,United States,2020-09-07_17h17.45.829,Experiment1,2020.1.2,Win32,60,5f567f87b176470ae9507f22,5f56a31faa728c10a728e605,,0,11,11,39,1,List2,VOWPT,fric,V,NA,NA,NA,NA,NA
,,,,,,,,,,,,,,,,5.939996891,4.76914,wiped,,,,,,,filler,audio/fillers/VAIPT.wav,,5caa0fdf92fdc200019ea297,35,male,English,United States,2020-09-07_17h17.45.829,Experiment1,2020.1.2,Win32,60,5f567f87b176470ae9507f22,5f56a31faa728c10a728e605,,0,12,12,38,1,List2,VAIPT,fric,V,NA,NA,NA,NA,NA
,,,,,,,,,,,,,,,,1.136639204,4.18728,zepun,,,,,,,full,audio/stimuli/ZPAHN_full.wav,,5caa0fdf92fdc200019ea297,35,male,English,United States,2020-09-07_17h17.45.829,Experiment1,2020.1.2,Win32,60,5f567f87b176470ae9507f22,5f56a31faa728c10a728e605,,0,13,13,20,1,List2,ZPAHN,fric/stop,ZP,invalid,4,bad,1,SCHOLES
,,,,,,,,,,,,,,,,1.117985388,5.03468,berun,,,,,,,full,audio/stimuli/VRAHN_full.wav,,5caa0fdf92fdc200019ea297,35,male,English,United States,2020-09-07_17h17.45.829,Experiment1,2020.1.2,Win32,60,5f567f87b176470ae9507f22,5f56a31faa728c10a728e605,,0,14,14,10,1,List2,VRAHN,fric/liquid,VR,invalid,4,medium,19,SCHOLES
,,,,,,,,,,,,,,,,1.845484222,3.89629,dunge,,,,,,,filler,audio/fillers/DAHNDH.wav,,5caa0fdf92fdc200019ea297,35,male,English,United States,2020-09-07_17h17.45.829,Experiment1,2020.1.2,Win32,60,5f567f87b176470ae9507f22,5f56a31faa728c10a728e605,,0,15,15,41,1,List2,DAHNDH,stop,D,NA,NA,NA,NA,NA
,,,,,,,,,,,,,,,,1.127312296,5.820345,mewrong,,,,,,,no,audio/stimuli/NRAANG_no.wav,,5caa0fdf92fdc200019ea297,35,male,English,United States,2020-09-07_17h17.45.829,Experiment1,2020.1.2,Win32,60,5f567f87b176470ae9507f22,5f56a31faa728c10a728e605,,0,16,16,29,1,List2,NRAANG,nasal/liquid,NR,invalid,0,bad,8,SCHOLES
,,,,,,,,,,,,,,,,1.164619928,5.170765,regon,,,,,,,filler,audio/fillers/rgaan.wav,,5caa0fdf92fdc200019ea297,35,male,English,United States,2020-09-07_17h17.45.829,Experiment1,2020.1.2,Win32,60,5f567f87b176470ae9507f22,5f56a31faa728c10a728e605,,0,17,17,56,1,List2,rgaan,liquid/stop,RG,NA,NA,NA,NA,SCHOLESadapt
,,,,,,,,,,,,,,,,6.89134152,3.94287,shelf,,,,,,,no,audio/stimuli/FSHUHL_no.wav,,5caa0fdf92fdc200019ea297,35,male,English,United States,2020-09-07_17h17.45.829,Experiment1,2020.1.2,Win32,60,5f567f87b176470ae9507f22,5f56a31faa728c10a728e605,,0,18,18,15,1,List2,FSHUHL,fric/fric,FSH,invalid,1,medium,11,SCHOLES
,,,,,,,,,,,,,,,,1.090004663,3.991615,newsh,,,,,,,no,audio/stimuli/VNUWSH_no.wav,,5caa0fdf92fdc200019ea297,35,male,English,United States,2020-09-07_17h17.45.829,Experiment1,2020.1.2,Win32,60,5f567f87b176470ae9507f22,5f56a31faa728c10a728e605,,0,19,19,23,1,List2,VNUWSH,fric/nasal,VN,invalid,0,bad,1,SCHOLES
,,,,,,,,,,,,,,,,1.164619928,3.459565,froll,,,,,,,no,audio/stimuli/FRUHL_no.wav,,5caa0fdf92fdc200019ea297,35,male,English,United States,2020-09-07_17h17.45.829,Experiment1,2020.1.2,Win32,60,5f567f87b176470ae9507f22,5f56a31faa728c10a728e605,,0,20,20,5,1,List2,FRUHL,fric/liquid,FR,valid,3,good,29,SCHOLES
,,,,,,,,,,,,,,,,6.033265972,4.31208,chew,,,,,,,filler,audio/fillers/chuwl.wav,,5caa0fdf92fdc200019ea297,35,male,English,United States,2020-09-07_17h17.45.829,Experiment1,2020.1.2,Win32,60,5f567f87b176470ae9507f22,5f56a31faa728c10a728e605,,0,21,21,48,1,List2,chuwl,affric,CH,NA,NA,NA,NA,ALBRIGHT/HAYES
,,,,,,,,,,,,,,,,7,4.222965,taint,,,,,,,no,audio/stimuli/FTEYT_no.wav,,5caa0fdf92fdc200019ea297,35,male,English,United States,2020-09-07_17h17.45.829,Experiment1,2020.1.2,Win32,60,5f567f87b176470ae9507f22,5f56a31faa728c10a728e605,,0,22,22,17,1,List2,FTEYT,fric/stop,FT,invalid,4,medium,10,SCHOLES
,,,,,,,,,,,,,,,,1.071350847,4.355475,murnt,,,,,,,filler,audio/fillers/mernt.wav,,5caa0fdf92fdc200019ea297,35,male,English,United States,2020-09-07_17h17.45.829,Experiment1,2020.1.2,Win32,60,5f567f87b176470ae9507f22,5f56a31faa728c10a728e605,,0,23,23,52,1,List2,mernt,nasal,M,NA,NA,NA,NA,ALBRIGHT/HAYESadapt
,,,,,,,,,,,,,,,,1.015389398,3.56971,wiig,,,,,,,filler,audio/fillers/PWIHZH.wav,,5caa0fdf92fdc200019ea297,35,male,English,United States,2020-09-07_17h17.45.829,Experiment1,2020.1.2,Win32,60,5f567f87b176470ae9507f22,5f56a31faa728c10a728e605,,0,24,24,47,1,List2,PWIHZH,stop/glide,PW,NA,NA,NA,NA,ALBRIGTHadapt
,,,,,,,,,,,,,,,,6.173169594,4.318175,grilled,,,,,,,filler,audio/fillers/KRIHLG.wav,,5caa0fdf92fdc200019ea297,35,male,English,United States,2020-09-07_17h17.45.829,Experiment1,2020.1.2,Win32,60,5f567f87b176470ae9507f22,5f56a31faa728c10a728e605,,0,25,25,44,1,List2,KRIHLG,stop/liquid,KR,NA,NA,NA,NA,ALBRIGHT/HAYES
,,,,,,,,,,,,,,,,5.949323799,4.28536,brawn,,,,,,,no,audio/stimuli/GRAAN_no.wav,,5caa0fdf92fdc200019ea297,35,male,English,United States,2020-09-07_17h17.45.829,Experiment1,2020.1.2,Win32,60,5f567f87b176470ae9507f22,5f56a31faa728c10a728e605,,0,26,26,1,1,List2,GRAAN,stop/liquid,GR,valid,13,good,33,SCHOLES
,,,,,,,,,,,,,,,,1.127312296,3.394385,dange,,,,,,,filler,audio/fillers/DEYNDH.wav,,5caa0fdf92fdc200019ea297,35,male,English,United States,2020-09-07_17h17.45.829,Experiment1,2020.1.2,Win32,60,5f567f87b176470ae9507f22,5f56a31faa728c10a728e605,,0,27,27,40,1,List2,DEYNDH,stop,D,NA,NA,NA,NA,NA
,,,,,,,,,,,,,,,,1.192600653,3.636535,vinish,,,,,,,full,audio/stimuli/VNIHSH_full.wav,,5caa0fdf92fdc200019ea297,35,male,English,United States,2020-09-07_17h17.45.829,Experiment1,2020.1.2,Win32,60,5f567f87b176470ae9507f22,5f56a31faa728c10a728e605,,0,28,28,22,1,List2,VNIHSH,fric/nasal,VN,invalid,1,bad,1,SCHOLES
,,,,,,,,,,,,,,,,1,4.225945,growg,,,,,,,filler,audio/fillers/KRAHLG.wav,,5caa0fdf92fdc200019ea297,35,male,English,United States,2020-09-07_17h17.45.829,Experiment1,2020.1.2,Win32,60,5f567f87b176470ae9507f22,5f56a31faa728c10a728e605,,0,29,29,45,1,List2,KRAHLG,stop/liquid,KR,NA,NA,NA,NA,ALBRIGHT/HAYES
,,,,,,,,,,,,,,,,2.806155759,5.71858,splick,,,,,,,filler,audio/fillers/SPLIHK.wav,,5caa0fdf92fdc200019ea297,35,male,English,United States,2020-09-07_17h17.45.829,Experiment1,2020.1.2,Win32,60,5f567f87b176470ae9507f22,5f56a31faa728c10a728e605,,0,30,30,33,1,List2,SPLIHK,fric/stop/liquid,SPL,NA,NA,NA,NA,NA
,,,,,,,,,,,,,,,,1,3.779715,regoon,,,,,,,filler,audio/fillers/rguwn.wav,,5caa0fdf92fdc200019ea297,35,male,English,United States,2020-09-07_17h17.45.829,Experiment1,2020.1.2,Win32,60,5f567f87b176470ae9507f22,5f56a31faa728c10a728e605,,0,31,31,57,1,List2,rguwn,liquid/stop,RG,NA,NA,NA,NA,SCHOLESadapt
,,,,,,,,,,,,,,,,2.032022385,4.56186,femet,,,,,,,full,audio/stimuli/FMEHT_full.wav,,5caa0fdf92fdc200019ea297,35,male,English,United States,2020-09-07_17h17.45.829,Experiment1,2020.1.2,Win32,60,5f567f87b176470ae9507f22,5f56a31faa728c10a728e605,,0,32,32,26,1,List2,FMEHT,fric/liquid,FM,invalid,2,bad,2,SCHOLES
,,,,,,,,,,,,,,,,1.136639204,4.042645,snoiks,,,,,,,filler,audio/fillers/SNOIKS.wav,,5caa0fdf92fdc200019ea297,35,male,English,United States,2020-09-07_17h17.45.829,Experiment1,2020.1.2,Win32,60,5f567f87b176470ae9507f22,5f56a31faa728c10a728e605,,0,33,33,42,1,List2,SNOIKS,fric/nasal,SN,NA,NA,NA,NA,ALBRIGHT/HAYES
,,,,,,,,,,,,,,,,5.89336235,4.470655,blah,,,,,,,no,audio/stimuli/BLAANG_no.wav,,5caa0fdf92fdc200019ea297,35,male,English,United States,2020-09-07_17h17.45.829,Experiment1,2020.1.2,Win32,60,5f567f87b176470ae9507f22,5f56a31faa728c10a728e605,,0,34,34,9,1,List2,BLAANG,stop/liquid,BL,valid,5,good,31,SCHOLES
,,,,,,,,,,,,,,,,6.033265972,4.594235,cement,,,,,,,full,audio/stimuli/SMEHT_full.wav,,5caa0fdf92fdc200019ea297,35,male,English,United States,2020-09-07_17h17.45.829,Experiment1,2020.1.2,Win32,60,5f567f87b176470ae9507f22,5f56a31faa728c10a728e605,,0,35,35,6,1,List2,SMEHT,fric/nasal,SM,valid,8,good,32,SCHOLES
,,,,,,,,,,,,,,,,1.015389398,3.67541,zon,,,,,,,filler,audio/fillers/bzaan.wav,,5caa0fdf92fdc200019ea297,35,male,English,United States,2020-09-07_17h17.45.829,Experiment1,2020.1.2,Win32,60,5f567f87b176470ae9507f22,5f56a31faa728c10a728e605,,0,36,36,55,1,List2,bzaan,stop/fric,BZ,NA,NA,NA,NA,ALBRIGHT
,,,,,,,,,,,,,,,,1.062023939,3.086195,valume,,,,,,,full,audio/stimuli/VLUWNG_full.wav,,5caa0fdf92fdc200019ea297,35,male,English,United States,2020-09-07_17h17.45.829,Experiment1,2020.1.2,Win32,60,5f567f87b176470ae9507f22,5f56a31faa728c10a728e605,,0,37,37,18,1,List2,VLUWNG,fric/liquid,VL,invalid,0,medium,14,SCHOLES
,,,,,,,,,,,,,,,,1.080677755,3.54509,guzz,,,,,,,filler,audio/fillers/guhz.wav,,5caa0fdf92fdc200019ea297,35,male,English,United States,2020-09-07_17h17.45.829,Experiment1,2020.1.2,Win32,60,5f567f87b176470ae9507f22,5f56a31faa728c10a728e605,,0,38,38,51,1,List2,guhz,stop,GR,NA,NA,NA,NA,ALBRIGHT/HAYES
,,,,,,,,,,,,,,,,1.090004663,6.050045,fatet,,,,,,,full,audio/stimuli/FTEHT_full.wav,,5caa0fdf92fdc200019ea297,35,male,English,United States,2020-09-07_17h17.45.829,Experiment1,2020.1.2,Win32,60,5f567f87b176470ae9507f22,5f56a31faa728c10a728e605,,0,39,39,16,1,List2,FTEHT,fric/stop,FT,invalid,2,medium,10,SCHOLES
,,,,,,,,,,,,,,,,3.179232085,4.243265,saff,,,,,,,filler,audio/fillers/SAEF.wav,,5caa0fdf92fdc200019ea297,35,male,English,United States,2020-09-07_17h17.45.829,Experiment1,2020.1.2,Win32,60,5f567f87b176470ae9507f22,5f56a31faa728c10a728e605,,0,40,40,34,1,List2,SAEF,fric,S,NA,NA,NA,NA,NA
,,,,,,,,,,,,,,,,3.897404011,4.04312,satisch,,,,,,,full,audio/stimuli/STIHSH_full.wav,,5caa0fdf92fdc200019ea297,35,male,English,United States,2020-09-07_17h17.45.829,Experiment1,2020.1.2,Win32,60,5f567f87b176470ae9507f22,5f56a31faa728c10a728e605,,0,41,41,2,1,List2,STIHSH,fric/stop,ST,valid,9,good,33,SCHOLES
,,,,,,,,,,,,,,,,7,3.5319,baloon,,,,,,,full,audio/stimuli/BLUWNG_full.wav,,5caa0fdf92fdc200019ea297,35,male,English,United States,2020-09-07_17h17.45.829,Experiment1,2020.1.2,Win32,60,5f567f87b176470ae9507f22,5f56a31faa728c10a728e605,,0,42,42,8,1,List2,BLUWNG,stop/liquid,BL,valid,6,good,31,SCHOLES
,,,,,,,,,,,,,,,,6.173169594,4.78252,keys,,,,,,,filler,audio/fillers/giyz.wav,,5caa0fdf92fdc200019ea297,35,male,English,United States,2020-09-07_17h17.45.829,Experiment1,2020.1.2,Win32,60,5f567f87b176470ae9507f22,5f56a31faa728c10a728e605,,0,43,43,50,1,List2,giyz,stop,GR,NA,NA,NA,NA,ALBRIGHT/HAYES
,,,,,,,,,,,,,,,,1,5.48146,fashow,,,,,,,full,audio/stimuli/FSHAEL_full.wav,,5caa0fdf92fdc200019ea297,35,male,English,United States,2020-09-07_17h17.45.829,Experiment1,2020.1.2,Win32,60,5f567f87b176470ae9507f22,5f56a31faa728c10a728e605,,0,44,44,14,1,List2,FSHAEL,fric/fric,FSH,invalid,1,medium,11,SCHOLES
,,,,,,,,,,,,,,,,1.192600653,4.8188,streff,,,,,,,filler,audio/fillers/STREHF.wav,,5caa0fdf92fdc200019ea297,35,male,English,United States,2020-09-07_17h17.45.829,Experiment1,2020.1.2,Win32,60,5f567f87b176470ae9507f22,5f56a31faa728c10a728e605,,0,45,45,31,1,List2,STREHF,fric/stop/liquid,STR,NA,NA,NA,NA,NA
,,,,,,,,,,,,,,,,1.071350847,4.69383,snerks,,,,,,,filler,audio/fillers/SNERKS.wav,,5caa0fdf92fdc200019ea297,35,male,English,United States,2020-09-07_17h17.45.829,Experiment1,2020.1.2,Win32,60,5f567f87b176470ae9507f22,5f56a31faa728c10a728e605,,0,46,46,43,1,List2,SNERKS,fric/nasal,SN,NA,NA,NA,NA,ALBRIGHT/HAYES
,,,,,,,,,,,,,,,,1,3.1798,zepon,,,,,,,no,audio/stimuli/ZPAAN_no.wav,,5caa0fdf92fdc200019ea297,35,male,English,United States,2020-09-07_17h17.45.829,Experiment1,2020.1.2,Win32,60,5f567f87b176470ae9507f22,5f56a31faa728c10a728e605,,0,47,47,21,1,List2,ZPAAN,fric/stop,ZP,invalid,3,bad,1,SCHOLES
,,,,,,,,,,,,,,,,1.071350847,4.281695,furealnu,,,,,,,full,audio/stimuli/FRAEL_full.wav,,5caa0fdf92fdc200019ea297,35,male,English,United States,2020-09-07_17h17.45.829,Experiment1,2020.1.2,Win32,60,5f567f87b176470ae9507f22,5f56a31faa728c10a728e605,,0,48,48,4,1,List2,FRAEL,fric/liquid,FR,valid,3,good,29,SCHOLES
,,,,,,,,,,,,,,,,1.043370123,3.355575,saff,,,,,,,filler,audio/fillers/SEHF.wav,,5caa0fdf92fdc200019ea297,35,male,English,United States,2020-09-07_17h17.45.829,Experiment1,2020.1.2,Win32,60,5f567f87b176470ae9507f22,5f56a31faa728c10a728e605,,0,49,49,35,1,List2,SEHF,fric,S,NA,NA,NA,NA,NA
,,,,,,,,,,,,,,,,7,3.295595,sands,,,,,,,filler,audio/fillers/ZAENTH.wav,,5caa0fdf92fdc200019ea297,35,male,English,United States,2020-09-07_17h17.45.829,Experiment1,2020.1.2,Win32,60,5f567f87b176470ae9507f22,5f56a31faa728c10a728e605,,0,50,50,36,1,List2,ZAENTH,fric,ZP,NA,NA,NA,NA,NA
,,,,,,,,,,,,,,,,1,4.599185,squeesh,,,,,,,no,audio/stimuli/SKIYSH_no.wav,,5caa0fdf92fdc200019ea297,35,male,English,United States,2020-09-07_17h17.45.829,Experiment1,2020.1.2,Win32,60,5f567f87b176470ae9507f22,5f56a31faa728c10a728e605,,0,51,51,13,1,List2,SKIYSH,fric/stop,SK,valid,7,medium,20,SCHOLES
,,,,,,,,,,,,,,,,1.127312296,3.068665,steesh,,,,,,,no,audio/stimuli/STIYSH_no.wav,,5caa0fdf92fdc200019ea297,35,male,English,United States,2020-09-07_17h17.45.829,Experiment1,2020.1.2,Win32,60,5f567f87b176470ae9507f22,5f56a31faa728c10a728e605,,0,52,52,3,1,List2,STIYSH,fric/stop,ST,valid,9,good,33,SCHOLES
,,,,,,,,,,,,,,,,7,3.844395,long,,,,,,,no,audio/stimuli/VLAANG_no.wav,,5caa0fdf92fdc200019ea297,35,male,English,United States,2020-09-07_17h17.45.829,Experiment1,2020.1.2,Win32,60,5f567f87b176470ae9507f22,5f56a31faa728c10a728e605,,0,53,53,19,1,List2,VLAANG,fric/liquid,VL,invalid,0,medium,14,SCHOLES
,,,,,,,,,,,,,,,,1,4.606075,beige,,,,,,,filler,audio/fillers/PWEYZH.wav,,5caa0fdf92fdc200019ea297,35,male,English,United States,2020-09-07_17h17.45.829,Experiment1,2020.1.2,Win32,60,5f567f87b176470ae9507f22,5f56a31faa728c10a728e605,,0,54,54,46,1,List2,PWEYZH,stop/glide,PW,NA,NA,NA,NA,ALBRIGHTadapt
,,,,,,,,,,,,,,,,2.955386289,4.264205,visal,,,,,,,full,audio/stimuli/VZAEL_full.wav,,5caa0fdf92fdc200019ea297,35,male,English,United States,2020-09-07_17h17.45.829,Experiment1,2020.1.2,Win32,60,5f567f87b176470ae9507f22,5f56a31faa728c10a728e605,,0,55,55,24,1,List2,VZAEL,fric/fric,VZ,invalid,1,bad,6,SCHOLES
,,,,,,,,,,,,,,,,1,3.238075,sakish,,,,,,,full,audio/stimuli/SKIHSH_full.wav,,5caa0fdf92fdc200019ea297,35,male,English,United States,2020-09-07_17h17.45.829,Experiment1,2020.1.2,Win32,60,5f567f87b176470ae9507f22,5f56a31faa728c10a728e605,,0,56,56,12,1,List2,SKIHSH,fric/stop,SK,valid,8,medium,20,SCHOLES
,,,,,,,,,,,,,,,,1.071350847,2.981325,saplurk,,,,,,,filler,audio/fillers/SPLERK.wav,,5caa0fdf92fdc200019ea297,35,male,English,United States,2020-09-07_17h17.45.829,Experiment1,2020.1.2,Win32,60,5f567f87b176470ae9507f22,5f56a31faa728c10a728e605,,0,57,57,32,1,List2,SPLERK,fric/stop/liquid,SPL,NA,NA,NA,NA,NA
