<svg width="561" height="435" viewBox="0 0 561 435" fill="none" xmlns="http://www.w3.org/2000/svg">
<path d="M28.2279 377.419C-0.316177 363.038 -8.22289 325.935 11.9781 301.166L242.024 19.0968C259.654 -2.51993 291.562 -5.53057 312.924 12.4072L656.788 301.15C670.118 312.344 676.668 329.665 674.078 346.878L634.583 609.462C629.52 643.12 593.038 661.993 562.641 646.677L28.2279 377.419Z" fill="url(#paint0_linear_0_1)" fill-opacity="0.1"/>
<path d="M105.398 335.92C72.9784 332.73 52.218 299.886 63.2457 269.234L134.402 71.4489C143.15 47.1323 168.987 33.4886 194.002 39.9763L599.777 145.215C618.465 150.062 632.692 165.234 636.329 184.195L663.598 326.349C669.892 359.163 642.849 388.8 609.597 385.528L105.398 335.92Z" fill="url(#paint1_linear_0_1)" fill-opacity="0.07"/>
<defs>
<linearGradient id="paint0_linear_0_1" x1="118.995" y1="161.207" x2="684.19" y2="600.753" gradientUnits="userSpaceOnUse">
<stop stop-color="#3A3AF4"/>
<stop offset="1" stop-color="#3A3AF4" stop-opacity="0"/>
</linearGradient>
<linearGradient id="paint1_linear_0_1" x1="92.1634" y1="177.905" x2="547.828" y2="330.007" gradientUnits="userSpaceOnUse">
<stop stop-color="#3A3AF4"/>
<stop offset="1" stop-color="#3A3AF4" stop-opacity="0"/>
</linearGradient>
</defs>
</svg>