<mxfile host="65bd71144e">
    <diagram id="O4BxNEKQjHdTM0A2SPmk" name="Page-1">
        <mxGraphModel dx="1234" dy="1931" grid="1" gridSize="10" guides="1" tooltips="1" connect="1" arrows="1" fold="1" page="1" pageScale="1" pageWidth="850" pageHeight="1100" math="0" shadow="0">
            <root>
                <mxCell id="0"/>
                <mxCell id="1" parent="0"/>
                <mxCell id="XnvU4MSFBCVJozEuaAq0-7" value="&lt;font style=&quot;font-size: 36px&quot;&gt;Micro-Frontend&lt;/font&gt;" style="text;html=1;align=center;verticalAlign=middle;resizable=0;points=[];autosize=1;strokeColor=none;fillColor=none;" vertex="1" parent="1">
                    <mxGeometry x="70" y="40" width="260" height="30" as="geometry"/>
                </mxCell>
                <mxCell id="DaqgkCJ7wR6wR86JmLy2-7" value="&lt;font style=&quot;font-size: 24px&quot;&gt;The App&lt;/font&gt;" style="text;html=1;align=left;verticalAlign=middle;resizable=0;points=[];autosize=1;strokeColor=none;fillColor=none;" vertex="1" parent="1">
                    <mxGeometry x="80" y="-500" width="100" height="20" as="geometry"/>
                </mxCell>
                <mxCell id="DaqgkCJ7wR6wR86JmLy2-8" value="" style="rounded=0;whiteSpace=wrap;html=1;fontSize=36;" vertex="1" parent="1">
                    <mxGeometry x="80" y="-470" width="320" height="430" as="geometry"/>
                </mxCell>
                <mxCell id="DaqgkCJ7wR6wR86JmLy2-13" style="edgeStyle=none;html=1;fontSize=17;" edge="1" parent="1" source="DaqgkCJ7wR6wR86JmLy2-9">
                    <mxGeometry relative="1" as="geometry">
                        <mxPoint x="510" y="-260" as="targetPoint"/>
                    </mxGeometry>
                </mxCell>
                <mxCell id="DaqgkCJ7wR6wR86JmLy2-9" value="&lt;font style=&quot;line-height: 0.9 ; font-size: 17px&quot;&gt;&lt;b&gt;Product Page&lt;/b&gt;&lt;br&gt;&lt;ol&gt;&lt;li&gt;&lt;font style=&quot;line-height: 0.9 ; font-size: 17px&quot;&gt;Home Product Page&lt;/font&gt;&lt;/li&gt;&lt;li&gt;&lt;font style=&quot;line-height: 0.9 ; font-size: 17px&quot;&gt;Stocks Page&lt;/font&gt;&lt;/li&gt;&lt;li&gt;&lt;font style=&quot;line-height: 0.9 ; font-size: 17px&quot;&gt;Reksadana Page&lt;/font&gt;&lt;/li&gt;&lt;/ol&gt;&lt;/font&gt;" style="rounded=0;whiteSpace=wrap;html=1;fontSize=36;align=center;" vertex="1" parent="1">
                    <mxGeometry x="120" y="-405" width="230" height="140" as="geometry"/>
                </mxCell>
                <mxCell id="DaqgkCJ7wR6wR86JmLy2-14" style="edgeStyle=none;html=1;fontSize=17;" edge="1" parent="1" source="DaqgkCJ7wR6wR86JmLy2-10">
                    <mxGeometry relative="1" as="geometry">
                        <mxPoint x="510.0000000000002" y="-250" as="targetPoint"/>
                    </mxGeometry>
                </mxCell>
                <mxCell id="DaqgkCJ7wR6wR86JmLy2-10" value="&lt;font style=&quot;line-height: 0.9 ; font-size: 17px&quot;&gt;&lt;b&gt;Portofolio Page&lt;/b&gt;&lt;br&gt;&lt;ol&gt;&lt;li&gt;&lt;font style=&quot;line-height: 0.9 ; font-size: 17px&quot;&gt;Home Portofolio Page&lt;/font&gt;&lt;/li&gt;&lt;li&gt;&lt;font style=&quot;line-height: 0.9 ; font-size: 17px&quot;&gt;Dana Tabungan Page&lt;/font&gt;&lt;/li&gt;&lt;li&gt;&lt;font style=&quot;line-height: 0.9 ; font-size: 17px&quot;&gt;Dana Pensiun Page&lt;/font&gt;&lt;/li&gt;&lt;/ol&gt;&lt;/font&gt;" style="rounded=0;whiteSpace=wrap;html=1;fontSize=36;align=center;" vertex="1" parent="1">
                    <mxGeometry x="120" y="-245" width="230" height="140" as="geometry"/>
                </mxCell>
                <mxCell id="DaqgkCJ7wR6wR86JmLy2-11" value="UI Kit" style="shape=hexagon;perimeter=hexagonPerimeter2;whiteSpace=wrap;html=1;fixedSize=1;fontSize=17;" vertex="1" parent="1">
                    <mxGeometry x="515" y="-295" width="120" height="80" as="geometry"/>
                </mxCell>
                <mxCell id="DaqgkCJ7wR6wR86JmLy2-15" value="&lt;font style=&quot;font-size: 24px&quot;&gt;per Routes&lt;/font&gt;" style="text;html=1;align=left;verticalAlign=middle;resizable=0;points=[];autosize=1;strokeColor=none;fillColor=none;" vertex="1" parent="1">
                    <mxGeometry x="80" y="120" width="130" height="20" as="geometry"/>
                </mxCell>
                <mxCell id="DaqgkCJ7wR6wR86JmLy2-17" value="UI Kit 1.0.1" style="shape=hexagon;perimeter=hexagonPerimeter2;whiteSpace=wrap;html=1;fixedSize=1;fontSize=17;" vertex="1" parent="1">
                    <mxGeometry x="270" y="410" width="170" height="120" as="geometry"/>
                </mxCell>
                <mxCell id="oXbQf7-58PGmYxXzADcM-7" style="edgeStyle=none;html=1;fontSize=17;entryX=0.5;entryY=0;entryDx=0;entryDy=0;" edge="1" parent="1" source="DaqgkCJ7wR6wR86JmLy2-19" target="DaqgkCJ7wR6wR86JmLy2-17">
                    <mxGeometry relative="1" as="geometry">
                        <mxPoint x="355" y="400" as="targetPoint"/>
                    </mxGeometry>
                </mxCell>
                <mxCell id="DaqgkCJ7wR6wR86JmLy2-19" value="&lt;font style=&quot;line-height: 0.9 ; font-size: 17px&quot;&gt;&lt;b&gt;Product Page&lt;br&gt;&lt;/b&gt;&lt;/font&gt;" style="rounded=0;whiteSpace=wrap;html=1;fontSize=36;align=center;" vertex="1" parent="1">
                    <mxGeometry x="85" y="190" width="230" height="140" as="geometry"/>
                </mxCell>
                <mxCell id="oXbQf7-58PGmYxXzADcM-8" style="edgeStyle=none;html=1;entryX=0.5;entryY=0;entryDx=0;entryDy=0;fontSize=17;" edge="1" parent="1" source="oXbQf7-58PGmYxXzADcM-2" target="DaqgkCJ7wR6wR86JmLy2-17">
                    <mxGeometry relative="1" as="geometry"/>
                </mxCell>
                <mxCell id="oXbQf7-58PGmYxXzADcM-2" value="&lt;font style=&quot;line-height: 0.9 ; font-size: 17px&quot;&gt;&lt;b&gt;Portofolio Page&lt;br&gt;&lt;/b&gt;&lt;/font&gt;" style="rounded=0;whiteSpace=wrap;html=1;fontSize=36;align=center;" vertex="1" parent="1">
                    <mxGeometry x="375" y="190" width="230" height="140" as="geometry"/>
                </mxCell>
                <mxCell id="oXbQf7-58PGmYxXzADcM-3" value="/product/*" style="text;html=1;align=center;verticalAlign=middle;resizable=0;points=[];autosize=1;strokeColor=none;fillColor=none;fontSize=17;" vertex="1" parent="1">
                    <mxGeometry x="75" y="160" width="90" height="30" as="geometry"/>
                </mxCell>
                <mxCell id="oXbQf7-58PGmYxXzADcM-4" value="/portofolio/*" style="text;html=1;align=center;verticalAlign=middle;resizable=0;points=[];autosize=1;strokeColor=none;fillColor=none;fontSize=17;" vertex="1" parent="1">
                    <mxGeometry x="365" y="160" width="100" height="30" as="geometry"/>
                </mxCell>
                <mxCell id="oXbQf7-58PGmYxXzADcM-5" value="UI Kit 1.0.1" style="text;html=1;align=center;verticalAlign=middle;resizable=0;points=[];autosize=1;strokeColor=none;fillColor=none;fontSize=17;" vertex="1" parent="1">
                    <mxGeometry x="90" y="200" width="100" height="30" as="geometry"/>
                </mxCell>
                <mxCell id="oXbQf7-58PGmYxXzADcM-6" value="UI Kit 1.0.0" style="text;html=1;align=center;verticalAlign=middle;resizable=0;points=[];autosize=1;strokeColor=none;fillColor=none;fontSize=17;" vertex="1" parent="1">
                    <mxGeometry x="390" y="200" width="100" height="30" as="geometry"/>
                </mxCell>
                <mxCell id="oXbQf7-58PGmYxXzADcM-9" value="&lt;font style=&quot;font-size: 24px&quot;&gt;NPM&lt;/font&gt;" style="text;html=1;align=left;verticalAlign=middle;resizable=0;points=[];autosize=1;strokeColor=none;fillColor=none;" vertex="1" parent="1">
                    <mxGeometry x="80" y="620" width="70" height="20" as="geometry"/>
                </mxCell>
                <mxCell id="oXbQf7-58PGmYxXzADcM-20" value="" style="edgeStyle=none;html=1;fontSize=17;" edge="1" parent="1" source="oXbQf7-58PGmYxXzADcM-10" target="oXbQf7-58PGmYxXzADcM-19">
                    <mxGeometry relative="1" as="geometry"/>
                </mxCell>
                <mxCell id="oXbQf7-58PGmYxXzADcM-10" value="Product Lib 1.0.0" style="shape=hexagon;perimeter=hexagonPerimeter2;whiteSpace=wrap;html=1;fixedSize=1;fontSize=17;" vertex="1" parent="1">
                    <mxGeometry x="70" y="660" width="190" height="110" as="geometry"/>
                </mxCell>
                <mxCell id="oXbQf7-58PGmYxXzADcM-21" value="" style="edgeStyle=none;html=1;fontSize=17;" edge="1" parent="1" source="oXbQf7-58PGmYxXzADcM-11" target="oXbQf7-58PGmYxXzADcM-19">
                    <mxGeometry relative="1" as="geometry"/>
                </mxCell>
                <mxCell id="oXbQf7-58PGmYxXzADcM-11" value="Portofolio Lib 1.0.2" style="shape=hexagon;perimeter=hexagonPerimeter2;whiteSpace=wrap;html=1;fixedSize=1;fontSize=17;" vertex="1" parent="1">
                    <mxGeometry x="70" y="890" width="190" height="110" as="geometry"/>
                </mxCell>
                <mxCell id="oXbQf7-58PGmYxXzADcM-16" style="edgeStyle=none;html=1;fontSize=17;" edge="1" parent="1" source="oXbQf7-58PGmYxXzADcM-13">
                    <mxGeometry relative="1" as="geometry">
                        <mxPoint x="260" y="940" as="targetPoint"/>
                    </mxGeometry>
                </mxCell>
                <mxCell id="oXbQf7-58PGmYxXzADcM-17" style="edgeStyle=none;html=1;fontSize=17;" edge="1" parent="1" source="oXbQf7-58PGmYxXzADcM-13">
                    <mxGeometry relative="1" as="geometry">
                        <mxPoint x="260.0000000000002" y="720" as="targetPoint"/>
                    </mxGeometry>
                </mxCell>
                <mxCell id="oXbQf7-58PGmYxXzADcM-13" value="Main App" style="rounded=0;whiteSpace=wrap;html=1;fontSize=17;" vertex="1" parent="1">
                    <mxGeometry x="380" y="650" width="210" height="260" as="geometry"/>
                </mxCell>
                <mxCell id="oXbQf7-58PGmYxXzADcM-19" value="UI Kit" style="shape=hexagon;perimeter=hexagonPerimeter2;whiteSpace=wrap;html=1;fixedSize=1;fontSize=17;" vertex="1" parent="1">
                    <mxGeometry x="100" y="800" width="120" height="60" as="geometry"/>
                </mxCell>
                <mxCell id="oXbQf7-58PGmYxXzADcM-22" value="&lt;font style=&quot;font-size: 24px&quot;&gt;Module Federation&lt;/font&gt;" style="text;html=1;align=left;verticalAlign=middle;resizable=0;points=[];autosize=1;strokeColor=none;fillColor=none;" vertex="1" parent="1">
                    <mxGeometry x="80" y="1140" width="220" height="20" as="geometry"/>
                </mxCell>
                <mxCell id="oXbQf7-58PGmYxXzADcM-29" style="edgeStyle=none;html=1;entryX=1;entryY=0.5;entryDx=0;entryDy=0;fontSize=17;" edge="1" parent="1" source="oXbQf7-58PGmYxXzADcM-25" target="oXbQf7-58PGmYxXzADcM-26">
                    <mxGeometry relative="1" as="geometry"/>
                </mxCell>
                <mxCell id="oXbQf7-58PGmYxXzADcM-30" style="edgeStyle=none;html=1;entryX=1;entryY=0.5;entryDx=0;entryDy=0;fontSize=17;" edge="1" parent="1" source="oXbQf7-58PGmYxXzADcM-25" target="oXbQf7-58PGmYxXzADcM-28">
                    <mxGeometry relative="1" as="geometry"/>
                </mxCell>
                <mxCell id="oXbQf7-58PGmYxXzADcM-36" value="" style="edgeStyle=none;html=1;fontSize=17;" edge="1" parent="1" source="oXbQf7-58PGmYxXzADcM-25" target="oXbQf7-58PGmYxXzADcM-33">
                    <mxGeometry relative="1" as="geometry"/>
                </mxCell>
                <mxCell id="oXbQf7-58PGmYxXzADcM-25" value="" style="rounded=0;whiteSpace=wrap;html=1;fontSize=17;" vertex="1" parent="1">
                    <mxGeometry x="375" y="1240" width="355" height="260" as="geometry"/>
                </mxCell>
                <mxCell id="oXbQf7-58PGmYxXzADcM-34" value="" style="edgeStyle=none;html=1;fontSize=17;" edge="1" parent="1" source="oXbQf7-58PGmYxXzADcM-26" target="oXbQf7-58PGmYxXzADcM-33">
                    <mxGeometry relative="1" as="geometry"/>
                </mxCell>
                <mxCell id="oXbQf7-58PGmYxXzADcM-26" value="Product App" style="rounded=0;whiteSpace=wrap;html=1;fontSize=17;" vertex="1" parent="1">
                    <mxGeometry x="80" y="1180" width="200" height="110" as="geometry"/>
                </mxCell>
                <mxCell id="oXbQf7-58PGmYxXzADcM-35" value="" style="edgeStyle=none;html=1;fontSize=17;" edge="1" parent="1" source="oXbQf7-58PGmYxXzADcM-28" target="oXbQf7-58PGmYxXzADcM-33">
                    <mxGeometry relative="1" as="geometry"/>
                </mxCell>
                <mxCell id="oXbQf7-58PGmYxXzADcM-28" value="Portofolio App" style="rounded=0;whiteSpace=wrap;html=1;fontSize=17;" vertex="1" parent="1">
                    <mxGeometry x="80" y="1540" width="200" height="110" as="geometry"/>
                </mxCell>
                <mxCell id="oXbQf7-58PGmYxXzADcM-31" value="Product App" style="rounded=0;whiteSpace=wrap;html=1;fontSize=17;" vertex="1" parent="1">
                    <mxGeometry x="420" y="1260" width="120" height="60" as="geometry"/>
                </mxCell>
                <mxCell id="oXbQf7-58PGmYxXzADcM-32" value="Portofolio App" style="rounded=0;whiteSpace=wrap;html=1;fontSize=17;" vertex="1" parent="1">
                    <mxGeometry x="420" y="1405" width="120" height="60" as="geometry"/>
                </mxCell>
                <mxCell id="oXbQf7-58PGmYxXzADcM-33" value="UI Kit" style="rounded=0;whiteSpace=wrap;html=1;fontSize=17;" vertex="1" parent="1">
                    <mxGeometry x="80" y="1340" width="200" height="110" as="geometry"/>
                </mxCell>
                <mxCell id="oXbQf7-58PGmYxXzADcM-37" value="&lt;font style=&quot;font-size: 12px&quot;&gt;Server side&lt;br&gt;Next JS&lt;br&gt;&lt;/font&gt;" style="text;html=1;align=center;verticalAlign=middle;resizable=0;points=[];autosize=1;strokeColor=none;fillColor=none;fontSize=17;" vertex="1" parent="1">
                    <mxGeometry x="435" y="1340" width="80" height="50" as="geometry"/>
                </mxCell>
                <mxCell id="oXbQf7-58PGmYxXzADcM-39" value="&lt;font style=&quot;font-size: 12px&quot;&gt;Client side CRA&lt;/font&gt;" style="text;html=1;align=center;verticalAlign=middle;resizable=0;points=[];autosize=1;strokeColor=none;fillColor=none;fontSize=17;" vertex="1" parent="1">
                    <mxGeometry x="130" y="1250" width="100" height="30" as="geometry"/>
                </mxCell>
                <mxCell id="oXbQf7-58PGmYxXzADcM-40" value="&lt;font style=&quot;font-size: 12px&quot;&gt;antd, common component&lt;/font&gt;" style="text;html=1;align=center;verticalAlign=middle;resizable=0;points=[];autosize=1;strokeColor=none;fillColor=none;fontSize=17;" vertex="1" parent="1">
                    <mxGeometry x="105" y="1410" width="150" height="30" as="geometry"/>
                </mxCell>
                <mxCell id="oXbQf7-58PGmYxXzADcM-41" value="&lt;font style=&quot;font-size: 12px&quot;&gt;Server Side Next JS&lt;/font&gt;" style="text;html=1;align=center;verticalAlign=middle;resizable=0;points=[];autosize=1;strokeColor=none;fillColor=none;fontSize=17;" vertex="1" parent="1">
                    <mxGeometry x="115" y="1610" width="120" height="30" as="geometry"/>
                </mxCell>
                <mxCell id="oXbQf7-58PGmYxXzADcM-42" value="&lt;ul&gt;&lt;li&gt;&lt;span style=&quot;font-size: 20px&quot;&gt;&amp;nbsp;Non SPA&lt;/span&gt;&lt;/li&gt;&lt;li&gt;&lt;span style=&quot;font-size: 20px&quot;&gt;Heavy Infra&lt;/span&gt;&lt;/li&gt;&lt;/ul&gt;" style="text;html=1;align=center;verticalAlign=middle;resizable=0;points=[];autosize=1;strokeColor=none;fillColor=none;fontSize=12;" vertex="1" parent="1">
                    <mxGeometry x="635" y="210" width="160" height="70" as="geometry"/>
                </mxCell>
                <mxCell id="oXbQf7-58PGmYxXzADcM-43" value="" style="shape=image;verticalLabelPosition=bottom;labelBackgroundColor=#ffffff;verticalAlign=top;aspect=fixed;imageAspect=0;image=https://miro.medium.com/max/1400/1*mFqjLr2_9CK640kOCxOCVw.png;" vertex="1" parent="1">
                    <mxGeometry x="40" y="1760" width="720" height="270" as="geometry"/>
                </mxCell>
                <mxCell id="oXbQf7-58PGmYxXzADcM-44" value="Module Federation Pipeline" style="text;html=1;align=center;verticalAlign=middle;resizable=0;points=[];autosize=1;strokeColor=none;fillColor=none;fontSize=20;" vertex="1" parent="1">
                    <mxGeometry x="35" y="1725" width="260" height="30" as="geometry"/>
                </mxCell>
                <mxCell id="oXbQf7-58PGmYxXzADcM-45" value="&lt;font&gt;&lt;span style=&quot;font-size: 18px&quot;&gt;Middleware&lt;/span&gt;&lt;br&gt;&lt;font style=&quot;font-size: 13px&quot;&gt;Next JS&lt;/font&gt;&lt;br&gt;&lt;/font&gt;" style="shape=dataStorage;whiteSpace=wrap;html=1;fixedSize=1;fontSize=20;" vertex="1" parent="1">
                    <mxGeometry x="550" y="1340" width="160" height="80" as="geometry"/>
                </mxCell>
                <mxCell id="oXbQf7-58PGmYxXzADcM-47" style="edgeStyle=none;html=1;entryX=0.938;entryY=0.375;entryDx=0;entryDy=0;entryPerimeter=0;fontSize=18;" edge="1" parent="1" source="oXbQf7-58PGmYxXzADcM-46" target="oXbQf7-58PGmYxXzADcM-45">
                    <mxGeometry relative="1" as="geometry"/>
                </mxCell>
                <mxCell id="oXbQf7-58PGmYxXzADcM-46" value="User" style="shape=umlActor;verticalLabelPosition=bottom;verticalAlign=top;html=1;outlineConnect=0;fontSize=18;" vertex="1" parent="1">
                    <mxGeometry x="920" y="1340" width="30" height="60" as="geometry"/>
                </mxCell>
            </root>
        </mxGraphModel>
    </diagram>
</mxfile>