C1;C2;C3
0.9777321631;0.1424121073;0.4029896658
0.9229617634;0.7814709951;0.008028465159
0.211902772;0.2835430119;0.912208317
0.7910072127;0.76314263;0.3645286333
0.214375764;0.2861390553;0.7611276783
0.05500683477;0.2917472498;0.3162608031
0.6433136658;0.7631824875;0.52814785
0.6087850949;0.7194066092;0.1061932651
0.6346679879;0.8093083765;0.6242057129
0.424152922;0.7627204767;0.4658237564
0.432495602;0.6555618943;0.6607537011
0.3571046411;0.9885087214;0.04188916606
0.572161644;0.1101133059;0.487830006
0.591043079;0.5729070928;0.653828947
0.1162177602;0.2226136404;0.8296021576
0.6906774492;0.5976662299;0.04218225582
0.8222651564;0.03178519053;0.8331369886
0.247658917;0.920701317;0.3385676354
0.4217372759;0.7575214458;0.8294296583
0.5407028238;0.7477260822;0.7689949035
0.3233062486;0.9593290798;0.4895789
0.1036235746;0.3844696401;0.9543447078
0.8614451108;0.3783521074;0.3209615831
0.7359772977;0.6326823008;0.7521461729
0.6983521294;0.8333286431;0.9877541671
0.2413473189;0.9479252933;0.596390919
0.5866298388;0.3713706411;0.3284573141
0.02306826414;0.7649241252;0.2380179779
0.5133472212;0.1490274624;0.6733698325
0.8885933837;0.450834423;0.2157400789
0.2978146119;0.3011716599;0.3022664143
0.840867937;0.7237867604;0.1397849432
0.2018545591;0.4551823184;0.7137754868
0.8939563742;0.3010836447;0.3414968235
0.6507231758;0.9729234482;0.06191691387
0.7136325184;0.1678282649;0.8180587699
0.04516510387;0.4072234876;0.3326095233
0.1214086912;0.5038642012;0.9192094161
0.08228335324;0.7939356695;0.9362338478
0.7291513784;0.7178580359;0.4139629786
0.3787640138;0.06304591261;0.6559497509
0.5044857196;0.6272050671;0.5191012351
0.3101771934;0.137425017;0.761712067
0.264979125;0.9280931663;0.04356716618
0.3221213928;0.8372944977;0.4449626733
0.6188431951;0.2303137129;0.9267038518
0.932299074;0.9607681654;0.08884457148
0.9157033173;0.01692129918;0.3432743821
0.798499802;0.3512954545;0.7253965236
0.3438355987;0.5321598189;0.9809732048