{
  "easyHarvestCrops": true,
  "easyHarvestSugarcane": true,
  "saplingsAutoPlant": false,
  "rejuvenation": {
    "enabled": false,
    "longGrass": 0.01,
    "saplings": true
  },
  "leaves": {
    "collide": true,
    "persistentCollide": true
  },
  "betterLilyPads": true,
  "farmerVillagerAutomation": false,
  "animalsEatOffGround": true,
  "breedWildWolves": false,
  "flintAndSteel": {
    "enabled": true,
    "burnTime": 3
  },
  "lanternBlastResistance": false,
  "namesAndThings": {
    "freeRenames": true,
    "containerLabels": false,
    "labelScale": 100
  },
  "grassDestroysRedstoneTorches": false
}