%YAML 1.1
%TAG !u! tag:unity3d.com,2011:
--- !u!114 &11400000
MonoBehaviour:
  m_ObjectHideFlags: 0
  m_PrefabParentObject: {fileID: 0}
  m_PrefabInternal: {fileID: 0}
  m_GameObject: {fileID: 0}
  m_Enabled: 1
  m_EditorHideFlags: 0
  m_Script: {fileID: 11500000, guid: 37306384918fe4b1c9c5bf3349b34b61, type: 3}
  m_Name: Potential
  m_EditorClassIdentifier: 
  Name: Potential
  Tier: 2
  Cost: 900
  icon: {fileID: 21300000, guid: d0e3ab9e8f0433541814375cc7ab9cbc, type: 3}
  Parent:
  - 
  BuildsFrom:
  - {fileID: 11400000, guid: 72a2d692cdb6f4bcdb12aa5badd82776, type: 2}
  Child:
  - 
  - 
  BuildsInto: []
  PassiveName: Potential
  PassiveDesc: When you kill a minion, monster or miner you gain 4 bonus health and
    0.5 bonus power permanently. This stacks up to 40 times.
  isFirstInstance: 1
  additionalStacks: 0
  ListStats: 0000000004000000
  StaticItemStats:
    Power: 15
    Haste: 0
    Mastery: 0
    Penetration: 0
    Lifedrain: 0
    Tenacity: 0
    BaseAttackTime: 0
    AttackRange: 0
    MaxHealth: 140
    HealthRegen: 0
    AutoAttackDamage: 0
    AttackSpeed: 0
    Armor: 0
    Resistance: 0
    CooldownReduction: 0
    BonusCriticalDamage: 0
    MovementSpeed: 0
    HephisaltBounty: 0
    ExperienceBounty: 0
  PercentItemStats:
    Power: 0
    Haste: 0
    Mastery: 0
    Penetration: 0
    Lifedrain: 0
    Tenacity: 0
    BaseAttackTime: 0
    AttackRange: 0
    MaxHealth: 0
    HealthRegen: 0
    AutoAttackDamage: 0
    AttackSpeed: 0
    Armor: 0
    Resistance: 0
    CooldownReduction: 0
    BonusCriticalDamage: 0
    MovementSpeed: 0
    HephisaltBounty: 0
    ExperienceBounty: 0
  UniquePassive: {fileID: 11400000, guid: e50f7d7a8db20cb4799f53a7f5816ab4, type: 2}
  StackablePassive: {fileID: 0}
