%YAML 1.1
%TAG !u! tag:unity3d.com,2011:
--- !u!114 &11400000
MonoBehaviour:
  m_ObjectHideFlags: 0
  m_PrefabParentObject: {fileID: 0}
  m_PrefabInternal: {fileID: 0}
  m_GameObject: {fileID: 0}
  m_Enabled: 1
  m_EditorHideFlags: 0
  m_Script: {fileID: 11500000, guid: 9d230897d13174af8bcf6b33ceba8b3c, type: 3}
  m_Name: Melee Minion Kit
  m_EditorClassIdentifier: 
  kitName: melee minion
  attackHitTime: 0.3
