%YAML 1.1
%TAG !u! tag:unity3d.com,2011:
--- !u!114 &11400000
MonoBehaviour:
  m_ObjectHideFlags: 0
  m_PrefabParentObject: {fileID: 0}
  m_PrefabInternal: {fileID: 0}
  m_GameObject: {fileID: 0}
  m_Enabled: 1
  m_EditorHideFlags: 0
  m_Script: {fileID: 11500000, guid: 94c44d42258ab485b8a89978c078d66c, type: 3}
  m_Name: Cardinal Call
  m_EditorClassIdentifier: 
  Name: cardinal_call
  StatsByLevel: []
  Level: 1
  NumberOfStacks: 1
  BasicAttackAnimationOverride: 
  DeathBehaviourOverride: 0
  CurrentCooldown: 0
  Cooldowns:
  - 0
  cardinalCallCooldown:
  - 1
  - 1
  - 1
  - 1
  - 1
  cardinalCallAoERadius: 325
  cardinalCallBaseRangeIncrease: 100
  cardinalCallShieldRangePowerScaling: 0.25
  cardinalCallShieldDuration: 3
  cardinalCallBaseShield:
  - 1
  - 1
  - 1
  - 1
  - 1
  cardinalCallPowerScaling: 0.5
  cardinalCallShieldReductionPercentage: 0.2
  cardinalCallMinimumShieldEffect:
  - 0.2
  - 0.3
  - 0.4
  - 0.5
  - 0.6
  cardinalCallIsEmpowered: 0
  cardinalShield: {fileID: 11400000, guid: b2bf26512a64445cb8a98cbc741ae635, type: 2}
