00000000000000000000011000010011
00000000000100000000011010010011
00000000011000000000011110010011
00000000110001101000011100110011
00000000000001101000011000110011
00000000000001110000011010110011
11111111111101111000011110010011
11111110000001111001110011100011
00000000000000000000000000010011
