%YAML 1.1
%TAG !u! tag:unity3d.com,2011:
--- !u!1 &5659267293659902812
GameObject:
  m_ObjectHideFlags: 0
  m_CorrespondingSourceObject: {fileID: 0}
  m_PrefabInstance: {fileID: 0}
  m_PrefabAsset: {fileID: 0}
  serializedVersion: 6
  m_Component:
  - component: {fileID: 6952131463241194376}
  m_Layer: 0
  m_Name: Coconut Tree
  m_TagString: Untagged
  m_Icon: {fileID: 0}
  m_NavMeshLayer: 0
  m_StaticEditorFlags: 0
  m_IsActive: 1
--- !u!4 &6952131463241194376
Transform:
  m_ObjectHideFlags: 0
  m_CorrespondingSourceObject: {fileID: 0}
  m_PrefabInstance: {fileID: 0}
  m_PrefabAsset: {fileID: 0}
  m_GameObject: {fileID: 5659267293659902812}
  m_LocalRotation: {x: 0, y: 0, z: 0, w: 1}
  m_LocalPosition: {x: -13.224821, y: -13.609636, z: -4.3814}
  m_LocalScale: {x: 1, y: 1, z: 1}
  m_Children:
  - {fileID: 366179272093920380}
  m_Father: {fileID: 0}
  m_RootOrder: 0
  m_LocalEulerAnglesHint: {x: 0, y: 0, z: 0}
--- !u!1001 &188684333819202455
PrefabInstance:
  m_ObjectHideFlags: 0
  serializedVersion: 2
  m_Modification:
    m_TransformParent: {fileID: 6952131463241194376}
    m_Modifications:
    - target: {fileID: -8679921383154817045, guid: 74efe7cdb04e03d40bbca1ebfed42cbb,
        type: 3}
      propertyPath: m_LocalPosition.x
      value: 0
      objectReference: {fileID: 0}
    - target: {fileID: -8679921383154817045, guid: 74efe7cdb04e03d40bbca1ebfed42cbb,
        type: 3}
      propertyPath: m_LocalPosition.y
      value: 0
      objectReference: {fileID: 0}
    - target: {fileID: -8679921383154817045, guid: 74efe7cdb04e03d40bbca1ebfed42cbb,
        type: 3}
      propertyPath: m_LocalPosition.z
      value: 0
      objectReference: {fileID: 0}
    - target: {fileID: -8679921383154817045, guid: 74efe7cdb04e03d40bbca1ebfed42cbb,
        type: 3}
      propertyPath: m_LocalRotation.x
      value: -0
      objectReference: {fileID: 0}
    - target: {fileID: -8679921383154817045, guid: 74efe7cdb04e03d40bbca1ebfed42cbb,
        type: 3}
      propertyPath: m_LocalRotation.y
      value: -0
      objectReference: {fileID: 0}
    - target: {fileID: -8679921383154817045, guid: 74efe7cdb04e03d40bbca1ebfed42cbb,
        type: 3}
      propertyPath: m_LocalRotation.z
      value: -0
      objectReference: {fileID: 0}
    - target: {fileID: -8679921383154817045, guid: 74efe7cdb04e03d40bbca1ebfed42cbb,
        type: 3}
      propertyPath: m_LocalRotation.w
      value: 1
      objectReference: {fileID: 0}
    - target: {fileID: -8679921383154817045, guid: 74efe7cdb04e03d40bbca1ebfed42cbb,
        type: 3}
      propertyPath: m_RootOrder
      value: 0
      objectReference: {fileID: 0}
    - target: {fileID: -8679921383154817045, guid: 74efe7cdb04e03d40bbca1ebfed42cbb,
        type: 3}
      propertyPath: m_LocalEulerAnglesHint.x
      value: 0
      objectReference: {fileID: 0}
    - target: {fileID: -8679921383154817045, guid: 74efe7cdb04e03d40bbca1ebfed42cbb,
        type: 3}
      propertyPath: m_LocalEulerAnglesHint.y
      value: 0
      objectReference: {fileID: 0}
    - target: {fileID: -8679921383154817045, guid: 74efe7cdb04e03d40bbca1ebfed42cbb,
        type: 3}
      propertyPath: m_LocalEulerAnglesHint.z
      value: 0
      objectReference: {fileID: 0}
    - target: {fileID: -8679921383154817045, guid: 74efe7cdb04e03d40bbca1ebfed42cbb,
        type: 3}
      propertyPath: m_LocalScale.x
      value: 0.2
      objectReference: {fileID: 0}
    - target: {fileID: -8679921383154817045, guid: 74efe7cdb04e03d40bbca1ebfed42cbb,
        type: 3}
      propertyPath: m_LocalScale.y
      value: 0.2
      objectReference: {fileID: 0}
    - target: {fileID: -8679921383154817045, guid: 74efe7cdb04e03d40bbca1ebfed42cbb,
        type: 3}
      propertyPath: m_LocalScale.z
      value: 0.2
      objectReference: {fileID: 0}
    - target: {fileID: -7918335002988649766, guid: 74efe7cdb04e03d40bbca1ebfed42cbb,
        type: 3}
      propertyPath: m_Materials.Array.data[0]
      value: 
      objectReference: {fileID: 2100000, guid: 583e7ec9c216cec4cbbfd863978e5916, type: 2}
    - target: {fileID: 919132149155446097, guid: 74efe7cdb04e03d40bbca1ebfed42cbb,
        type: 3}
      propertyPath: m_Name
      value: Coqueiro
      objectReference: {fileID: 0}
    - target: {fileID: 2786534777698132407, guid: 74efe7cdb04e03d40bbca1ebfed42cbb,
        type: 3}
      propertyPath: m_Materials.Array.data[0]
      value: 
      objectReference: {fileID: 2100000, guid: 583e7ec9c216cec4cbbfd863978e5916, type: 2}
    - target: {fileID: 6829333093618665122, guid: 74efe7cdb04e03d40bbca1ebfed42cbb,
        type: 3}
      propertyPath: m_Materials.Array.data[0]
      value: 
      objectReference: {fileID: 2100000, guid: 583e7ec9c216cec4cbbfd863978e5916, type: 2}
    m_RemovedComponents: []
  m_SourcePrefab: {fileID: 100100000, guid: 74efe7cdb04e03d40bbca1ebfed42cbb, type: 3}
--- !u!4 &366179272093920380 stripped
Transform:
  m_CorrespondingSourceObject: {fileID: -8679921383154817045, guid: 74efe7cdb04e03d40bbca1ebfed42cbb,
    type: 3}
  m_PrefabInstance: {fileID: 188684333819202455}
  m_PrefabAsset: {fileID: 0}
