{
  "categories": [
    {
      "id": 1,
      "title": "Rings",
      "slug": "rings"
    },
    {
      "id": 2,
      "title": "Earrings",
      "slug": "earrings"
    },
    {
      "id": 3,
      "title": "Chains",
      "slug": "chains"
    }
  ],
  "products": [
    {
      "id": 1,
      "image": "https://loremflickr.com/630/630/animals?26246",
      "title": "Rustic Metal Fish",
      "slug": "rustic-metal-fish",
      "description": "Andy shoes are designed to keeping in mind durability as well as trends, the most stylish range of shoes & sandals",
      "discount": 42,
      "categoryId": 1
    },
    {
      "id": 2,
      "image": "https://loremflickr.com/630/630/animals?13778",
      "title": "Rustic Fresh Pants",
      "slug": "rustic-fresh-pants",
      "description": "The automobile layout consists of a front-engine design, with transaxle-type transmissions mounted at the rear of the engine and four wheel drive",
      "discount": 17,
      "categoryId": 1
    },
    {
      "id": 3,
      "image": "https://loremflickr.com/630/630/animals?92387",
      "title": "Handmade Soft Pizza",
      "slug": "handmade-soft-pizza",
      "description": "The Nagasaki Lander is the trademarked name of several series of Nagasaki sport bikes, that started with the 1984 ABC800J",
      "discount": 31,
      "categoryId": 1
    },
    {
      "id": 4,
      "image": "https://loremflickr.com/630/630/animals?9572",
      "title": "Intelligent Frozen Cheese",
      "slug": "intelligent-frozen-cheese",
      "description": "The beautiful range of Apple Naturalé that has an exciting mix of natural ingredients. With the Goodness of 100% Natural Ingredients",
      "discount": 9,
      "categoryId": 1
    },
    {
      "id": 5,
      "image": "https://loremflickr.com/630/630/animals?83728",
      "title": "Tasty Fresh Chicken",
      "slug": "tasty-fresh-chicken",
      "description": "The Football Is Good For Training And Recreational Purposes",
      "discount": 10,
      "categoryId": 1
    },
    {
      "id": 6,
      "image": "https://loremflickr.com/630/630/animals?47950",
      "title": "Electronic Bronze Sausages",
      "slug": "electronic-bronze-sausages",
      "description": "The Football Is Good For Training And Recreational Purposes",
      "discount": 9,
      "categoryId": 1
    },
    {
      "id": 7,
      "image": "https://loremflickr.com/630/630/animals?88258",
      "title": "Luxurious Metal Gloves",
      "slug": "luxurious-metal-gloves",
      "description": "Carbonite web goalkeeper gloves are ergonomically designed to give easy fit",
      "discount": 51,
      "categoryId": 1
    },
    {
      "id": 8,
      "image": "https://loremflickr.com/630/630/animals?60978",
      "title": "Intelligent Rubber Car",
      "slug": "intelligent-rubber-car",
      "description": "Ergonomic executive chair upholstered in bonded black leather and PVC padded seat and back for all-day comfort and support",
      "discount": 35,
      "categoryId": 1
    },
    {
      "id": 9,
      "image": "https://loremflickr.com/630/630/animals?53279",
      "title": "Awesome Fresh Soap",
      "slug": "awesome-fresh-soap",
      "description": "The slim & simple Maple Gaming Keyboard from Dev Byte comes with a sleek body and 7- Color RGB LED Back-lighting for smart functionality",
      "discount": 13,
      "categoryId": 1
    },
    {
      "id": 10,
      "image": "https://loremflickr.com/630/630/animals?63474",
      "title": "Recycled Steel Salad",
      "slug": "recycled-steel-salad",
      "description": "Carbonite web goalkeeper gloves are ergonomically designed to give easy fit",
      "discount": 42,
      "categoryId": 1
    },
    {
      "id": 11,
      "image": "https://loremflickr.com/630/630/animals?36836",
      "title": "Modern Concrete Table",
      "slug": "modern-concrete-table",
      "description": "The Nagasaki Lander is the trademarked name of several series of Nagasaki sport bikes, that started with the 1984 ABC800J",
      "discount": 17,
      "categoryId": 1
    },
    {
      "id": 12,
      "image": "https://loremflickr.com/630/630/animals?9224",
      "title": "Recycled Cotton Chicken",
      "slug": "recycled-cotton-chicken",
      "description": "Carbonite web goalkeeper gloves are ergonomically designed to give easy fit",
      "discount": 11,
      "categoryId": 1
    },
    {
      "id": 13,
      "image": "https://loremflickr.com/630/630/animals?84204",
      "title": "Ergonomic Wooden Sausages",
      "slug": "ergonomic-wooden-sausages",
      "description": "The automobile layout consists of a front-engine design, with transaxle-type transmissions mounted at the rear of the engine and four wheel drive",
      "discount": 56,
      "categoryId": 1
    },
    {
      "id": 14,
      "image": "https://loremflickr.com/630/630/animals?26596",
      "title": "Tasty Bronze Hat",
      "slug": "tasty-bronze-hat",
      "description": "The Apollotech B340 is an affordable wireless mouse with reliable connectivity, 12 months battery life and modern design",
      "discount": 32,
      "categoryId": 1
    },
    {
      "id": 15,
      "image": "https://loremflickr.com/630/630/animals?87035",
      "title": "Tasty Cotton Mouse",
      "slug": "tasty-cotton-mouse",
      "description": "New ABC 13 9370, 13.3, 5th Gen CoreA5-8250U, 8GB RAM, 256GB SSD, power UHD Graphics, OS 10 Home, OS Office A & J 2016",
      "discount": 2,
      "categoryId": 1
    },
    {
      "id": 16,
      "image": "https://loremflickr.com/630/630/animals?35536",
      "title": "Sleek Wooden Fish",
      "slug": "sleek-wooden-fish",
      "description": "Carbonite web goalkeeper gloves are ergonomically designed to give easy fit",
      "discount": 39,
      "categoryId": 1
    },
    {
      "id": 17,
      "image": "https://loremflickr.com/630/630/animals?44120",
      "title": "Fantastic Fresh Fish",
      "slug": "fantastic-fresh-fish",
      "description": "Carbonite web goalkeeper gloves are ergonomically designed to give easy fit",
      "discount": 58,
      "categoryId": 1
    },
    {
      "id": 18,
      "image": "https://loremflickr.com/630/630/animals?43784",
      "title": "Fantastic Steel Bacon",
      "slug": "fantastic-steel-bacon",
      "description": "Carbonite web goalkeeper gloves are ergonomically designed to give easy fit",
      "discount": 39,
      "categoryId": 1
    },
    {
      "id": 19,
      "image": "https://loremflickr.com/630/630/animals?94576",
      "title": "Recycled Granite Chips",
      "slug": "recycled-granite-chips",
      "description": "Boston's most advanced compression wear technology increases muscle oxygenation, stabilizes active muscles",
      "discount": 55,
      "categoryId": 1
    },
    {
      "id": 20,
      "image": "https://loremflickr.com/630/630/animals?43860",
      "title": "Modern Frozen Shirt",
      "slug": "modern-frozen-shirt",
      "description": "Ergonomic executive chair upholstered in bonded black leather and PVC padded seat and back for all-day comfort and support",
      "discount": 5,
      "categoryId": 1
    },
    {
      "id": 21,
      "image": "https://loremflickr.com/630/630/animals?44595",
      "title": "Elegant Frozen Salad",
      "slug": "elegant-frozen-salad",
      "description": "New range of formal shirts are designed keeping you in mind. With fits and styling that will make you stand apart",
      "discount": 44,
      "categoryId": 1
    },
    {
      "id": 22,
      "image": "https://loremflickr.com/630/630/animals?74388",
      "title": "Oriental Plastic Soap",
      "slug": "oriental-plastic-soap",
      "description": "New range of formal shirts are designed keeping you in mind. With fits and styling that will make you stand apart",
      "discount": 54,
      "categoryId": 1
    },
    {
      "id": 23,
      "image": "https://loremflickr.com/630/630/animals?88709",
      "title": "Tasty Steel Gloves",
      "slug": "tasty-steel-gloves",
      "description": "Andy shoes are designed to keeping in mind durability as well as trends, the most stylish range of shoes & sandals",
      "discount": 45,
      "categoryId": 1
    },
    {
      "id": 24,
      "image": "https://loremflickr.com/630/630/animals?45616",
      "title": "Awesome Frozen Computer",
      "slug": "awesome-frozen-computer",
      "description": "The automobile layout consists of a front-engine design, with transaxle-type transmissions mounted at the rear of the engine and four wheel drive",
      "discount": 37,
      "categoryId": 1
    },
    {
      "id": 25,
      "image": "https://loremflickr.com/630/630/animals?18426",
      "title": "Small Concrete Cheese",
      "slug": "small-concrete-cheese",
      "description": "Ergonomic executive chair upholstered in bonded black leather and PVC padded seat and back for all-day comfort and support",
      "discount": 47,
      "categoryId": 1
    },
    {
      "id": 26,
      "image": "https://loremflickr.com/630/630/animals?65055",
      "title": "Intelligent Rubber Table",
      "slug": "intelligent-rubber-table",
      "description": "Boston's most advanced compression wear technology increases muscle oxygenation, stabilizes active muscles",
      "discount": 16,
      "categoryId": 1
    },
    {
      "id": 27,
      "image": "https://loremflickr.com/630/630/animals?44762",
      "title": "Unbranded Frozen Tuna",
      "slug": "unbranded-frozen-tuna",
      "description": "New range of formal shirts are designed keeping you in mind. With fits and styling that will make you stand apart",
      "discount": 30,
      "categoryId": 1
    },
    {
      "id": 28,
      "image": "https://loremflickr.com/630/630/animals?94061",
      "title": "Ergonomic Bronze Mouse",
      "slug": "ergonomic-bronze-mouse",
      "description": "Boston's most advanced compression wear technology increases muscle oxygenation, stabilizes active muscles",
      "discount": 15,
      "categoryId": 1
    },
    {
      "id": 29,
      "image": "https://loremflickr.com/630/630/animals?51708",
      "title": "Modern Wooden Pizza",
      "slug": "modern-wooden-pizza",
      "description": "The automobile layout consists of a front-engine design, with transaxle-type transmissions mounted at the rear of the engine and four wheel drive",
      "discount": 29,
      "categoryId": 1
    },
    {
      "id": 30,
      "image": "https://loremflickr.com/630/630/animals?87142",
      "title": "Small Bronze Keyboard",
      "slug": "small-bronze-keyboard",
      "description": "Ergonomic executive chair upholstered in bonded black leather and PVC padded seat and back for all-day comfort and support",
      "discount": 7,
      "categoryId": 1
    },
    {
      "id": 31,
      "image": "https://loremflickr.com/630/630/animals?68088",
      "title": "Incredible Metal Fish",
      "slug": "incredible-metal-fish",
      "description": "The Nagasaki Lander is the trademarked name of several series of Nagasaki sport bikes, that started with the 1984 ABC800J",
      "discount": 56,
      "categoryId": 1
    },
    {
      "id": 32,
      "image": "https://loremflickr.com/630/630/animals?22886",
      "title": "Luxurious Metal Pizza",
      "slug": "luxurious-metal-pizza",
      "description": "The beautiful range of Apple Naturalé that has an exciting mix of natural ingredients. With the Goodness of 100% Natural Ingredients",
      "discount": 14,
      "categoryId": 1
    },
    {
      "id": 33,
      "image": "https://loremflickr.com/630/630/animals?63674",
      "title": "Incredible Granite Towels",
      "slug": "incredible-granite-towels",
      "description": "The beautiful range of Apple Naturalé that has an exciting mix of natural ingredients. With the Goodness of 100% Natural Ingredients",
      "discount": 14,
      "categoryId": 1
    },
    {
      "id": 34,
      "image": "https://loremflickr.com/630/630/animals?30813",
      "title": "Bespoke Granite Table",
      "slug": "bespoke-granite-table",
      "description": "The beautiful range of Apple Naturalé that has an exciting mix of natural ingredients. With the Goodness of 100% Natural Ingredients",
      "discount": 27,
      "categoryId": 1
    },
    {
      "id": 35,
      "image": "https://loremflickr.com/630/630/animals?21052",
      "title": "Recycled Soft Tuna",
      "slug": "recycled-soft-tuna",
      "description": "The Apollotech B340 is an affordable wireless mouse with reliable connectivity, 12 months battery life and modern design",
      "discount": 0,
      "categoryId": 1
    },
    {
      "id": 36,
      "image": "https://loremflickr.com/630/630/animals?98790",
      "title": "Ergonomic Steel Chicken",
      "slug": "ergonomic-steel-chicken",
      "description": "The Apollotech B340 is an affordable wireless mouse with reliable connectivity, 12 months battery life and modern design",
      "discount": 5,
      "categoryId": 1
    },
    {
      "id": 37,
      "image": "https://loremflickr.com/630/630/animals?73235",
      "title": "Licensed Plastic Keyboard",
      "slug": "licensed-plastic-keyboard",
      "description": "Ergonomic executive chair upholstered in bonded black leather and PVC padded seat and back for all-day comfort and support",
      "discount": 55,
      "categoryId": 1
    },
    {
      "id": 38,
      "image": "https://loremflickr.com/630/630/animals?81233",
      "title": "Licensed Rubber Chicken",
      "slug": "licensed-rubber-chicken",
      "description": "The Football Is Good For Training And Recreational Purposes",
      "discount": 31,
      "categoryId": 1
    },
    {
      "id": 39,
      "image": "https://loremflickr.com/630/630/animals?83073",
      "title": "Rustic Plastic Mouse",
      "slug": "rustic-plastic-mouse",
      "description": "The automobile layout consists of a front-engine design, with transaxle-type transmissions mounted at the rear of the engine and four wheel drive",
      "discount": 2,
      "categoryId": 1
    },
    {
      "id": 40,
      "image": "https://loremflickr.com/630/630/animals?85551",
      "title": "Small Steel Chair",
      "slug": "small-steel-chair",
      "description": "Boston's most advanced compression wear technology increases muscle oxygenation, stabilizes active muscles",
      "discount": 14,
      "categoryId": 1
    },
    {
      "id": 41,
      "image": "https://loremflickr.com/630/630/animals?53598",
      "title": "Tasty Rubber Gloves",
      "slug": "tasty-rubber-gloves",
      "description": "Andy shoes are designed to keeping in mind durability as well as trends, the most stylish range of shoes & sandals",
      "discount": 57,
      "categoryId": 1
    },
    {
      "id": 42,
      "image": "https://loremflickr.com/630/630/animals?86955",
      "title": "Unbranded Cotton Keyboard",
      "slug": "unbranded-cotton-keyboard",
      "description": "The Apollotech B340 is an affordable wireless mouse with reliable connectivity, 12 months battery life and modern design",
      "discount": 2,
      "categoryId": 1
    },
    {
      "id": 43,
      "image": "https://loremflickr.com/630/630/animals?85644",
      "title": "Fantastic Concrete Computer",
      "slug": "fantastic-concrete-computer",
      "description": "The Nagasaki Lander is the trademarked name of several series of Nagasaki sport bikes, that started with the 1984 ABC800J",
      "discount": 51,
      "categoryId": 1
    },
    {
      "id": 44,
      "image": "https://loremflickr.com/630/630/animals?38373",
      "title": "Practical Cotton Bacon",
      "slug": "practical-cotton-bacon",
      "description": "The Apollotech B340 is an affordable wireless mouse with reliable connectivity, 12 months battery life and modern design",
      "discount": 42,
      "categoryId": 1
    },
    {
      "id": 45,
      "image": "https://loremflickr.com/630/630/animals?43241",
      "title": "Rustic Cotton Chicken",
      "slug": "rustic-cotton-chicken",
      "description": "Ergonomic executive chair upholstered in bonded black leather and PVC padded seat and back for all-day comfort and support",
      "discount": 2,
      "categoryId": 1
    },
    {
      "id": 46,
      "image": "https://loremflickr.com/630/630/animals?32710",
      "title": "Ergonomic Wooden Chips",
      "slug": "ergonomic-wooden-chips",
      "description": "Boston's most advanced compression wear technology increases muscle oxygenation, stabilizes active muscles",
      "discount": 45,
      "categoryId": 1
    },
    {
      "id": 47,
      "image": "https://loremflickr.com/630/630/animals?84592",
      "title": "Handmade Rubber Chips",
      "slug": "handmade-rubber-chips",
      "description": "The beautiful range of Apple Naturalé that has an exciting mix of natural ingredients. With the Goodness of 100% Natural Ingredients",
      "discount": 37,
      "categoryId": 1
    },
    {
      "id": 48,
      "image": "https://loremflickr.com/630/630/animals?26031",
      "title": "Awesome Soft Table",
      "slug": "awesome-soft-table",
      "description": "The slim & simple Maple Gaming Keyboard from Dev Byte comes with a sleek body and 7- Color RGB LED Back-lighting for smart functionality",
      "discount": 48,
      "categoryId": 1
    },
    {
      "id": 49,
      "image": "https://loremflickr.com/630/630/animals?26512",
      "title": "Small Steel Soap",
      "slug": "small-steel-soap",
      "description": "Boston's most advanced compression wear technology increases muscle oxygenation, stabilizes active muscles",
      "discount": 59,
      "categoryId": 1
    },
    {
      "id": 50,
      "image": "https://loremflickr.com/630/630/animals?16957",
      "title": "Modern Metal Salad",
      "slug": "modern-metal-salad",
      "description": "New ABC 13 9370, 13.3, 5th Gen CoreA5-8250U, 8GB RAM, 256GB SSD, power UHD Graphics, OS 10 Home, OS Office A & J 2016",
      "discount": 57,
      "categoryId": 1
    },
    {
      "id": 51,
      "image": "https://loremflickr.com/630/630/animals?55713",
      "title": "Bespoke Wooden Pizza",
      "slug": "bespoke-wooden-pizza",
      "description": "The slim & simple Maple Gaming Keyboard from Dev Byte comes with a sleek body and 7- Color RGB LED Back-lighting for smart functionality",
      "discount": 24,
      "categoryId": 1
    },
    {
      "id": 52,
      "image": "https://loremflickr.com/630/630/animals?63543",
      "title": "Modern Rubber Cheese",
      "slug": "modern-rubber-cheese",
      "description": "The Apollotech B340 is an affordable wireless mouse with reliable connectivity, 12 months battery life and modern design",
      "discount": 21,
      "categoryId": 1
    },
    {
      "id": 53,
      "image": "https://loremflickr.com/630/630/animals?81303",
      "title": "Fantastic Concrete Keyboard",
      "slug": "fantastic-concrete-keyboard",
      "description": "The Nagasaki Lander is the trademarked name of several series of Nagasaki sport bikes, that started with the 1984 ABC800J",
      "discount": 31,
      "categoryId": 1
    },
    {
      "id": 54,
      "image": "https://loremflickr.com/630/630/animals?49869",
      "title": "Awesome Bronze Gloves",
      "slug": "awesome-bronze-gloves",
      "description": "The Nagasaki Lander is the trademarked name of several series of Nagasaki sport bikes, that started with the 1984 ABC800J",
      "discount": 52,
      "categoryId": 2
    },
    {
      "id": 55,
      "image": "https://loremflickr.com/630/630/animals?66097",
      "title": "Licensed Frozen Table",
      "slug": "licensed-frozen-table",
      "description": "The automobile layout consists of a front-engine design, with transaxle-type transmissions mounted at the rear of the engine and four wheel drive",
      "discount": 46,
      "categoryId": 2
    },
    {
      "id": 56,
      "image": "https://loremflickr.com/630/630/animals?15662",
      "title": "Intelligent Granite Cheese",
      "slug": "intelligent-granite-cheese",
      "description": "The slim & simple Maple Gaming Keyboard from Dev Byte comes with a sleek body and 7- Color RGB LED Back-lighting for smart functionality",
      "discount": 39,
      "categoryId": 2
    },
    {
      "id": 57,
      "image": "https://loremflickr.com/630/630/animals?73223",
      "title": "Recycled Cotton Towels",
      "slug": "recycled-cotton-towels",
      "description": "The beautiful range of Apple Naturalé that has an exciting mix of natural ingredients. With the Goodness of 100% Natural Ingredients",
      "discount": 11,
      "categoryId": 2
    },
    {
      "id": 58,
      "image": "https://loremflickr.com/630/630/animals?33886",
      "title": "Rustic Concrete Cheese",
      "slug": "rustic-concrete-cheese",
      "description": "Ergonomic executive chair upholstered in bonded black leather and PVC padded seat and back for all-day comfort and support",
      "discount": 33,
      "categoryId": 2
    },
    {
      "id": 59,
      "image": "https://loremflickr.com/630/630/animals?12646",
      "title": "Fantastic Concrete Bacon",
      "slug": "fantastic-concrete-bacon",
      "description": "The beautiful range of Apple Naturalé that has an exciting mix of natural ingredients. With the Goodness of 100% Natural Ingredients",
      "discount": 33,
      "categoryId": 2
    },
    {
      "id": 60,
      "image": "https://loremflickr.com/630/630/animals?8355",
      "title": "Licensed Soft Fish",
      "slug": "licensed-soft-fish",
      "description": "Ergonomic executive chair upholstered in bonded black leather and PVC padded seat and back for all-day comfort and support",
      "discount": 59,
      "categoryId": 2
    },
    {
      "id": 61,
      "image": "https://loremflickr.com/630/630/animals?92867",
      "title": "Electronic Bronze Table",
      "slug": "electronic-bronze-table",
      "description": "The slim & simple Maple Gaming Keyboard from Dev Byte comes with a sleek body and 7- Color RGB LED Back-lighting for smart functionality",
      "discount": 11,
      "categoryId": 2
    },
    {
      "id": 62,
      "image": "https://loremflickr.com/630/630/animals?86967",
      "title": "Bespoke Frozen Ball",
      "slug": "bespoke-frozen-ball",
      "description": "Carbonite web goalkeeper gloves are ergonomically designed to give easy fit",
      "discount": 7,
      "categoryId": 2
    },
    {
      "id": 63,
      "image": "https://loremflickr.com/630/630/animals?17174",
      "title": "Practical Plastic Hat",
      "slug": "practical-plastic-hat",
      "description": "The automobile layout consists of a front-engine design, with transaxle-type transmissions mounted at the rear of the engine and four wheel drive",
      "discount": 31,
      "categoryId": 2
    },
    {
      "id": 64,
      "image": "https://loremflickr.com/630/630/animals?79053",
      "title": "Handmade Rubber Chicken",
      "slug": "handmade-rubber-chicken",
      "description": "The Nagasaki Lander is the trademarked name of several series of Nagasaki sport bikes, that started with the 1984 ABC800J",
      "discount": 52,
      "categoryId": 2
    },
    {
      "id": 65,
      "image": "https://loremflickr.com/630/630/animals?78110",
      "title": "Oriental Cotton Gloves",
      "slug": "oriental-cotton-gloves",
      "description": "The beautiful range of Apple Naturalé that has an exciting mix of natural ingredients. With the Goodness of 100% Natural Ingredients",
      "discount": 31,
      "categoryId": 2
    },
    {
      "id": 66,
      "image": "https://loremflickr.com/630/630/animals?74284",
      "title": "Fantastic Granite Towels",
      "slug": "fantastic-granite-towels",
      "description": "Andy shoes are designed to keeping in mind durability as well as trends, the most stylish range of shoes & sandals",
      "discount": 43,
      "categoryId": 2
    },
    {
      "id": 67,
      "image": "https://loremflickr.com/630/630/animals?24613",
      "title": "Incredible Wooden Hat",
      "slug": "incredible-wooden-hat",
      "description": "The Football Is Good For Training And Recreational Purposes",
      "discount": 37,
      "categoryId": 2
    },
    {
      "id": 68,
      "image": "https://loremflickr.com/630/630/animals?40754",
      "title": "Electronic Concrete Towels",
      "slug": "electronic-concrete-towels",
      "description": "Ergonomic executive chair upholstered in bonded black leather and PVC padded seat and back for all-day comfort and support",
      "discount": 29,
      "categoryId": 2
    },
    {
      "id": 69,
      "image": "https://loremflickr.com/630/630/animals?55140",
      "title": "Handcrafted Rubber Bacon",
      "slug": "handcrafted-rubber-bacon",
      "description": "The automobile layout consists of a front-engine design, with transaxle-type transmissions mounted at the rear of the engine and four wheel drive",
      "discount": 47,
      "categoryId": 2
    },
    {
      "id": 70,
      "image": "https://loremflickr.com/630/630/animals?25264",
      "title": "Modern Fresh Chair",
      "slug": "modern-fresh-chair",
      "description": "Ergonomic executive chair upholstered in bonded black leather and PVC padded seat and back for all-day comfort and support",
      "discount": 33,
      "categoryId": 2
    },
    {
      "id": 71,
      "image": "https://loremflickr.com/630/630/animals?9412",
      "title": "Practical Cotton Car",
      "slug": "practical-cotton-car",
      "description": "New ABC 13 9370, 13.3, 5th Gen CoreA5-8250U, 8GB RAM, 256GB SSD, power UHD Graphics, OS 10 Home, OS Office A & J 2016",
      "discount": 0,
      "categoryId": 3
    },
    {
      "id": 72,
      "image": "https://loremflickr.com/630/630/animals?75645",
      "title": "Fantastic Concrete Bike",
      "slug": "fantastic-concrete-bike",
      "description": "New range of formal shirts are designed keeping you in mind. With fits and styling that will make you stand apart",
      "discount": 20,
      "categoryId": 3
    },
    {
      "id": 73,
      "image": "https://loremflickr.com/630/630/animals?65120",
      "title": "Generic Rubber Pants",
      "slug": "generic-rubber-pants",
      "description": "New ABC 13 9370, 13.3, 5th Gen CoreA5-8250U, 8GB RAM, 256GB SSD, power UHD Graphics, OS 10 Home, OS Office A & J 2016",
      "discount": 22,
      "categoryId": 3
    },
    {
      "id": 74,
      "image": "https://loremflickr.com/630/630/animals?38202",
      "title": "Unbranded Concrete Pizza",
      "slug": "unbranded-concrete-pizza",
      "description": "New range of formal shirts are designed keeping you in mind. With fits and styling that will make you stand apart",
      "discount": 51,
      "categoryId": 3
    },
    {
      "id": 75,
      "image": "https://loremflickr.com/630/630/animals?32649",
      "title": "Elegant Soft Towels",
      "slug": "elegant-soft-towels",
      "description": "The Apollotech B340 is an affordable wireless mouse with reliable connectivity, 12 months battery life and modern design",
      "discount": 20,
      "categoryId": 3
    },
    {
      "id": 76,
      "image": "https://loremflickr.com/630/630/animals?98286",
      "title": "Elegant Bronze Bike",
      "slug": "elegant-bronze-bike",
      "description": "New ABC 13 9370, 13.3, 5th Gen CoreA5-8250U, 8GB RAM, 256GB SSD, power UHD Graphics, OS 10 Home, OS Office A & J 2016",
      "discount": 54,
      "categoryId": 3
    },
    {
      "id": 77,
      "image": "https://loremflickr.com/630/630/animals?76356",
      "title": "Tasty Plastic Car",
      "slug": "tasty-plastic-car",
      "description": "The Nagasaki Lander is the trademarked name of several series of Nagasaki sport bikes, that started with the 1984 ABC800J",
      "discount": 22,
      "categoryId": 3
    },
    {
      "id": 78,
      "image": "https://loremflickr.com/630/630/animals?14587",
      "title": "Incredible Cotton Chips",
      "slug": "incredible-cotton-chips",
      "description": "New range of formal shirts are designed keeping you in mind. With fits and styling that will make you stand apart",
      "discount": 21,
      "categoryId": 3
    },
    {
      "id": 79,
      "image": "https://loremflickr.com/630/630/animals?17446",
      "title": "Handmade Frozen Mouse",
      "slug": "handmade-frozen-mouse",
      "description": "Carbonite web goalkeeper gloves are ergonomically designed to give easy fit",
      "discount": 31,
      "categoryId": 3
    },
    {
      "id": 80,
      "image": "https://loremflickr.com/630/630/animals?35472",
      "title": "Handcrafted Bronze Towels",
      "slug": "handcrafted-bronze-towels",
      "description": "The Apollotech B340 is an affordable wireless mouse with reliable connectivity, 12 months battery life and modern design",
      "discount": 26,
      "categoryId": 3
    },
    {
      "id": 81,
      "image": "https://loremflickr.com/630/630/animals?34339",
      "title": "Rustic Plastic Keyboard",
      "slug": "rustic-plastic-keyboard",
      "description": "New ABC 13 9370, 13.3, 5th Gen CoreA5-8250U, 8GB RAM, 256GB SSD, power UHD Graphics, OS 10 Home, OS Office A & J 2016",
      "discount": 16,
      "categoryId": 3
    },
    {
      "id": 82,
      "image": "https://loremflickr.com/630/630/animals?85512",
      "title": "Handcrafted Rubber Pizza",
      "slug": "handcrafted-rubber-pizza",
      "description": "Andy shoes are designed to keeping in mind durability as well as trends, the most stylish range of shoes & sandals",
      "discount": 3,
      "categoryId": 3
    },
    {
      "id": 83,
      "image": "https://loremflickr.com/630/630/animals?6465",
      "title": "Recycled Steel Cheese",
      "slug": "recycled-steel-cheese",
      "description": "Andy shoes are designed to keeping in mind durability as well as trends, the most stylish range of shoes & sandals",
      "discount": 7,
      "categoryId": 3
    },
    {
      "id": 84,
      "image": "https://loremflickr.com/630/630/animals?55555",
      "title": "Bespoke Concrete Salad",
      "slug": "bespoke-concrete-salad",
      "description": "The Football Is Good For Training And Recreational Purposes",
      "discount": 38,
      "categoryId": 3
    },
    {
      "id": 85,
      "image": "https://loremflickr.com/630/630/animals?57633",
      "title": "Sleek Granite Gloves",
      "slug": "sleek-granite-gloves",
      "description": "The automobile layout consists of a front-engine design, with transaxle-type transmissions mounted at the rear of the engine and four wheel drive",
      "discount": 34,
      "categoryId": 3
    },
    {
      "id": 86,
      "image": "https://loremflickr.com/630/630/animals?66861",
      "title": "Unbranded Plastic Cheese",
      "slug": "unbranded-plastic-cheese",
      "description": "The Football Is Good For Training And Recreational Purposes",
      "discount": 22,
      "categoryId": 3
    },
    {
      "id": 87,
      "image": "https://loremflickr.com/630/630/animals?17422",
      "title": "Gorgeous Granite Computer",
      "slug": "gorgeous-granite-computer",
      "description": "Carbonite web goalkeeper gloves are ergonomically designed to give easy fit",
      "discount": 6,
      "categoryId": 3
    },
    {
      "id": 88,
      "image": "https://loremflickr.com/630/630/animals?79865",
      "title": "Bespoke Cotton Cheese",
      "slug": "bespoke-cotton-cheese",
      "description": "The slim & simple Maple Gaming Keyboard from Dev Byte comes with a sleek body and 7- Color RGB LED Back-lighting for smart functionality",
      "discount": 3,
      "categoryId": 3
    },
    {
      "id": 89,
      "image": "https://loremflickr.com/630/630/animals?49546",
      "title": "Ergonomic Cotton Table",
      "slug": "ergonomic-cotton-table",
      "description": "New ABC 13 9370, 13.3, 5th Gen CoreA5-8250U, 8GB RAM, 256GB SSD, power UHD Graphics, OS 10 Home, OS Office A & J 2016",
      "discount": 18,
      "categoryId": 3
    },
    {
      "id": 90,
      "image": "https://loremflickr.com/630/630/animals?74081",
      "title": "Sleek Fresh Towels",
      "slug": "sleek-fresh-towels",
      "description": "Andy shoes are designed to keeping in mind durability as well as trends, the most stylish range of shoes & sandals",
      "discount": 33,
      "categoryId": 3
    },
    {
      "id": 91,
      "image": "https://loremflickr.com/630/630/animals?24612",
      "title": "Awesome Granite Fish",
      "slug": "awesome-granite-fish",
      "description": "Ergonomic executive chair upholstered in bonded black leather and PVC padded seat and back for all-day comfort and support",
      "discount": 6,
      "categoryId": 3
    },
    {
      "id": 92,
      "image": "https://loremflickr.com/630/630/animals?17201",
      "title": "Rustic Rubber Chips",
      "slug": "rustic-rubber-chips",
      "description": "Ergonomic executive chair upholstered in bonded black leather and PVC padded seat and back for all-day comfort and support",
      "discount": 30,
      "categoryId": 3
    },
    {
      "id": 93,
      "image": "https://loremflickr.com/630/630/animals?27307",
      "title": "Oriental Plastic Salad",
      "slug": "oriental-plastic-salad",
      "description": "The beautiful range of Apple Naturalé that has an exciting mix of natural ingredients. With the Goodness of 100% Natural Ingredients",
      "discount": 60,
      "categoryId": 3
    },
    {
      "id": 94,
      "image": "https://loremflickr.com/630/630/animals?94668",
      "title": "Gorgeous Metal Tuna",
      "slug": "gorgeous-metal-tuna",
      "description": "The beautiful range of Apple Naturalé that has an exciting mix of natural ingredients. With the Goodness of 100% Natural Ingredients",
      "discount": 18,
      "categoryId": 3
    },
    {
      "id": 95,
      "image": "https://loremflickr.com/630/630/animals?20133",
      "title": "Unbranded Plastic Chair",
      "slug": "unbranded-plastic-chair",
      "description": "The beautiful range of Apple Naturalé that has an exciting mix of natural ingredients. With the Goodness of 100% Natural Ingredients",
      "discount": 42,
      "categoryId": 3
    },
    {
      "id": 96,
      "image": "https://loremflickr.com/630/630/animals?96602",
      "title": "Handcrafted Frozen Ball",
      "slug": "handcrafted-frozen-ball",
      "description": "Andy shoes are designed to keeping in mind durability as well as trends, the most stylish range of shoes & sandals",
      "discount": 21,
      "categoryId": 3
    },
    {
      "id": 97,
      "image": "https://loremflickr.com/630/630/animals?97511",
      "title": "Ergonomic Cotton Sausages",
      "slug": "ergonomic-cotton-sausages",
      "description": "The Nagasaki Lander is the trademarked name of several series of Nagasaki sport bikes, that started with the 1984 ABC800J",
      "discount": 53,
      "categoryId": 3
    },
    {
      "id": 98,
      "image": "https://loremflickr.com/630/630/animals?55277",
      "title": "Unbranded Rubber Bike",
      "slug": "unbranded-rubber-bike",
      "description": "The Football Is Good For Training And Recreational Purposes",
      "discount": 4,
      "categoryId": 3
    },
    {
      "id": 99,
      "image": "https://loremflickr.com/630/630/animals?85992",
      "title": "Licensed Rubber Towels",
      "slug": "licensed-rubber-towels",
      "description": "The Apollotech B340 is an affordable wireless mouse with reliable connectivity, 12 months battery life and modern design",
      "discount": 15,
      "categoryId": 3
    },
    {
      "id": 100,
      "image": "https://loremflickr.com/630/630/animals?43766",
      "title": "Luxurious Bronze Pants",
      "slug": "luxurious-bronze-pants",
      "description": "Carbonite web goalkeeper gloves are ergonomically designed to give easy fit",
      "discount": 8,
      "categoryId": 3
    },
    {
      "id": 101,
      "image": "https://loremflickr.com/630/630/animals?904",
      "title": "Refined Frozen Mouse",
      "slug": "refined-frozen-mouse",
      "description": "The Apollotech B340 is an affordable wireless mouse with reliable connectivity, 12 months battery life and modern design",
      "discount": 52,
      "categoryId": 3
    },
    {
      "id": 102,
      "image": "https://loremflickr.com/630/630/animals?28401",
      "title": "Sleek Wooden Shoes",
      "slug": "sleek-wooden-shoes",
      "description": "The slim & simple Maple Gaming Keyboard from Dev Byte comes with a sleek body and 7- Color RGB LED Back-lighting for smart functionality",
      "discount": 55,
      "categoryId": 3
    },
    {
      "id": 103,
      "image": "https://loremflickr.com/630/630/animals?70298",
      "title": "Practical Frozen Soap",
      "slug": "practical-frozen-soap",
      "description": "The slim & simple Maple Gaming Keyboard from Dev Byte comes with a sleek body and 7- Color RGB LED Back-lighting for smart functionality",
      "discount": 27,
      "categoryId": 3
    }
  ],
  "sizes": [
    {
      "id": 1,
      "title": "12",
      "price": 101,
      "productId": 1
    },
    {
      "id": 2,
      "title": "13",
      "price": 172,
      "productId": 1
    },
    {
      "id": 3,
      "title": "18",
      "price": 376,
      "productId": 1
    },
    {
      "id": 4,
      "title": "20",
      "price": 236,
      "productId": 1
    },
    {
      "id": 5,
      "title": "12",
      "price": 374,
      "productId": 2
    },
    {
      "id": 6,
      "title": "13",
      "price": 107,
      "productId": 3
    },
    {
      "id": 7,
      "title": "15",
      "price": 380,
      "productId": 3
    },
    {
      "id": 8,
      "title": "17",
      "price": 475,
      "productId": 3
    },
    {
      "id": 9,
      "title": "11",
      "price": 26,
      "productId": 4
    },
    {
      "id": 10,
      "title": "13",
      "price": 35,
      "productId": 4
    },
    {
      "id": 11,
      "title": "15",
      "price": 483,
      "productId": 4
    },
    {
      "id": 12,
      "title": "12",
      "price": 477,
      "productId": 5
    },
    {
      "id": 13,
      "title": "17",
      "price": 75,
      "productId": 5
    },
    {
      "id": 14,
      "title": "18",
      "price": 136,
      "productId": 5
    },
    {
      "id": 15,
      "title": "14",
      "price": 165,
      "productId": 6
    },
    {
      "id": 16,
      "title": "15",
      "price": 403,
      "productId": 6
    },
    {
      "id": 17,
      "title": "17",
      "price": 134,
      "productId": 6
    },
    {
      "id": 18,
      "title": "20",
      "price": 252,
      "productId": 6
    },
    {
      "id": 19,
      "title": "13",
      "price": 128,
      "productId": 7
    },
    {
      "id": 20,
      "title": "16",
      "price": 463,
      "productId": 7
    },
    {
      "id": 21,
      "title": "12",
      "price": 331,
      "productId": 8
    },
    {
      "id": 22,
      "title": "13",
      "price": 168,
      "productId": 8
    },
    {
      "id": 23,
      "title": "18",
      "price": 113,
      "productId": 8
    },
    {
      "id": 24,
      "title": "13",
      "price": 25,
      "productId": 9
    },
    {
      "id": 25,
      "title": "14",
      "price": 343,
      "productId": 9
    },
    {
      "id": 26,
      "title": "17",
      "price": 454,
      "productId": 9
    },
    {
      "id": 27,
      "title": "18",
      "price": 65,
      "productId": 9
    },
    {
      "id": 28,
      "title": "11",
      "price": 313,
      "productId": 10
    },
    {
      "id": 29,
      "title": "13",
      "price": 220,
      "productId": 10
    },
    {
      "id": 30,
      "title": "16",
      "price": 138,
      "productId": 10
    },
    {
      "id": 31,
      "title": "17",
      "price": 420,
      "productId": 10
    },
    {
      "id": 32,
      "title": "18",
      "price": 41,
      "productId": 10
    },
    {
      "id": 33,
      "title": "13",
      "price": 145,
      "productId": 11
    },
    {
      "id": 34,
      "title": "16",
      "price": 113,
      "productId": 11
    },
    {
      "id": 35,
      "title": "17",
      "price": 111,
      "productId": 11
    },
    {
      "id": 36,
      "title": "19",
      "price": 94,
      "productId": 11
    },
    {
      "id": 37,
      "title": "20",
      "price": 83,
      "productId": 11
    },
    {
      "id": 38,
      "title": "11",
      "price": 247,
      "productId": 12
    },
    {
      "id": 39,
      "title": "16",
      "price": 90,
      "productId": 12
    },
    {
      "id": 40,
      "title": "17",
      "price": 383,
      "productId": 12
    },
    {
      "id": 41,
      "title": "19",
      "price": 253,
      "productId": 12
    },
    {
      "id": 42,
      "title": "19",
      "price": 491,
      "productId": 13
    },
    {
      "id": 43,
      "title": "20",
      "price": 447,
      "productId": 13
    },
    {
      "id": 44,
      "title": "17",
      "price": 475,
      "productId": 14
    },
    {
      "id": 45,
      "title": "15",
      "price": 192,
      "productId": 15
    },
    {
      "id": 46,
      "title": "16",
      "price": 487,
      "productId": 15
    },
    {
      "id": 47,
      "title": "18",
      "price": 99,
      "productId": 15
    },
    {
      "id": 48,
      "title": "11",
      "price": 218,
      "productId": 16
    },
    {
      "id": 49,
      "title": "13",
      "price": 131,
      "productId": 16
    },
    {
      "id": 50,
      "title": "18",
      "price": 202,
      "productId": 16
    },
    {
      "id": 51,
      "title": "13",
      "price": 317,
      "productId": 17
    },
    {
      "id": 52,
      "title": "10",
      "price": 288,
      "productId": 18
    },
    {
      "id": 53,
      "title": "13",
      "price": 217,
      "productId": 18
    },
    {
      "id": 54,
      "title": "16",
      "price": 380,
      "productId": 18
    },
    {
      "id": 55,
      "title": "17",
      "price": 66,
      "productId": 18
    },
    {
      "id": 56,
      "title": "10",
      "price": 405,
      "productId": 19
    },
    {
      "id": 57,
      "title": "11",
      "price": 441,
      "productId": 19
    },
    {
      "id": 58,
      "title": "14",
      "price": 348,
      "productId": 19
    },
    {
      "id": 59,
      "title": "15",
      "price": 241,
      "productId": 19
    },
    {
      "id": 60,
      "title": "20",
      "price": 66,
      "productId": 19
    },
    {
      "id": 61,
      "title": "19",
      "price": 42,
      "productId": 20
    },
    {
      "id": 62,
      "title": "10",
      "price": 359,
      "productId": 21
    },
    {
      "id": 63,
      "title": "11",
      "price": 477,
      "productId": 21
    },
    {
      "id": 64,
      "title": "16",
      "price": 76,
      "productId": 21
    },
    {
      "id": 65,
      "title": "15",
      "price": 328,
      "productId": 22
    },
    {
      "id": 66,
      "title": "16",
      "price": 457,
      "productId": 22
    },
    {
      "id": 67,
      "title": "19",
      "price": 492,
      "productId": 22
    },
    {
      "id": 68,
      "title": "20",
      "price": 111,
      "productId": 22
    },
    {
      "id": 69,
      "title": "11",
      "price": 297,
      "productId": 23
    },
    {
      "id": 70,
      "title": "16",
      "price": 387,
      "productId": 23
    },
    {
      "id": 71,
      "title": "18",
      "price": 292,
      "productId": 23
    },
    {
      "id": 72,
      "title": "11",
      "price": 320,
      "productId": 24
    },
    {
      "id": 73,
      "title": "11",
      "price": 164,
      "productId": 25
    },
    {
      "id": 74,
      "title": "16",
      "price": 184,
      "productId": 25
    },
    {
      "id": 75,
      "title": "19",
      "price": 389,
      "productId": 25
    },
    {
      "id": 76,
      "title": "10",
      "price": 469,
      "productId": 26
    },
    {
      "id": 77,
      "title": "12",
      "price": 331,
      "productId": 26
    },
    {
      "id": 78,
      "title": "14",
      "price": 141,
      "productId": 26
    },
    {
      "id": 79,
      "title": "15",
      "price": 296,
      "productId": 26
    },
    {
      "id": 80,
      "title": "18",
      "price": 298,
      "productId": 26
    },
    {
      "id": 81,
      "title": "10",
      "price": 488,
      "productId": 27
    },
    {
      "id": 82,
      "title": "13",
      "price": 290,
      "productId": 27
    },
    {
      "id": 83,
      "title": "10",
      "price": 46,
      "productId": 28
    },
    {
      "id": 84,
      "title": "11",
      "price": 385,
      "productId": 29
    },
    {
      "id": 85,
      "title": "15",
      "price": 208,
      "productId": 29
    },
    {
      "id": 86,
      "title": "18",
      "price": 395,
      "productId": 29
    },
    {
      "id": 87,
      "title": "13",
      "price": 197,
      "productId": 30
    },
    {
      "id": 88,
      "title": "14",
      "price": 238,
      "productId": 30
    },
    {
      "id": 89,
      "title": "18",
      "price": 327,
      "productId": 30
    },
    {
      "id": 90,
      "title": "19",
      "price": 255,
      "productId": 30
    },
    {
      "id": 91,
      "title": "20",
      "price": 382,
      "productId": 30
    },
    {
      "id": 92,
      "title": "17",
      "price": 276,
      "productId": 31
    },
    {
      "id": 93,
      "title": "12",
      "price": 420,
      "productId": 32
    },
    {
      "id": 94,
      "title": "18",
      "price": 369,
      "productId": 32
    },
    {
      "id": 95,
      "title": "20",
      "price": 261,
      "productId": 33
    },
    {
      "id": 96,
      "title": "10",
      "price": 481,
      "productId": 34
    },
    {
      "id": 97,
      "title": "11",
      "price": 208,
      "productId": 34
    },
    {
      "id": 98,
      "title": "14",
      "price": 375,
      "productId": 34
    },
    {
      "id": 99,
      "title": "17",
      "price": 290,
      "productId": 34
    },
    {
      "id": 100,
      "title": "20",
      "price": 265,
      "productId": 34
    },
    {
      "id": 101,
      "title": "10",
      "price": 226,
      "productId": 35
    },
    {
      "id": 102,
      "title": "11",
      "price": 38,
      "productId": 35
    },
    {
      "id": 103,
      "title": "18",
      "price": 52,
      "productId": 35
    },
    {
      "id": 104,
      "title": "19",
      "price": 248,
      "productId": 35
    },
    {
      "id": 105,
      "title": "11",
      "price": 298,
      "productId": 36
    },
    {
      "id": 106,
      "title": "16",
      "price": 115,
      "productId": 36
    },
    {
      "id": 107,
      "title": "17",
      "price": 86,
      "productId": 36
    },
    {
      "id": 108,
      "title": "18",
      "price": 345,
      "productId": 36
    },
    {
      "id": 109,
      "title": "13",
      "price": 126,
      "productId": 37
    },
    {
      "id": 110,
      "title": "14",
      "price": 450,
      "productId": 37
    },
    {
      "id": 111,
      "title": "19",
      "price": 220,
      "productId": 37
    },
    {
      "id": 112,
      "title": "14",
      "price": 410,
      "productId": 38
    },
    {
      "id": 113,
      "title": "15",
      "price": 74,
      "productId": 38
    },
    {
      "id": 114,
      "title": "18",
      "price": 488,
      "productId": 38
    },
    {
      "id": 115,
      "title": "13",
      "price": 392,
      "productId": 39
    },
    {
      "id": 116,
      "title": "14",
      "price": 387,
      "productId": 39
    },
    {
      "id": 117,
      "title": "18",
      "price": 447,
      "productId": 39
    },
    {
      "id": 118,
      "title": "19",
      "price": 418,
      "productId": 39
    },
    {
      "id": 119,
      "title": "12",
      "price": 21,
      "productId": 40
    },
    {
      "id": 120,
      "title": "18",
      "price": 82,
      "productId": 40
    },
    {
      "id": 121,
      "title": "10",
      "price": 84,
      "productId": 41
    },
    {
      "id": 122,
      "title": "20",
      "price": 420,
      "productId": 41
    },
    {
      "id": 123,
      "title": "11",
      "price": 255,
      "productId": 42
    },
    {
      "id": 124,
      "title": "13",
      "price": 455,
      "productId": 42
    },
    {
      "id": 125,
      "title": "12",
      "price": 306,
      "productId": 43
    },
    {
      "id": 126,
      "title": "15",
      "price": 423,
      "productId": 43
    },
    {
      "id": 127,
      "title": "16",
      "price": 89,
      "productId": 43
    },
    {
      "id": 128,
      "title": "17",
      "price": 477,
      "productId": 43
    },
    {
      "id": 129,
      "title": "10",
      "price": 371,
      "productId": 44
    },
    {
      "id": 130,
      "title": "18",
      "price": 316,
      "productId": 44
    },
    {
      "id": 131,
      "title": "19",
      "price": 69,
      "productId": 44
    },
    {
      "id": 132,
      "title": "10",
      "price": 169,
      "productId": 45
    },
    {
      "id": 133,
      "title": "11",
      "price": 138,
      "productId": 45
    },
    {
      "id": 134,
      "title": "13",
      "price": 130,
      "productId": 45
    },
    {
      "id": 135,
      "title": "15",
      "price": 497,
      "productId": 45
    },
    {
      "id": 136,
      "title": "10",
      "price": 250,
      "productId": 46
    },
    {
      "id": 137,
      "title": "15",
      "price": 51,
      "productId": 46
    },
    {
      "id": 138,
      "title": "16",
      "price": 408,
      "productId": 46
    },
    {
      "id": 139,
      "title": "12",
      "price": 205,
      "productId": 47
    },
    {
      "id": 140,
      "title": "14",
      "price": 25,
      "productId": 47
    },
    {
      "id": 141,
      "title": "15",
      "price": 166,
      "productId": 47
    },
    {
      "id": 142,
      "title": "19",
      "price": 140,
      "productId": 47
    },
    {
      "id": 143,
      "title": "20",
      "price": 345,
      "productId": 47
    },
    {
      "id": 144,
      "title": "11",
      "price": 426,
      "productId": 48
    },
    {
      "id": 145,
      "title": "14",
      "price": 475,
      "productId": 48
    },
    {
      "id": 146,
      "title": "20",
      "price": 29,
      "productId": 48
    },
    {
      "id": 147,
      "title": "15",
      "price": 53,
      "productId": 49
    },
    {
      "id": 148,
      "title": "11",
      "price": 375,
      "productId": 50
    },
    {
      "id": 149,
      "title": "13",
      "price": 131,
      "productId": 50
    },
    {
      "id": 150,
      "title": "14",
      "price": 80,
      "productId": 50
    },
    {
      "id": 151,
      "title": "19",
      "price": 230,
      "productId": 50
    },
    {
      "id": 152,
      "title": "10",
      "price": 262,
      "productId": 51
    },
    {
      "id": 153,
      "title": "13",
      "price": 438,
      "productId": 51
    },
    {
      "id": 154,
      "title": "17",
      "price": 272,
      "productId": 51
    },
    {
      "id": 155,
      "title": "12",
      "price": 231,
      "productId": 52
    },
    {
      "id": 156,
      "title": "15",
      "price": 93,
      "productId": 52
    },
    {
      "id": 157,
      "title": "10",
      "price": 120,
      "productId": 53
    },
    {
      "id": 158,
      "title": "14",
      "price": 76,
      "productId": 53
    },
    {
      "id": 159,
      "title": "17",
      "price": 153,
      "productId": 53
    },
    {
      "id": 160,
      "title": "18",
      "price": 167,
      "productId": 53
    },
    {
      "id": 161,
      "title": "12",
      "price": 197,
      "productId": 54
    },
    {
      "id": 162,
      "title": "14",
      "price": 373,
      "productId": 54
    },
    {
      "id": 163,
      "title": "15",
      "price": 203,
      "productId": 54
    },
    {
      "id": 164,
      "title": "16",
      "price": 456,
      "productId": 55
    },
    {
      "id": 165,
      "title": "17",
      "price": 291,
      "productId": 55
    },
    {
      "id": 166,
      "title": "18",
      "price": 290,
      "productId": 55
    },
    {
      "id": 167,
      "title": "19",
      "price": 115,
      "productId": 55
    },
    {
      "id": 168,
      "title": "10",
      "price": 256,
      "productId": 56
    },
    {
      "id": 169,
      "title": "12",
      "price": 183,
      "productId": 56
    },
    {
      "id": 170,
      "title": "13",
      "price": 476,
      "productId": 56
    },
    {
      "id": 171,
      "title": "15",
      "price": 36,
      "productId": 56
    },
    {
      "id": 172,
      "title": "17",
      "price": 205,
      "productId": 56
    },
    {
      "id": 173,
      "title": "13",
      "price": 217,
      "productId": 57
    },
    {
      "id": 174,
      "title": "15",
      "price": 302,
      "productId": 57
    },
    {
      "id": 175,
      "title": "16",
      "price": 162,
      "productId": 57
    },
    {
      "id": 176,
      "title": "17",
      "price": 243,
      "productId": 57
    },
    {
      "id": 177,
      "title": "18",
      "price": 148,
      "productId": 57
    },
    {
      "id": 178,
      "title": "10",
      "price": 272,
      "productId": 58
    },
    {
      "id": 179,
      "title": "14",
      "price": 83,
      "productId": 58
    },
    {
      "id": 180,
      "title": "15",
      "price": 161,
      "productId": 58
    },
    {
      "id": 181,
      "title": "20",
      "price": 301,
      "productId": 58
    },
    {
      "id": 182,
      "title": "12",
      "price": 213,
      "productId": 59
    },
    {
      "id": 183,
      "title": "13",
      "price": 475,
      "productId": 60
    },
    {
      "id": 184,
      "title": "14",
      "price": 33,
      "productId": 60
    },
    {
      "id": 185,
      "title": "19",
      "price": 214,
      "productId": 60
    },
    {
      "id": 186,
      "title": "13",
      "price": 466,
      "productId": 61
    },
    {
      "id": 187,
      "title": "14",
      "price": 355,
      "productId": 61
    },
    {
      "id": 188,
      "title": "16",
      "price": 494,
      "productId": 61
    },
    {
      "id": 189,
      "title": "18",
      "price": 408,
      "productId": 61
    },
    {
      "id": 190,
      "title": "13",
      "price": 385,
      "productId": 62
    },
    {
      "id": 191,
      "title": "14",
      "price": 439,
      "productId": 62
    },
    {
      "id": 192,
      "title": "11",
      "price": 116,
      "productId": 63
    },
    {
      "id": 193,
      "title": "17",
      "price": 275,
      "productId": 63
    },
    {
      "id": 194,
      "title": "18",
      "price": 64,
      "productId": 63
    },
    {
      "id": 195,
      "title": "20",
      "price": 372,
      "productId": 63
    },
    {
      "id": 196,
      "title": "13",
      "price": 187,
      "productId": 64
    },
    {
      "id": 197,
      "title": "20",
      "price": 58,
      "productId": 64
    },
    {
      "id": 198,
      "title": "11",
      "price": 68,
      "productId": 65
    },
    {
      "id": 199,
      "title": "12",
      "price": 453,
      "productId": 65
    },
    {
      "id": 200,
      "title": "10",
      "price": 207,
      "productId": 66
    },
    {
      "id": 201,
      "title": "12",
      "price": 201,
      "productId": 66
    },
    {
      "id": 202,
      "title": "15",
      "price": 111,
      "productId": 66
    },
    {
      "id": 203,
      "title": "17",
      "price": 465,
      "productId": 66
    },
    {
      "id": 204,
      "title": "19",
      "price": 38,
      "productId": 66
    },
    {
      "id": 205,
      "title": "10",
      "price": 53,
      "productId": 67
    },
    {
      "id": 206,
      "title": "12",
      "price": 136,
      "productId": 67
    },
    {
      "id": 207,
      "title": "14",
      "price": 126,
      "productId": 67
    },
    {
      "id": 208,
      "title": "12",
      "price": 75,
      "productId": 68
    },
    {
      "id": 209,
      "title": "14",
      "price": 336,
      "productId": 68
    },
    {
      "id": 210,
      "title": "15",
      "price": 135,
      "productId": 68
    },
    {
      "id": 211,
      "title": "19",
      "price": 393,
      "productId": 68
    },
    {
      "id": 212,
      "title": "10",
      "price": 456,
      "productId": 69
    },
    {
      "id": 213,
      "title": "12",
      "price": 91,
      "productId": 69
    },
    {
      "id": 214,
      "title": "14",
      "price": 138,
      "productId": 69
    },
    {
      "id": 215,
      "title": "20",
      "price": 252,
      "productId": 69
    },
    {
      "id": 216,
      "title": "13",
      "price": 361,
      "productId": 70
    },
    {
      "id": 217,
      "title": "18",
      "price": 131,
      "productId": 70
    },
    {
      "id": 218,
      "title": "20",
      "price": 128,
      "productId": 70
    },
    {
      "id": 219,
      "title": "11",
      "price": 336,
      "productId": 71
    },
    {
      "id": 220,
      "title": "12",
      "price": 236,
      "productId": 71
    },
    {
      "id": 221,
      "title": "13",
      "price": 160,
      "productId": 71
    },
    {
      "id": 222,
      "title": "14",
      "price": 483,
      "productId": 71
    },
    {
      "id": 223,
      "title": "19",
      "price": 484,
      "productId": 71
    },
    {
      "id": 224,
      "title": "11",
      "price": 69,
      "productId": 72
    },
    {
      "id": 225,
      "title": "19",
      "price": 149,
      "productId": 72
    },
    {
      "id": 226,
      "title": "13",
      "price": 493,
      "productId": 73
    },
    {
      "id": 227,
      "title": "20",
      "price": 309,
      "productId": 74
    },
    {
      "id": 228,
      "title": "17",
      "price": 169,
      "productId": 75
    },
    {
      "id": 229,
      "title": "20",
      "price": 383,
      "productId": 75
    },
    {
      "id": 230,
      "title": "13",
      "price": 122,
      "productId": 76
    },
    {
      "id": 231,
      "title": "16",
      "price": 211,
      "productId": 76
    },
    {
      "id": 232,
      "title": "16",
      "price": 463,
      "productId": 77
    },
    {
      "id": 233,
      "title": "17",
      "price": 394,
      "productId": 77
    },
    {
      "id": 234,
      "title": "18",
      "price": 256,
      "productId": 77
    },
    {
      "id": 235,
      "title": "10",
      "price": 145,
      "productId": 78
    },
    {
      "id": 236,
      "title": "16",
      "price": 201,
      "productId": 78
    },
    {
      "id": 237,
      "title": "20",
      "price": 288,
      "productId": 78
    },
    {
      "id": 238,
      "title": "17",
      "price": 131,
      "productId": 79
    },
    {
      "id": 239,
      "title": "20",
      "price": 331,
      "productId": 79
    },
    {
      "id": 240,
      "title": "10",
      "price": 161,
      "productId": 80
    },
    {
      "id": 241,
      "title": "12",
      "price": 134,
      "productId": 80
    },
    {
      "id": 242,
      "title": "16",
      "price": 132,
      "productId": 80
    },
    {
      "id": 243,
      "title": "18",
      "price": 95,
      "productId": 80
    },
    {
      "id": 244,
      "title": "13",
      "price": 477,
      "productId": 81
    },
    {
      "id": 245,
      "title": "15",
      "price": 247,
      "productId": 81
    },
    {
      "id": 246,
      "title": "19",
      "price": 322,
      "productId": 81
    },
    {
      "id": 247,
      "title": "20",
      "price": 199,
      "productId": 81
    },
    {
      "id": 248,
      "title": "14",
      "price": 130,
      "productId": 82
    },
    {
      "id": 249,
      "title": "12",
      "price": 144,
      "productId": 83
    },
    {
      "id": 250,
      "title": "14",
      "price": 76,
      "productId": 83
    },
    {
      "id": 251,
      "title": "19",
      "price": 500,
      "productId": 83
    },
    {
      "id": 252,
      "title": "10",
      "price": 488,
      "productId": 84
    },
    {
      "id": 253,
      "title": "14",
      "price": 75,
      "productId": 85
    },
    {
      "id": 254,
      "title": "15",
      "price": 148,
      "productId": 85
    },
    {
      "id": 255,
      "title": "18",
      "price": 315,
      "productId": 85
    },
    {
      "id": 256,
      "title": "19",
      "price": 395,
      "productId": 85
    },
    {
      "id": 257,
      "title": "13",
      "price": 277,
      "productId": 86
    },
    {
      "id": 258,
      "title": "18",
      "price": 291,
      "productId": 86
    },
    {
      "id": 259,
      "title": "19",
      "price": 459,
      "productId": 86
    },
    {
      "id": 260,
      "title": "11",
      "price": 359,
      "productId": 87
    },
    {
      "id": 261,
      "title": "14",
      "price": 210,
      "productId": 87
    },
    {
      "id": 262,
      "title": "12",
      "price": 279,
      "productId": 88
    },
    {
      "id": 263,
      "title": "14",
      "price": 229,
      "productId": 89
    },
    {
      "id": 264,
      "title": "19",
      "price": 347,
      "productId": 89
    },
    {
      "id": 265,
      "title": "20",
      "price": 443,
      "productId": 89
    },
    {
      "id": 266,
      "title": "13",
      "price": 141,
      "productId": 90
    },
    {
      "id": 267,
      "title": "17",
      "price": 160,
      "productId": 90
    },
    {
      "id": 268,
      "title": "10",
      "price": 79,
      "productId": 91
    },
    {
      "id": 269,
      "title": "14",
      "price": 319,
      "productId": 91
    },
    {
      "id": 270,
      "title": "15",
      "price": 261,
      "productId": 91
    },
    {
      "id": 271,
      "title": "18",
      "price": 120,
      "productId": 91
    },
    {
      "id": 272,
      "title": "10",
      "price": 422,
      "productId": 92
    },
    {
      "id": 273,
      "title": "18",
      "price": 61,
      "productId": 92
    },
    {
      "id": 274,
      "title": "16",
      "price": 134,
      "productId": 93
    },
    {
      "id": 275,
      "title": "18",
      "price": 42,
      "productId": 93
    },
    {
      "id": 276,
      "title": "19",
      "price": 294,
      "productId": 93
    },
    {
      "id": 277,
      "title": "20",
      "price": 367,
      "productId": 93
    },
    {
      "id": 278,
      "title": "10",
      "price": 22,
      "productId": 94
    },
    {
      "id": 279,
      "title": "11",
      "price": 169,
      "productId": 95
    },
    {
      "id": 280,
      "title": "13",
      "price": 26,
      "productId": 95
    },
    {
      "id": 281,
      "title": "17",
      "price": 377,
      "productId": 95
    },
    {
      "id": 282,
      "title": "10",
      "price": 70,
      "productId": 96
    },
    {
      "id": 283,
      "title": "12",
      "price": 110,
      "productId": 96
    },
    {
      "id": 284,
      "title": "15",
      "price": 391,
      "productId": 96
    },
    {
      "id": 285,
      "title": "16",
      "price": 64,
      "productId": 96
    },
    {
      "id": 286,
      "title": "18",
      "price": 377,
      "productId": 96
    },
    {
      "id": 287,
      "title": "10",
      "price": 101,
      "productId": 97
    },
    {
      "id": 288,
      "title": "11",
      "price": 186,
      "productId": 97
    },
    {
      "id": 289,
      "title": "12",
      "price": 332,
      "productId": 97
    },
    {
      "id": 290,
      "title": "16",
      "price": 393,
      "productId": 97
    },
    {
      "id": 291,
      "title": "17",
      "price": 430,
      "productId": 97
    },
    {
      "id": 292,
      "title": "11",
      "price": 147,
      "productId": 98
    },
    {
      "id": 293,
      "title": "17",
      "price": 206,
      "productId": 98
    },
    {
      "id": 294,
      "title": "18",
      "price": 177,
      "productId": 98
    },
    {
      "id": 295,
      "title": "20",
      "price": 331,
      "productId": 98
    },
    {
      "id": 296,
      "title": "10",
      "price": 268,
      "productId": 99
    },
    {
      "id": 297,
      "title": "16",
      "price": 134,
      "productId": 99
    },
    {
      "id": 298,
      "title": "20",
      "price": 475,
      "productId": 99
    },
    {
      "id": 299,
      "title": "10",
      "price": 196,
      "productId": 100
    },
    {
      "id": 300,
      "title": "11",
      "price": 429,
      "productId": 100
    },
    {
      "id": 301,
      "title": "12",
      "price": 439,
      "productId": 100
    },
    {
      "id": 302,
      "title": "17",
      "price": 241,
      "productId": 100
    },
    {
      "id": 303,
      "title": "18",
      "price": 327,
      "productId": 100
    },
    {
      "id": 304,
      "title": "11",
      "price": 94,
      "productId": 101
    },
    {
      "id": 305,
      "title": "17",
      "price": 280,
      "productId": 101
    },
    {
      "id": 306,
      "title": "20",
      "price": 315,
      "productId": 101
    },
    {
      "id": 307,
      "title": "12",
      "price": 411,
      "productId": 102
    },
    {
      "id": 308,
      "title": "13",
      "price": 74,
      "productId": 102
    },
    {
      "id": 309,
      "title": "17",
      "price": 50,
      "productId": 102
    },
    {
      "id": 310,
      "title": "10",
      "price": 252,
      "productId": 103
    },
    {
      "id": 311,
      "title": "11",
      "price": 352,
      "productId": 103
    },
    {
      "id": 312,
      "title": "18",
      "price": 294,
      "productId": 103
    },
    {
      "id": 313,
      "title": "19",
      "price": 479,
      "productId": 103
    }
  ],
  "orders": [],
  "shippingMethods": [
    {
      "id": 1,
      "title": "Free Shipping",
      "price": 0
    },
    {
      "id": 2,
      "title": "Local",
      "price": 10
    },
    {
      "id": 3,
      "title": "Flat rate",
      "price": 20
    }
  ],
  "paymentMethods": [
    {
      "id": 1,
      "title": "Direct bank transfer",
      "description": "Make your payment directly into our bank account. Please use your Order ID as the payment reference. Your order will not be shipped until the funds have cleared in our account."
    },
    {
      "id": 2,
      "title": "Cash on delivery",
      "description": "Pay with cash upon delivery."
    },
    {
      "id": 3,
      "title": "Paypal",
      "description": "Pay via PayPal; you can pay with your credit card if you don’t have a PayPal account."
    }
  ]
}