<svg width="30" height="19" viewBox="0 0 14 24" fill="none" xmlns="http://www.w3.org/2000/svg">
<path d="M8.85863 24V13.0533H12.5315L13.0826 8.78588H8.85863V6.06176C8.85863 4.82664 9.20021 3.98492 10.9734 3.98492L13.2312 3.98399V0.167076C12.8408 0.116334 11.5004 0 9.94045 0C6.68293 0 4.45278 1.98836 4.45278 5.63912V8.78588H0.768753V13.0533H4.45278V24H8.85863Z" fill="white"/>
</svg>
