%YAML 1.1
%TAG !u! tag:unity3d.com,2011:
--- !u!1001 &223313492328088407
PrefabInstance:
  m_ObjectHideFlags: 0
  serializedVersion: 2
  m_Modification:
    m_TransformParent: {fileID: 0}
    m_Modifications:
    - target: {fileID: 43806583096781201, guid: 720a24b76b3c8ab419832f088a688319,
        type: 3}
      propertyPath: m_LocalPosition.x
      value: 0.7729879
      objectReference: {fileID: 0}
    - target: {fileID: 43806583096781201, guid: 720a24b76b3c8ab419832f088a688319,
        type: 3}
      propertyPath: m_LocalPosition.y
      value: -0.17027977
      objectReference: {fileID: 0}
    - target: {fileID: 43806583096781201, guid: 720a24b76b3c8ab419832f088a688319,
        type: 3}
      propertyPath: m_LocalPosition.z
      value: -2.2216797
      objectReference: {fileID: 0}
    - target: {fileID: 43806583096781201, guid: 720a24b76b3c8ab419832f088a688319,
        type: 3}
      propertyPath: m_LocalRotation.x
      value: 0
      objectReference: {fileID: 0}
    - target: {fileID: 43806583096781201, guid: 720a24b76b3c8ab419832f088a688319,
        type: 3}
      propertyPath: m_LocalRotation.y
      value: 0
      objectReference: {fileID: 0}
    - target: {fileID: 43806583096781201, guid: 720a24b76b3c8ab419832f088a688319,
        type: 3}
      propertyPath: m_LocalRotation.z
      value: 0
      objectReference: {fileID: 0}
    - target: {fileID: 43806583096781201, guid: 720a24b76b3c8ab419832f088a688319,
        type: 3}
      propertyPath: m_LocalRotation.w
      value: 1
      objectReference: {fileID: 0}
    - target: {fileID: 43806583096781201, guid: 720a24b76b3c8ab419832f088a688319,
        type: 3}
      propertyPath: m_RootOrder
      value: 0
      objectReference: {fileID: 0}
    - target: {fileID: 43806583096781201, guid: 720a24b76b3c8ab419832f088a688319,
        type: 3}
      propertyPath: m_LocalEulerAnglesHint.x
      value: 0
      objectReference: {fileID: 0}
    - target: {fileID: 43806583096781201, guid: 720a24b76b3c8ab419832f088a688319,
        type: 3}
      propertyPath: m_LocalEulerAnglesHint.y
      value: 0
      objectReference: {fileID: 0}
    - target: {fileID: 43806583096781201, guid: 720a24b76b3c8ab419832f088a688319,
        type: 3}
      propertyPath: m_LocalEulerAnglesHint.z
      value: 0
      objectReference: {fileID: 0}
    - target: {fileID: 43806583096781212, guid: 720a24b76b3c8ab419832f088a688319,
        type: 3}
      propertyPath: m_Name
      value: pref_chip_tmpl_001
      objectReference: {fileID: 0}
    - target: {fileID: 43806583096781214, guid: 720a24b76b3c8ab419832f088a688319,
        type: 3}
      propertyPath: m_Sprite
      value: 
      objectReference: {fileID: 21300000, guid: 172774604c1bee84185a69041576525b,
        type: 3}
    - target: {fileID: 43806583096781214, guid: 720a24b76b3c8ab419832f088a688319,
        type: 3}
      propertyPath: m_WasSpriteAssigned
      value: 1
      objectReference: {fileID: 0}
    m_RemovedComponents: []
  m_SourcePrefab: {fileID: 100100000, guid: 720a24b76b3c8ab419832f088a688319, type: 3}
