('C:\\Users\\trebu\\PycharmProjects\\lab8-devops\\app\\build\\app\\app.pkg',
 {'BINARY': True,
  'DATA': True,
  'EXECUTABLE': True,
  'EXTENSION': True,
  'PYMODULE': True,
  'PYSOURCE': True,
  'PYZ': False,
  'SPLASH': True,
  'SYMLINK': False},
 [('pyi-contents-directory _internal', '', 'OPTION'),
  ('PYZ-00.pyz',
   'C:\\Users\\trebu\\PycharmProjects\\lab8-devops\\app\\build\\app\\PYZ-00.pyz',
   'PYZ'),
  ('struct',
   'C:\\Users\\trebu\\PycharmProjects\\lab8-devops\\app\\build\\app\\localpycs\\struct.pyc',
   'PYMODULE'),
  ('pyimod01_archive',
   'C:\\Users\\trebu\\PycharmProjects\\lab8-devops\\app\\build\\app\\localpycs\\pyimod01_archive.pyc',
   'PYMODULE'),
  ('pyimod02_importers',
   'C:\\Users\\trebu\\PycharmProjects\\lab8-devops\\app\\build\\app\\localpycs\\pyimod02_importers.pyc',
   'PYMODULE'),
  ('pyimod03_ctypes',
   'C:\\Users\\trebu\\PycharmProjects\\lab8-devops\\app\\build\\app\\localpycs\\pyimod03_ctypes.pyc',
   'PYMODULE'),
  ('pyimod04_pywin32',
   'C:\\Users\\trebu\\PycharmProjects\\lab8-devops\\app\\build\\app\\localpycs\\pyimod04_pywin32.pyc',
   'PYMODULE'),
  ('pyiboot01_bootstrap',
   'C:\\Users\\trebu\\PycharmProjects\\lab8-devops\\venv\\lib\\site-packages\\PyInstaller\\loader\\pyiboot01_bootstrap.py',
   'PYSOURCE'),
  ('app',
   'C:\\Users\\trebu\\PycharmProjects\\lab8-devops\\app\\app.py',
   'PYSOURCE')],
 'python38.dll',
 True,
 False,
 False,
 [],
 None,
 None,
 None)
