ExtensionManager Error: 0 : 09:11:34.9540103 : 1-testhost : System.IO.FileNotFoundException: Could not load file or assembly 'nunit.engine.api, Version=3.0.0.0, Culture=neutral, PublicKeyToken=2638cd05610744eb'. Не удается найти указанный файл.
File name: 'nunit.engine.api, Version=3.0.0.0, Culture=neutral, PublicKeyToken=2638cd05610744eb'


