{
  "posts": [
    {
      "title": "Random title privet",
      "body": "Random body privet Vasya Pupkin 228"
    },
    {
      "title": "Title privet amlet",
      "body": "Random body privet Vasya Pupkin 228"
    }
  ],
  "users": [
    {
      "username": "user11",
      "password": "123123",
      "email": "email_11@email.org"
    },
    {
      "username": "user22",
      "password": "123123",
      "email": "email_22@email.org"
    },
    {
      "username": "user33",
      "password": "123123",
      "email": "email_33@email.org"
    }
  ]
}