ISO-10303-21;
HEADER;
/* Generated by software containing ST-Developer
 * from STEP Tools, Inc. (www.steptools.com) 
 */

FILE_DESCRIPTION(
/* description */ (''),
/* implementation_level */ '2;1');

FILE_NAME(
/* name */ 
'C:\\Users\\Daniel\\Desktop\\CS354\\ball_on_beam\\motor_with_disk_prac
\\Parts_Assembly\\Disk.stp',
/* time_stamp */ '2020-07-29T09:57:39+02:00',
/* author */ ('Daniel'),
/* organization */ (''),
/* preprocessor_version */ 'ST-DEVELOPER v17',
/* originating_system */ 'Autodesk Inventor 2019',
/* authorisation */ '');

FILE_SCHEMA (('AUTOMOTIVE_DESIGN { 1 0 10303 214 3 1 1 }'));
ENDSEC;

DATA;
#10=MECHANICAL_DESIGN_GEOMETRIC_PRESENTATION_REPRESENTATION('',(#14,#15),
#360);
#11=SHAPE_REPRESENTATION_RELATIONSHIP('SRR','None',#367,#12);
#12=ADVANCED_BREP_SHAPE_REPRESENTATION('',(#13),#359);
#13=MANIFOLD_SOLID_BREP('Solid1',#166);
#14=STYLED_ITEM('',(#378),#165);
#15=STYLED_ITEM('',(#377),#13);
#16=B_SPLINE_CURVE_WITH_KNOTS('',3,(#276,#277,#278,#279,#280,#281,#282,
#283,#284,#285,#286,#287,#288,#289,#290,#291,#292,#293,#294,#295,#296,#297,
#298,#299,#300,#301,#302,#303,#304,#305,#306,#307,#308,#309),
 .UNSPECIFIED.,.T.,.F.,(4,2,2,2,2,2,2,2,2,2,2,2,2,2,2,2,4),(0.,0.0624103424511865,
0.124820684902373,0.187224177734039,0.249627670565705,0.31203116339737,
0.374434656229036,0.436844998680223,0.499255341131409,0.561665683582596,
0.624076026033782,0.686479518865448,0.748883011697114,0.81128650452878,
0.873689997360446,0.936100339811632,0.998510682262819),.UNSPECIFIED.);
#17=B_SPLINE_CURVE_WITH_KNOTS('',3,(#318,#319,#320,#321,#322,#323,#324,
#325,#326,#327,#328,#329,#330,#331,#332,#333,#334,#335),.UNSPECIFIED.,.F.,
 .F.,(4,2,2,2,2,2,2,2,4),(0.,0.0630177527813679,0.126035505562736,0.188979978538956,
0.251924451515177,0.314868924491398,0.377813397467618,0.440831150248986,
0.503848903030354),.UNSPECIFIED.);
#18=B_SPLINE_CURVE_WITH_KNOTS('',3,(#336,#337,#338,#339,#340,#341,#342,
#343,#344,#345,#346,#347,#348,#349,#350,#351,#352,#353),.UNSPECIFIED.,.F.,
 .F.,(4,2,2,2,2,2,2,2,4),(0.503848903030354,0.566866655811722,0.62988440859309,
0.692828881569311,0.755773354545531,0.818717827521752,0.881662300497973,
0.944680053279341,1.00769780606071),.UNSPECIFIED.);
#19=CYLINDRICAL_SURFACE('',#191,40.);
#20=CYLINDRICAL_SURFACE('',#195,7.);
#21=CYLINDRICAL_SURFACE('',#197,3.995);
#22=CYLINDRICAL_SURFACE('',#201,1.65);
#23=FACE_BOUND('',#47,.T.);
#24=FACE_BOUND('',#50,.T.);
#25=FACE_BOUND('',#52,.T.);
#26=FACE_BOUND('',#54,.T.);
#27=FACE_BOUND('',#56,.T.);
#28=CIRCLE('',#189,40.);
#29=CIRCLE('',#190,7.);
#30=CIRCLE('',#192,40.);
#31=CIRCLE('',#194,3.995);
#32=CIRCLE('',#196,7.);
#33=CIRCLE('',#198,3.995);
#34=CIRCLE('',#199,3.995);
#35=FACE_OUTER_BOUND('',#44,.T.);
#36=FACE_OUTER_BOUND('',#45,.T.);
#37=FACE_OUTER_BOUND('',#46,.T.);
#38=FACE_OUTER_BOUND('',#48,.T.);
#39=FACE_OUTER_BOUND('',#49,.T.);
#40=FACE_OUTER_BOUND('',#51,.T.);
#41=FACE_OUTER_BOUND('',#53,.T.);
#42=FACE_OUTER_BOUND('',#55,.T.);
#43=FACE_OUTER_BOUND('',#57,.T.);
#44=EDGE_LOOP('',(#112,#113,#114,#115));
#45=EDGE_LOOP('',(#116,#117,#118,#119));
#46=EDGE_LOOP('',(#120,#121,#122));
#47=EDGE_LOOP('',(#123));
#48=EDGE_LOOP('',(#124,#125,#126,#127));
#49=EDGE_LOOP('',(#128,#129,#130));
#50=EDGE_LOOP('',(#131));
#51=EDGE_LOOP('',(#132,#133,#134,#135));
#52=EDGE_LOOP('',(#136));
#53=EDGE_LOOP('',(#137,#138,#139,#140,#141));
#54=EDGE_LOOP('',(#142,#143));
#55=EDGE_LOOP('',(#144));
#56=EDGE_LOOP('',(#145,#146));
#57=EDGE_LOOP('',(#147,#148,#149,#150,#151));
#58=LINE('',#250,#68);
#59=LINE('',#252,#69);
#60=LINE('',#254,#70);
#61=LINE('',#255,#71);
#62=LINE('',#259,#72);
#63=LINE('',#260,#73);
#64=LINE('',#261,#74);
#65=LINE('',#273,#75);
#66=LINE('',#312,#76);
#67=LINE('',#356,#77);
#68=VECTOR('',#206,10.);
#69=VECTOR('',#207,10.);
#70=VECTOR('',#208,10.);
#71=VECTOR('',#209,10.);
#72=VECTOR('',#212,10.);
#73=VECTOR('',#213,10.);
#74=VECTOR('',#214,10.);
#75=VECTOR('',#231,7.);
#76=VECTOR('',#236,3.995);
#77=VECTOR('',#245,1.65);
#78=VERTEX_POINT('',#248);
#79=VERTEX_POINT('',#249);
#80=VERTEX_POINT('',#251);
#81=VERTEX_POINT('',#253);
#82=VERTEX_POINT('',#257);
#83=VERTEX_POINT('',#258);
#84=VERTEX_POINT('',#264);
#85=VERTEX_POINT('',#269);
#86=VERTEX_POINT('',#272);
#87=VERTEX_POINT('',#275);
#88=VERTEX_POINT('',#311);
#89=VERTEX_POINT('',#313);
#90=VERTEX_POINT('',#316);
#91=VERTEX_POINT('',#317);
#92=EDGE_CURVE('',#78,#79,#58,.T.);
#93=EDGE_CURVE('',#80,#78,#59,.T.);
#94=EDGE_CURVE('',#81,#80,#60,.T.);
#95=EDGE_CURVE('',#79,#81,#61,.T.);
#96=EDGE_CURVE('',#82,#83,#62,.T.);
#97=EDGE_CURVE('',#81,#82,#63,.T.);
#98=EDGE_CURVE('',#83,#80,#64,.T.);
#99=EDGE_CURVE('',#82,#79,#28,.T.);
#100=EDGE_CURVE('',#84,#84,#29,.T.);
#101=EDGE_CURVE('',#78,#83,#30,.T.);
#102=EDGE_CURVE('',#85,#85,#31,.T.);
#103=EDGE_CURVE('',#84,#86,#65,.T.);
#104=EDGE_CURVE('',#86,#86,#32,.T.);
#105=EDGE_CURVE('',#87,#87,#16,.T.);
#106=EDGE_CURVE('',#85,#88,#66,.T.);
#107=EDGE_CURVE('',#88,#89,#33,.T.);
#108=EDGE_CURVE('',#89,#88,#34,.T.);
#109=EDGE_CURVE('',#90,#91,#17,.T.);
#110=EDGE_CURVE('',#91,#90,#18,.T.);
#111=EDGE_CURVE('',#91,#87,#67,.T.);
#112=ORIENTED_EDGE('',*,*,#92,.F.);
#113=ORIENTED_EDGE('',*,*,#93,.F.);
#114=ORIENTED_EDGE('',*,*,#94,.F.);
#115=ORIENTED_EDGE('',*,*,#95,.F.);
#116=ORIENTED_EDGE('',*,*,#96,.F.);
#117=ORIENTED_EDGE('',*,*,#97,.F.);
#118=ORIENTED_EDGE('',*,*,#94,.T.);
#119=ORIENTED_EDGE('',*,*,#98,.F.);
#120=ORIENTED_EDGE('',*,*,#99,.T.);
#121=ORIENTED_EDGE('',*,*,#95,.T.);
#122=ORIENTED_EDGE('',*,*,#97,.T.);
#123=ORIENTED_EDGE('',*,*,#100,.F.);
#124=ORIENTED_EDGE('',*,*,#92,.T.);
#125=ORIENTED_EDGE('',*,*,#99,.F.);
#126=ORIENTED_EDGE('',*,*,#96,.T.);
#127=ORIENTED_EDGE('',*,*,#101,.F.);
#128=ORIENTED_EDGE('',*,*,#101,.T.);
#129=ORIENTED_EDGE('',*,*,#98,.T.);
#130=ORIENTED_EDGE('',*,*,#93,.T.);
#131=ORIENTED_EDGE('',*,*,#102,.T.);
#132=ORIENTED_EDGE('',*,*,#100,.T.);
#133=ORIENTED_EDGE('',*,*,#103,.T.);
#134=ORIENTED_EDGE('',*,*,#104,.F.);
#135=ORIENTED_EDGE('',*,*,#103,.F.);
#136=ORIENTED_EDGE('',*,*,#105,.F.);
#137=ORIENTED_EDGE('',*,*,#102,.F.);
#138=ORIENTED_EDGE('',*,*,#106,.T.);
#139=ORIENTED_EDGE('',*,*,#107,.T.);
#140=ORIENTED_EDGE('',*,*,#108,.T.);
#141=ORIENTED_EDGE('',*,*,#106,.F.);
#142=ORIENTED_EDGE('',*,*,#109,.T.);
#143=ORIENTED_EDGE('',*,*,#110,.T.);
#144=ORIENTED_EDGE('',*,*,#104,.T.);
#145=ORIENTED_EDGE('',*,*,#108,.F.);
#146=ORIENTED_EDGE('',*,*,#107,.F.);
#147=ORIENTED_EDGE('',*,*,#109,.F.);
#148=ORIENTED_EDGE('',*,*,#110,.F.);
#149=ORIENTED_EDGE('',*,*,#111,.T.);
#150=ORIENTED_EDGE('',*,*,#105,.T.);
#151=ORIENTED_EDGE('',*,*,#111,.F.);
#152=PLANE('',#186);
#153=PLANE('',#187);
#154=PLANE('',#188);
#155=PLANE('',#193);
#156=PLANE('',#200);
#157=ADVANCED_FACE('',(#35),#152,.T.);
#158=ADVANCED_FACE('',(#36),#153,.T.);
#159=ADVANCED_FACE('',(#37,#23),#154,.T.);
#160=ADVANCED_FACE('',(#38),#19,.T.);
#161=ADVANCED_FACE('',(#39,#24),#155,.F.);
#162=ADVANCED_FACE('',(#40,#25),#20,.T.);
#163=ADVANCED_FACE('',(#41,#26),#21,.F.);
#164=ADVANCED_FACE('',(#42,#27),#156,.F.);
#165=ADVANCED_FACE('',(#43),#22,.F.);
#166=CLOSED_SHELL('',(#157,#158,#159,#160,#161,#162,#163,#164,#165));
#167=DERIVED_UNIT_ELEMENT(#169,1.);
#168=DERIVED_UNIT_ELEMENT(#362,3.);
#169=(
MASS_UNIT()
NAMED_UNIT(*)
SI_UNIT($,.GRAM.)
);
#170=DERIVED_UNIT((#167,#168));
#171=MEASURE_REPRESENTATION_ITEM('density measure',
POSITIVE_RATIO_MEASURE(1.),#170);
#172=PROPERTY_DEFINITION_REPRESENTATION(#177,#174);
#173=PROPERTY_DEFINITION_REPRESENTATION(#178,#175);
#174=REPRESENTATION('material name',(#176),#359);
#175=REPRESENTATION('density',(#171),#359);
#176=DESCRIPTIVE_REPRESENTATION_ITEM('Generic','Generic');
#177=PROPERTY_DEFINITION('material property','material name',#369);
#178=PROPERTY_DEFINITION('material property','density of part',#369);
#179=DATE_TIME_ROLE('creation_date');
#180=APPLIED_DATE_AND_TIME_ASSIGNMENT(#181,#179,(#369));
#181=DATE_AND_TIME(#182,#183);
#182=CALENDAR_DATE(2020,28,7);
#183=LOCAL_TIME(20,12,5.,#184);
#184=COORDINATED_UNIVERSAL_TIME_OFFSET(0,0,.BEHIND.);
#185=AXIS2_PLACEMENT_3D('placement',#246,#202,#203);
#186=AXIS2_PLACEMENT_3D('',#247,#204,#205);
#187=AXIS2_PLACEMENT_3D('',#256,#210,#211);
#188=AXIS2_PLACEMENT_3D('',#262,#215,#216);
#189=AXIS2_PLACEMENT_3D('',#263,#217,#218);
#190=AXIS2_PLACEMENT_3D('',#265,#219,#220);
#191=AXIS2_PLACEMENT_3D('',#266,#221,#222);
#192=AXIS2_PLACEMENT_3D('',#267,#223,#224);
#193=AXIS2_PLACEMENT_3D('',#268,#225,#226);
#194=AXIS2_PLACEMENT_3D('',#270,#227,#228);
#195=AXIS2_PLACEMENT_3D('',#271,#229,#230);
#196=AXIS2_PLACEMENT_3D('',#274,#232,#233);
#197=AXIS2_PLACEMENT_3D('',#310,#234,#235);
#198=AXIS2_PLACEMENT_3D('',#314,#237,#238);
#199=AXIS2_PLACEMENT_3D('',#315,#239,#240);
#200=AXIS2_PLACEMENT_3D('',#354,#241,#242);
#201=AXIS2_PLACEMENT_3D('',#355,#243,#244);
#202=DIRECTION('axis',(0.,0.,1.));
#203=DIRECTION('refdir',(1.,0.,0.));
#204=DIRECTION('center_axis',(0.,0.145138107275973,-0.989411405744015));
#205=DIRECTION('ref_axis',(-1.77282188267215E-17,-0.989411405744015,-0.145138107275973));
#206=DIRECTION('',(1.,0.,0.));
#207=DIRECTION('',(-1.77282188267215E-17,-0.989411405744015,-0.145138107275973));
#208=DIRECTION('',(-1.,0.,0.));
#209=DIRECTION('',(1.77282188267215E-17,0.989411405744015,0.145138107275973));
#210=DIRECTION('center_axis',(0.,0.145138107275973,0.989411405744015));
#211=DIRECTION('ref_axis',(-1.77282188267215E-17,0.989411405744015,-0.145138107275973));
#212=DIRECTION('',(-1.,0.,0.));
#213=DIRECTION('',(1.77282188267215E-17,-0.989411405744015,0.145138107275973));
#214=DIRECTION('',(-1.77282188267215E-17,0.989411405744015,-0.145138107275973));
#215=DIRECTION('center_axis',(1.,0.,-1.22147237272511E-16));
#216=DIRECTION('ref_axis',(-1.22147237272511E-16,0.,-1.));
#217=DIRECTION('center_axis',(1.,0.,-1.22147237272511E-16));
#218=DIRECTION('ref_axis',(-1.22147237272511E-16,0.,-1.));
#219=DIRECTION('center_axis',(1.,0.,-1.22147237272511E-16));
#220=DIRECTION('ref_axis',(1.22147237272511E-16,0.,1.));
#221=DIRECTION('center_axis',(-1.,0.,0.));
#222=DIRECTION('ref_axis',(0.,-1.,-6.12323399573677E-17));
#223=DIRECTION('center_axis',(-1.,0.,1.22147237272511E-16));
#224=DIRECTION('ref_axis',(-1.22147237272511E-16,0.,-1.));
#225=DIRECTION('center_axis',(1.,0.,-1.22147237272511E-16));
#226=DIRECTION('ref_axis',(-1.22147237272511E-16,0.,-1.));
#227=DIRECTION('center_axis',(1.,0.,-1.22147237272511E-16));
#228=DIRECTION('ref_axis',(-1.22147237272511E-16,0.,-1.));
#229=DIRECTION('center_axis',(-1.,0.,0.));
#230=DIRECTION('ref_axis',(0.,0.,1.));
#231=DIRECTION('',(1.,0.,0.));
#232=DIRECTION('center_axis',(1.,0.,0.));
#233=DIRECTION('ref_axis',(0.,0.,1.));
#234=DIRECTION('center_axis',(1.,0.,0.));
#235=DIRECTION('ref_axis',(0.,0.,-1.));
#236=DIRECTION('',(1.,0.,0.));
#237=DIRECTION('center_axis',(1.,0.,0.));
#238=DIRECTION('ref_axis',(0.,0.,-1.));
#239=DIRECTION('center_axis',(1.,0.,0.));
#240=DIRECTION('ref_axis',(0.,0.,-1.));
#241=DIRECTION('center_axis',(-1.,0.,0.));
#242=DIRECTION('ref_axis',(0.,0.,1.));
#243=DIRECTION('center_axis',(0.,-1.,0.));
#244=DIRECTION('ref_axis',(0.,0.,-1.));
#245=DIRECTION('',(0.,-1.,0.));
#246=CARTESIAN_POINT('',(0.,0.,0.));
#247=CARTESIAN_POINT('Origin',(26.,56.7192376984693,40.));
#248=CARTESIAN_POINT('',(16.,48.9839022640666,38.8652931049953));
#249=CARTESIAN_POINT('',(26.,48.9839022640666,38.8652931049953));
#250=CARTESIAN_POINT('',(26.,48.9839022640666,38.8652931049953));
#251=CARTESIAN_POINT('',(16.,56.7192376984693,40.));
#252=CARTESIAN_POINT('',(16.,9.,33.));
#253=CARTESIAN_POINT('',(26.,56.7192376984693,40.));
#254=CARTESIAN_POINT('',(26.,56.7192376984693,40.));
#255=CARTESIAN_POINT('',(26.,9.,33.));
#256=CARTESIAN_POINT('Origin',(26.,25.7533388855696,44.5424298908541));
#257=CARTESIAN_POINT('',(26.,48.9839022640666,41.1347068950047));
#258=CARTESIAN_POINT('',(16.,48.9839022640666,41.1347068950047));
#259=CARTESIAN_POINT('',(26.,48.9839022640666,41.1347068950047));
#260=CARTESIAN_POINT('',(26.,56.7192376984693,40.));
#261=CARTESIAN_POINT('',(16.,56.7192376984693,40.));
#262=CARTESIAN_POINT('Origin',(26.,9.,40.));
#263=CARTESIAN_POINT('Origin',(26.,9.,40.));
#264=CARTESIAN_POINT('',(26.,9.,33.));
#265=CARTESIAN_POINT('Origin',(26.,9.,40.));
#266=CARTESIAN_POINT('Origin',(26.,9.,40.));
#267=CARTESIAN_POINT('Origin',(16.,9.,40.));
#268=CARTESIAN_POINT('Origin',(16.,9.,40.));
#269=CARTESIAN_POINT('',(16.,9.,43.995));
#270=CARTESIAN_POINT('Origin',(16.,9.,40.));
#271=CARTESIAN_POINT('Origin',(36.,9.,40.));
#272=CARTESIAN_POINT('',(36.,9.,33.));
#273=CARTESIAN_POINT('',(36.,9.,33.));
#274=CARTESIAN_POINT('Origin',(36.,9.,40.));
#275=CARTESIAN_POINT('',(31.,2.19724320587602,41.65));
#276=CARTESIAN_POINT('Ctrl Pts',(31.,2.19724320587602,41.65));
#277=CARTESIAN_POINT('Ctrl Pts',(30.7919655251627,2.19724320587602,41.65));
#278=CARTESIAN_POINT('Ctrl Pts',(30.5706250250479,2.1867077610547,41.6082634406533));
#279=CARTESIAN_POINT('Ctrl Pts',(30.1643461909629,2.14909457408689,41.4396378332857));
#280=CARTESIAN_POINT('Ctrl Pts',(29.9793366836732,2.12260740834636,41.3127890615888));
#281=CARTESIAN_POINT('Ctrl Pts',(29.687226969009,2.07322926363068,41.0206793469247));
#282=CARTESIAN_POINT('Ctrl Pts',(29.5603656790885,2.04706699921598,40.8356631227516));
#283=CARTESIAN_POINT('Ctrl Pts',(29.3917309535961,2.01020317709122,40.4293606175424));
#284=CARTESIAN_POINT('Ctrl Pts',(29.35,2.,40.2080116427722));
#285=CARTESIAN_POINT('Ctrl Pts',(29.35,2.,39.7919883572278));
#286=CARTESIAN_POINT('Ctrl Pts',(29.3917309535961,2.01020317709122,39.5706393824576));
#287=CARTESIAN_POINT('Ctrl Pts',(29.5603656790885,2.04706699921598,39.1643368772484));
#288=CARTESIAN_POINT('Ctrl Pts',(29.687226969009,2.07322926363068,38.9793206530753));
#289=CARTESIAN_POINT('Ctrl Pts',(29.9793366836732,2.12260740834636,38.6872109384112));
#290=CARTESIAN_POINT('Ctrl Pts',(30.1643461909629,2.14909457408689,38.5603621667143));
#291=CARTESIAN_POINT('Ctrl Pts',(30.5706250250479,2.1867077610547,38.3917365593467));
#292=CARTESIAN_POINT('Ctrl Pts',(30.7919655251627,2.19724320587602,38.35));
#293=CARTESIAN_POINT('Ctrl Pts',(31.2080344748373,2.19724320587602,38.35));
#294=CARTESIAN_POINT('Ctrl Pts',(31.4293749749521,2.1867077610547,38.3917365593467));
#295=CARTESIAN_POINT('Ctrl Pts',(31.8356538090371,2.14909457408689,38.5603621667143));
#296=CARTESIAN_POINT('Ctrl Pts',(32.0206633163268,2.12260740834636,38.6872109384112));
#297=CARTESIAN_POINT('Ctrl Pts',(32.312773030991,2.07322926363068,38.9793206530753));
#298=CARTESIAN_POINT('Ctrl Pts',(32.4396343209115,2.04706699921598,39.1643368772484));
#299=CARTESIAN_POINT('Ctrl Pts',(32.6082690464039,2.01020317709122,39.5706393824576));
#300=CARTESIAN_POINT('Ctrl Pts',(32.65,2.,39.7919883572278));
#301=CARTESIAN_POINT('Ctrl Pts',(32.65,2.,40.2080116427722));
#302=CARTESIAN_POINT('Ctrl Pts',(32.6082690464039,2.01020317709122,40.4293606175424));
#303=CARTESIAN_POINT('Ctrl Pts',(32.4396343209115,2.04706699921598,40.8356631227516));
#304=CARTESIAN_POINT('Ctrl Pts',(32.312773030991,2.07322926363068,41.0206793469247));
#305=CARTESIAN_POINT('Ctrl Pts',(32.0206633163268,2.12260740834636,41.3127890615888));
#306=CARTESIAN_POINT('Ctrl Pts',(31.8356538090371,2.14909457408689,41.4396378332857));
#307=CARTESIAN_POINT('Ctrl Pts',(31.4293749749521,2.1867077610547,41.6082634406533));
#308=CARTESIAN_POINT('Ctrl Pts',(31.2080344748373,2.19724320587602,41.65));
#309=CARTESIAN_POINT('Ctrl Pts',(31.,2.19724320587602,41.65));
#310=CARTESIAN_POINT('Origin',(0.,9.,40.));
#311=CARTESIAN_POINT('',(36.,9.,43.995));
#312=CARTESIAN_POINT('',(0.,9.,43.995));
#313=CARTESIAN_POINT('',(36.,9.,36.005));
#314=CARTESIAN_POINT('Origin',(36.,9.,40.));
#315=CARTESIAN_POINT('Origin',(36.,9.,40.));
#316=CARTESIAN_POINT('',(31.,5.36165903192126,38.35));
#317=CARTESIAN_POINT('',(31.,5.36165903192128,41.65));
#318=CARTESIAN_POINT('Ctrl Pts',(31.,5.36165903192128,38.35));
#319=CARTESIAN_POINT('Ctrl Pts',(31.2100591759379,5.36165903192128,38.35));
#320=CARTESIAN_POINT('Ctrl Pts',(31.4321028033701,5.34154067543259,38.3924974950859));
#321=CARTESIAN_POINT('Ctrl Pts',(31.8377101697049,5.27181428188408,38.561591308997));
#322=CARTESIAN_POINT('Ctrl Pts',(32.0215378566015,5.22350023244956,38.6880854786859));
#323=CARTESIAN_POINT('Ctrl Pts',(32.3117456899573,5.134882655787,38.9782933120417));
#324=CARTESIAN_POINT('Ctrl Pts',(32.4383674498649,5.08843554946926,39.1621841397489));
#325=CARTESIAN_POINT('Ctrl Pts',(32.6075595232592,5.02310635495814,39.56804073276));
#326=CARTESIAN_POINT('Ctrl Pts',(32.65,5.005,39.7901850900793));
#327=CARTESIAN_POINT('Ctrl Pts',(32.65,5.005,40.2098149099207));
#328=CARTESIAN_POINT('Ctrl Pts',(32.6075595232592,5.02310635495814,40.4319592672401));
#329=CARTESIAN_POINT('Ctrl Pts',(32.4383674498649,5.08843554946926,40.8378158602511));
#330=CARTESIAN_POINT('Ctrl Pts',(32.3117456899573,5.134882655787,41.0217066879583));
#331=CARTESIAN_POINT('Ctrl Pts',(32.0215378566015,5.22350023244956,41.3119145213141));
#332=CARTESIAN_POINT('Ctrl Pts',(31.8377101697049,5.27181428188408,41.438408691003));
#333=CARTESIAN_POINT('Ctrl Pts',(31.4321028033701,5.34154067543259,41.6075025049141));
#334=CARTESIAN_POINT('Ctrl Pts',(31.2100591759379,5.36165903192128,41.65));
#335=CARTESIAN_POINT('Ctrl Pts',(31.,5.36165903192128,41.65));
#336=CARTESIAN_POINT('Ctrl Pts',(31.,5.36165903192128,41.65));
#337=CARTESIAN_POINT('Ctrl Pts',(30.7899408240621,5.36165903192128,41.65));
#338=CARTESIAN_POINT('Ctrl Pts',(30.5678971966299,5.34154067543259,41.6075025049141));
#339=CARTESIAN_POINT('Ctrl Pts',(30.1622898302951,5.27181428188408,41.438408691003));
#340=CARTESIAN_POINT('Ctrl Pts',(29.9784621433985,5.22350023244956,41.3119145213141));
#341=CARTESIAN_POINT('Ctrl Pts',(29.6882543100427,5.134882655787,41.0217066879583));
#342=CARTESIAN_POINT('Ctrl Pts',(29.5616325501351,5.08843554946926,40.8378158602511));
#343=CARTESIAN_POINT('Ctrl Pts',(29.3924404767408,5.02310635495814,40.43195926724));
#344=CARTESIAN_POINT('Ctrl Pts',(29.35,5.005,40.2098149099207));
#345=CARTESIAN_POINT('Ctrl Pts',(29.35,5.005,39.7901850900793));
#346=CARTESIAN_POINT('Ctrl Pts',(29.3924404767408,5.02310635495814,39.56804073276));
#347=CARTESIAN_POINT('Ctrl Pts',(29.5616325501351,5.08843554946926,39.1621841397489));
#348=CARTESIAN_POINT('Ctrl Pts',(29.6882543100427,5.134882655787,38.9782933120417));
#349=CARTESIAN_POINT('Ctrl Pts',(29.9784621433985,5.22350023244956,38.6880854786859));
#350=CARTESIAN_POINT('Ctrl Pts',(30.1622898302951,5.27181428188408,38.561591308997));
#351=CARTESIAN_POINT('Ctrl Pts',(30.5678971966299,5.34154067543259,38.3924974950859));
#352=CARTESIAN_POINT('Ctrl Pts',(30.7899408240621,5.36165903192128,38.35));
#353=CARTESIAN_POINT('Ctrl Pts',(31.,5.36165903192128,38.35));
#354=CARTESIAN_POINT('Origin',(36.,0.,80.));
#355=CARTESIAN_POINT('Origin',(31.,0.,40.));
#356=CARTESIAN_POINT('',(31.,0.,41.65));
#357=UNCERTAINTY_MEASURE_WITH_UNIT(LENGTH_MEASURE(0.01),#361,
'DISTANCE_ACCURACY_VALUE',
'Maximum model space distance between geometric entities at asserted c
onnectivities');
#358=UNCERTAINTY_MEASURE_WITH_UNIT(LENGTH_MEASURE(0.01),#361,
'DISTANCE_ACCURACY_VALUE',
'Maximum model space distance between geometric entities at asserted c
onnectivities');
#359=(
GEOMETRIC_REPRESENTATION_CONTEXT(3)
GLOBAL_UNCERTAINTY_ASSIGNED_CONTEXT((#357))
GLOBAL_UNIT_ASSIGNED_CONTEXT((#361,#364,#363))
REPRESENTATION_CONTEXT('','3D')
);
#360=(
GEOMETRIC_REPRESENTATION_CONTEXT(3)
GLOBAL_UNCERTAINTY_ASSIGNED_CONTEXT((#358))
GLOBAL_UNIT_ASSIGNED_CONTEXT((#361,#364,#363))
REPRESENTATION_CONTEXT('','3D')
);
#361=(
LENGTH_UNIT()
NAMED_UNIT(*)
SI_UNIT(.MILLI.,.METRE.)
);
#362=(
LENGTH_UNIT()
NAMED_UNIT(*)
SI_UNIT(.CENTI.,.METRE.)
);
#363=(
NAMED_UNIT(*)
SI_UNIT($,.STERADIAN.)
SOLID_ANGLE_UNIT()
);
#364=(
NAMED_UNIT(*)
PLANE_ANGLE_UNIT()
SI_UNIT($,.RADIAN.)
);
#365=SHAPE_DEFINITION_REPRESENTATION(#366,#367);
#366=PRODUCT_DEFINITION_SHAPE('',$,#369);
#367=SHAPE_REPRESENTATION('',(#185),#359);
#368=PRODUCT_DEFINITION_CONTEXT('part definition',#373,'design');
#369=PRODUCT_DEFINITION('Disk','Disk',#370,#368);
#370=PRODUCT_DEFINITION_FORMATION('',$,#375);
#371=PRODUCT_RELATED_PRODUCT_CATEGORY('Disk','Disk',(#375));
#372=APPLICATION_PROTOCOL_DEFINITION('international standard',
'automotive_design',2009,#373);
#373=APPLICATION_CONTEXT(
'Core Data for Automotive Mechanical Design Process');
#374=PRODUCT_CONTEXT('part definition',#373,'mechanical');
#375=PRODUCT('Disk','Disk',$,(#374));
#376=PRESENTATION_STYLE_ASSIGNMENT((#379));
#377=PRESENTATION_STYLE_ASSIGNMENT((#380));
#378=PRESENTATION_STYLE_ASSIGNMENT((#381));
#379=SURFACE_STYLE_USAGE(.BOTH.,#382);
#380=SURFACE_STYLE_USAGE(.BOTH.,#383);
#381=SURFACE_STYLE_USAGE(.BOTH.,#384);
#382=SURFACE_SIDE_STYLE('',(#385));
#383=SURFACE_SIDE_STYLE('',(#386));
#384=SURFACE_SIDE_STYLE('',(#387));
#385=SURFACE_STYLE_FILL_AREA(#388);
#386=SURFACE_STYLE_FILL_AREA(#389);
#387=SURFACE_STYLE_FILL_AREA(#390);
#388=FILL_AREA_STYLE('',(#391));
#389=FILL_AREA_STYLE('',(#392));
#390=FILL_AREA_STYLE('',(#393));
#391=FILL_AREA_STYLE_COLOUR('',#394);
#392=FILL_AREA_STYLE_COLOUR('',#395);
#393=FILL_AREA_STYLE_COLOUR('',#396);
#394=COLOUR_RGB('',0.749019607843137,0.749019607843137,0.749019607843137);
#395=COLOUR_RGB('',0.898039215686275,0.917647058823529,0.929411764705882);
#396=COLOUR_RGB('',0.866666666666667,0.909803921568627,1.);
ENDSEC;
END-ISO-10303-21;
