ISO-10303-21;
HEADER;
/* Generated by software containing ST-Developer
 * from STEP Tools, Inc. (www.steptools.com) 
 */

FILE_DESCRIPTION(
/* description */ (''),
/* implementation_level */ '2;1');

FILE_NAME(
/* name */ 
'C:\\Users\\kkruger\\OneDrive - Stellenbosch University\\Doseerwerk\\N
avorsing\\Studente\\Uitruilstudente\\Maier\\\\Gear Box_ipt_a0e87a2a.ST
EP',
/* time_stamp */ '2018-05-05T13:42:09+02:00',
/* author */ ('22480064'),
/* organization */ (''),
/* preprocessor_version */ 'ST-DEVELOPER v16.1',
/* originating_system */ 'Autodesk Inventor 2016',
/* authorisation */ '');

FILE_SCHEMA (('AUTOMOTIVE_DESIGN { 1 0 10303 214 3 1 1 }'));
ENDSEC;

DATA;
#10=MECHANICAL_DESIGN_GEOMETRIC_PRESENTATION_REPRESENTATION('',(#13),#447);
#11=SHAPE_REPRESENTATION_RELATIONSHIP('SRR','None',#456,#12);
#12=ADVANCED_BREP_SHAPE_REPRESENTATION('',(#14),#446);
#13=STYLED_ITEM('',(#465),#14);
#14=MANIFOLD_SOLID_BREP('Solid1',#250);
#15=LINE('',#419,#19);
#16=LINE('',#422,#20);
#17=LINE('',#424,#21);
#18=LINE('',#426,#22);
#19=VECTOR('',#342,15.);
#20=VECTOR('',#345,15.);
#21=VECTOR('',#348,4.2142615011411);
#22=VECTOR('',#351,4.2142615011411);
#23=CONICAL_SURFACE('',#272,4.49999999971747,21.9605639943706);
#24=CYLINDRICAL_SURFACE('',#265,15.9999999999999);
#25=CYLINDRICAL_SURFACE('',#268,8.50000000000001);
#26=CYLINDRICAL_SURFACE('',#269,5.4);
#27=CYLINDRICAL_SURFACE('',#270,4.5);
#28=CYLINDRICAL_SURFACE('',#274,4.);
#29=CYLINDRICAL_SURFACE('',#282,1.22950000000001);
#30=CYLINDRICAL_SURFACE('',#285,1.22950000000001);
#31=CYLINDRICAL_SURFACE('',#288,1.22950000000001);
#32=CYLINDRICAL_SURFACE('',#291,1.22950000000001);
#33=FACE_BOUND('',#72,.T.);
#34=FACE_BOUND('',#74,.T.);
#35=FACE_BOUND('',#76,.T.);
#36=FACE_BOUND('',#77,.T.);
#37=FACE_BOUND('',#78,.T.);
#38=FACE_BOUND('',#79,.T.);
#39=FACE_BOUND('',#80,.T.);
#40=FACE_BOUND('',#82,.T.);
#41=FACE_BOUND('',#85,.T.);
#42=FACE_BOUND('',#87,.T.);
#43=FACE_BOUND('',#89,.T.);
#44=FACE_BOUND('',#91,.T.);
#45=FACE_BOUND('',#93,.T.);
#46=FACE_BOUND('',#99,.T.);
#47=FACE_BOUND('',#102,.T.);
#48=FACE_BOUND('',#105,.T.);
#49=FACE_BOUND('',#108,.T.);
#50=FACE_OUTER_BOUND('',#71,.T.);
#51=FACE_OUTER_BOUND('',#73,.T.);
#52=FACE_OUTER_BOUND('',#75,.T.);
#53=FACE_OUTER_BOUND('',#81,.T.);
#54=FACE_OUTER_BOUND('',#83,.T.);
#55=FACE_OUTER_BOUND('',#84,.T.);
#56=FACE_OUTER_BOUND('',#86,.T.);
#57=FACE_OUTER_BOUND('',#88,.T.);
#58=FACE_OUTER_BOUND('',#90,.T.);
#59=FACE_OUTER_BOUND('',#92,.T.);
#60=FACE_OUTER_BOUND('',#94,.T.);
#61=FACE_OUTER_BOUND('',#95,.T.);
#62=FACE_OUTER_BOUND('',#96,.T.);
#63=FACE_OUTER_BOUND('',#97,.T.);
#64=FACE_OUTER_BOUND('',#98,.T.);
#65=FACE_OUTER_BOUND('',#100,.T.);
#66=FACE_OUTER_BOUND('',#101,.T.);
#67=FACE_OUTER_BOUND('',#103,.T.);
#68=FACE_OUTER_BOUND('',#104,.T.);
#69=FACE_OUTER_BOUND('',#106,.T.);
#70=FACE_OUTER_BOUND('',#107,.T.);
#71=EDGE_LOOP('',(#172));
#72=EDGE_LOOP('',(#173));
#73=EDGE_LOOP('',(#174));
#74=EDGE_LOOP('',(#175));
#75=EDGE_LOOP('',(#176));
#76=EDGE_LOOP('',(#177));
#77=EDGE_LOOP('',(#178));
#78=EDGE_LOOP('',(#179));
#79=EDGE_LOOP('',(#180));
#80=EDGE_LOOP('',(#181));
#81=EDGE_LOOP('',(#182));
#82=EDGE_LOOP('',(#183));
#83=EDGE_LOOP('',(#184));
#84=EDGE_LOOP('',(#185));
#85=EDGE_LOOP('',(#186));
#86=EDGE_LOOP('',(#187));
#87=EDGE_LOOP('',(#188));
#88=EDGE_LOOP('',(#189));
#89=EDGE_LOOP('',(#190));
#90=EDGE_LOOP('',(#191));
#91=EDGE_LOOP('',(#192));
#92=EDGE_LOOP('',(#193,#194,#195,#196));
#93=EDGE_LOOP('',(#197));
#94=EDGE_LOOP('',(#198,#199));
#95=EDGE_LOOP('',(#200,#201,#202,#203));
#96=EDGE_LOOP('',(#204,#205));
#97=EDGE_LOOP('',(#206));
#98=EDGE_LOOP('',(#207));
#99=EDGE_LOOP('',(#208));
#100=EDGE_LOOP('',(#209));
#101=EDGE_LOOP('',(#210));
#102=EDGE_LOOP('',(#211));
#103=EDGE_LOOP('',(#212));
#104=EDGE_LOOP('',(#213));
#105=EDGE_LOOP('',(#214));
#106=EDGE_LOOP('',(#215));
#107=EDGE_LOOP('',(#216));
#108=EDGE_LOOP('',(#217));
#109=CIRCLE('',#253,5.4);
#110=CIRCLE('',#254,4.5);
#111=CIRCLE('',#256,8.50000000000001);
#112=CIRCLE('',#257,5.4);
#113=CIRCLE('',#259,15.9999999999999);
#114=CIRCLE('',#260,8.50000000000001);
#115=CIRCLE('',#261,1.22950000000001);
#116=CIRCLE('',#262,1.22950000000001);
#117=CIRCLE('',#263,1.22950000000001);
#118=CIRCLE('',#264,1.22950000000001);
#119=CIRCLE('',#266,15.9999999999999);
#120=CIRCLE('',#271,4.5);
#121=CIRCLE('',#273,4.00000000032074);
#122=CIRCLE('',#275,4.);
#123=CIRCLE('',#276,4.);
#124=CIRCLE('',#281,1.22950000000001);
#125=CIRCLE('',#284,1.22950000000001);
#126=CIRCLE('',#287,1.22950000000001);
#127=CIRCLE('',#290,1.22950000000001);
#128=VERTEX_POINT('',#380);
#129=VERTEX_POINT('',#382);
#130=VERTEX_POINT('',#385);
#131=VERTEX_POINT('',#387);
#132=VERTEX_POINT('',#390);
#133=VERTEX_POINT('',#392);
#134=VERTEX_POINT('',#394);
#135=VERTEX_POINT('',#396);
#136=VERTEX_POINT('',#398);
#137=VERTEX_POINT('',#400);
#138=VERTEX_POINT('',#403);
#139=VERTEX_POINT('',#409);
#140=VERTEX_POINT('',#412);
#141=VERTEX_POINT('',#415);
#142=VERTEX_POINT('',#416);
#143=VERTEX_POINT('',#418);
#144=VERTEX_POINT('',#420);
#145=VERTEX_POINT('',#429);
#146=VERTEX_POINT('',#433);
#147=VERTEX_POINT('',#437);
#148=VERTEX_POINT('',#441);
#149=EDGE_CURVE('',#128,#128,#109,.T.);
#150=EDGE_CURVE('',#129,#129,#110,.T.);
#151=EDGE_CURVE('',#130,#130,#111,.T.);
#152=EDGE_CURVE('',#131,#131,#112,.T.);
#153=EDGE_CURVE('',#132,#132,#113,.T.);
#154=EDGE_CURVE('',#133,#133,#114,.T.);
#155=EDGE_CURVE('',#134,#134,#115,.T.);
#156=EDGE_CURVE('',#135,#135,#116,.T.);
#157=EDGE_CURVE('',#136,#136,#117,.T.);
#158=EDGE_CURVE('',#137,#137,#118,.T.);
#159=EDGE_CURVE('',#138,#138,#119,.T.);
#160=EDGE_CURVE('',#139,#139,#120,.T.);
#161=EDGE_CURVE('',#140,#140,#121,.T.);
#162=EDGE_CURVE('',#141,#142,#122,.T.);
#163=EDGE_CURVE('',#143,#141,#15,.T.);
#164=EDGE_CURVE('',#144,#143,#123,.T.);
#165=EDGE_CURVE('',#144,#142,#16,.T.);
#166=EDGE_CURVE('',#141,#142,#17,.T.);
#167=EDGE_CURVE('',#143,#144,#18,.T.);
#168=EDGE_CURVE('',#145,#145,#124,.T.);
#169=EDGE_CURVE('',#146,#146,#125,.T.);
#170=EDGE_CURVE('',#147,#147,#126,.T.);
#171=EDGE_CURVE('',#148,#148,#127,.T.);
#172=ORIENTED_EDGE('',*,*,#149,.T.);
#173=ORIENTED_EDGE('',*,*,#150,.F.);
#174=ORIENTED_EDGE('',*,*,#151,.T.);
#175=ORIENTED_EDGE('',*,*,#152,.F.);
#176=ORIENTED_EDGE('',*,*,#153,.F.);
#177=ORIENTED_EDGE('',*,*,#154,.F.);
#178=ORIENTED_EDGE('',*,*,#155,.F.);
#179=ORIENTED_EDGE('',*,*,#156,.F.);
#180=ORIENTED_EDGE('',*,*,#157,.F.);
#181=ORIENTED_EDGE('',*,*,#158,.F.);
#182=ORIENTED_EDGE('',*,*,#153,.T.);
#183=ORIENTED_EDGE('',*,*,#159,.F.);
#184=ORIENTED_EDGE('',*,*,#159,.T.);
#185=ORIENTED_EDGE('',*,*,#151,.F.);
#186=ORIENTED_EDGE('',*,*,#154,.T.);
#187=ORIENTED_EDGE('',*,*,#149,.F.);
#188=ORIENTED_EDGE('',*,*,#152,.T.);
#189=ORIENTED_EDGE('',*,*,#160,.F.);
#190=ORIENTED_EDGE('',*,*,#150,.T.);
#191=ORIENTED_EDGE('',*,*,#161,.F.);
#192=ORIENTED_EDGE('',*,*,#160,.T.);
#193=ORIENTED_EDGE('',*,*,#162,.F.);
#194=ORIENTED_EDGE('',*,*,#163,.F.);
#195=ORIENTED_EDGE('',*,*,#164,.F.);
#196=ORIENTED_EDGE('',*,*,#165,.T.);
#197=ORIENTED_EDGE('',*,*,#161,.T.);
#198=ORIENTED_EDGE('',*,*,#166,.F.);
#199=ORIENTED_EDGE('',*,*,#162,.T.);
#200=ORIENTED_EDGE('',*,*,#166,.T.);
#201=ORIENTED_EDGE('',*,*,#165,.F.);
#202=ORIENTED_EDGE('',*,*,#167,.F.);
#203=ORIENTED_EDGE('',*,*,#163,.T.);
#204=ORIENTED_EDGE('',*,*,#164,.T.);
#205=ORIENTED_EDGE('',*,*,#167,.T.);
#206=ORIENTED_EDGE('',*,*,#168,.T.);
#207=ORIENTED_EDGE('',*,*,#168,.F.);
#208=ORIENTED_EDGE('',*,*,#158,.T.);
#209=ORIENTED_EDGE('',*,*,#169,.T.);
#210=ORIENTED_EDGE('',*,*,#169,.F.);
#211=ORIENTED_EDGE('',*,*,#157,.T.);
#212=ORIENTED_EDGE('',*,*,#170,.T.);
#213=ORIENTED_EDGE('',*,*,#170,.F.);
#214=ORIENTED_EDGE('',*,*,#156,.T.);
#215=ORIENTED_EDGE('',*,*,#171,.T.);
#216=ORIENTED_EDGE('',*,*,#171,.F.);
#217=ORIENTED_EDGE('',*,*,#155,.T.);
#218=PLANE('',#252);
#219=PLANE('',#255);
#220=PLANE('',#258);
#221=PLANE('',#267);
#222=PLANE('',#277);
#223=PLANE('',#278);
#224=PLANE('',#279);
#225=PLANE('',#280);
#226=PLANE('',#283);
#227=PLANE('',#286);
#228=PLANE('',#289);
#229=ADVANCED_FACE('',(#50,#33),#218,.T.);
#230=ADVANCED_FACE('',(#51,#34),#219,.T.);
#231=ADVANCED_FACE('',(#52,#35,#36,#37,#38,#39),#220,.T.);
#232=ADVANCED_FACE('',(#53,#40),#24,.T.);
#233=ADVANCED_FACE('',(#54),#221,.T.);
#234=ADVANCED_FACE('',(#55,#41),#25,.T.);
#235=ADVANCED_FACE('',(#56,#42),#26,.T.);
#236=ADVANCED_FACE('',(#57,#43),#27,.T.);
#237=ADVANCED_FACE('',(#58,#44),#23,.T.);
#238=ADVANCED_FACE('',(#59,#45),#28,.T.);
#239=ADVANCED_FACE('',(#60),#222,.T.);
#240=ADVANCED_FACE('',(#61),#223,.F.);
#241=ADVANCED_FACE('',(#62),#224,.T.);
#242=ADVANCED_FACE('',(#63),#225,.F.);
#243=ADVANCED_FACE('',(#64,#46),#29,.F.);
#244=ADVANCED_FACE('',(#65),#226,.F.);
#245=ADVANCED_FACE('',(#66,#47),#30,.F.);
#246=ADVANCED_FACE('',(#67),#227,.F.);
#247=ADVANCED_FACE('',(#68,#48),#31,.F.);
#248=ADVANCED_FACE('',(#69),#228,.F.);
#249=ADVANCED_FACE('',(#70,#49),#32,.F.);
#250=CLOSED_SHELL('',(#229,#230,#231,#232,#233,#234,#235,#236,#237,#238,
#239,#240,#241,#242,#243,#244,#245,#246,#247,#248,#249));
#251=AXIS2_PLACEMENT_3D('placement',#378,#292,#293);
#252=AXIS2_PLACEMENT_3D('',#379,#294,#295);
#253=AXIS2_PLACEMENT_3D('',#381,#296,#297);
#254=AXIS2_PLACEMENT_3D('',#383,#298,#299);
#255=AXIS2_PLACEMENT_3D('',#384,#300,#301);
#256=AXIS2_PLACEMENT_3D('',#386,#302,#303);
#257=AXIS2_PLACEMENT_3D('',#388,#304,#305);
#258=AXIS2_PLACEMENT_3D('',#389,#306,#307);
#259=AXIS2_PLACEMENT_3D('',#391,#308,#309);
#260=AXIS2_PLACEMENT_3D('',#393,#310,#311);
#261=AXIS2_PLACEMENT_3D('',#395,#312,#313);
#262=AXIS2_PLACEMENT_3D('',#397,#314,#315);
#263=AXIS2_PLACEMENT_3D('',#399,#316,#317);
#264=AXIS2_PLACEMENT_3D('',#401,#318,#319);
#265=AXIS2_PLACEMENT_3D('',#402,#320,#321);
#266=AXIS2_PLACEMENT_3D('',#404,#322,#323);
#267=AXIS2_PLACEMENT_3D('',#405,#324,#325);
#268=AXIS2_PLACEMENT_3D('',#406,#326,#327);
#269=AXIS2_PLACEMENT_3D('',#407,#328,#329);
#270=AXIS2_PLACEMENT_3D('',#408,#330,#331);
#271=AXIS2_PLACEMENT_3D('',#410,#332,#333);
#272=AXIS2_PLACEMENT_3D('',#411,#334,#335);
#273=AXIS2_PLACEMENT_3D('',#413,#336,#337);
#274=AXIS2_PLACEMENT_3D('',#414,#338,#339);
#275=AXIS2_PLACEMENT_3D('',#417,#340,#341);
#276=AXIS2_PLACEMENT_3D('',#421,#343,#344);
#277=AXIS2_PLACEMENT_3D('',#423,#346,#347);
#278=AXIS2_PLACEMENT_3D('',#425,#349,#350);
#279=AXIS2_PLACEMENT_3D('',#427,#352,#353);
#280=AXIS2_PLACEMENT_3D('',#428,#354,#355);
#281=AXIS2_PLACEMENT_3D('',#430,#356,#357);
#282=AXIS2_PLACEMENT_3D('',#431,#358,#359);
#283=AXIS2_PLACEMENT_3D('',#432,#360,#361);
#284=AXIS2_PLACEMENT_3D('',#434,#362,#363);
#285=AXIS2_PLACEMENT_3D('',#435,#364,#365);
#286=AXIS2_PLACEMENT_3D('',#436,#366,#367);
#287=AXIS2_PLACEMENT_3D('',#438,#368,#369);
#288=AXIS2_PLACEMENT_3D('',#439,#370,#371);
#289=AXIS2_PLACEMENT_3D('',#440,#372,#373);
#290=AXIS2_PLACEMENT_3D('',#442,#374,#375);
#291=AXIS2_PLACEMENT_3D('',#443,#376,#377);
#292=DIRECTION('axis',(0.,0.,1.));
#293=DIRECTION('refdir',(1.,0.,0.));
#294=DIRECTION('center_axis',(0.,0.,1.));
#295=DIRECTION('ref_axis',(1.,0.,0.));
#296=DIRECTION('center_axis',(0.,0.,1.));
#297=DIRECTION('ref_axis',(1.,0.,0.));
#298=DIRECTION('center_axis',(0.,0.,1.));
#299=DIRECTION('ref_axis',(1.,0.,0.));
#300=DIRECTION('center_axis',(0.,0.,1.));
#301=DIRECTION('ref_axis',(1.,0.,0.));
#302=DIRECTION('center_axis',(0.,0.,1.));
#303=DIRECTION('ref_axis',(1.,0.,0.));
#304=DIRECTION('center_axis',(0.,0.,1.));
#305=DIRECTION('ref_axis',(1.,0.,0.));
#306=DIRECTION('center_axis',(0.,0.,1.));
#307=DIRECTION('ref_axis',(1.,0.,0.));
#308=DIRECTION('center_axis',(0.,0.,-1.));
#309=DIRECTION('ref_axis',(-1.,0.,0.));
#310=DIRECTION('center_axis',(0.,0.,1.));
#311=DIRECTION('ref_axis',(1.,0.,0.));
#312=DIRECTION('center_axis',(0.,0.,1.));
#313=DIRECTION('ref_axis',(1.,0.,0.));
#314=DIRECTION('center_axis',(0.,0.,1.));
#315=DIRECTION('ref_axis',(1.,0.,0.));
#316=DIRECTION('center_axis',(0.,0.,1.));
#317=DIRECTION('ref_axis',(1.,0.,0.));
#318=DIRECTION('center_axis',(0.,0.,1.));
#319=DIRECTION('ref_axis',(1.,0.,0.));
#320=DIRECTION('center_axis',(0.,0.,-1.));
#321=DIRECTION('ref_axis',(-1.,0.,0.));
#322=DIRECTION('center_axis',(0.,0.,-1.));
#323=DIRECTION('ref_axis',(-1.,0.,0.));
#324=DIRECTION('center_axis',(0.,0.,-1.));
#325=DIRECTION('ref_axis',(-1.,0.,0.));
#326=DIRECTION('center_axis',(0.,0.,-1.));
#327=DIRECTION('ref_axis',(-1.,0.,0.));
#328=DIRECTION('center_axis',(0.,0.,-1.));
#329=DIRECTION('ref_axis',(-1.,0.,0.));
#330=DIRECTION('center_axis',(0.,0.,-1.));
#331=DIRECTION('ref_axis',(-1.,0.,0.));
#332=DIRECTION('center_axis',(0.,0.,1.));
#333=DIRECTION('ref_axis',(1.,0.,0.));
#334=DIRECTION('center_axis',(0.,0.,-1.));
#335=DIRECTION('ref_axis',(1.,0.,0.));
#336=DIRECTION('center_axis',(0.,0.,1.));
#337=DIRECTION('ref_axis',(1.,0.,0.));
#338=DIRECTION('center_axis',(0.,0.,-1.));
#339=DIRECTION('ref_axis',(-1.,0.,0.));
#340=DIRECTION('center_axis',(0.,0.,1.));
#341=DIRECTION('ref_axis',(1.,0.,0.));
#342=DIRECTION('',(0.,0.,1.));
#343=DIRECTION('center_axis',(0.,0.,1.));
#344=DIRECTION('ref_axis',(1.,0.,0.));
#345=DIRECTION('',(0.,0.,1.));
#346=DIRECTION('center_axis',(0.,0.,1.));
#347=DIRECTION('ref_axis',(1.,0.,0.));
#348=DIRECTION('',(-1.,6.58610663057182E-16,0.));
#349=DIRECTION('center_axis',(6.17447496616108E-16,1.,0.));
#350=DIRECTION('ref_axis',(0.,0.,1.));
#351=DIRECTION('',(-1.,6.58610663057182E-16,0.));
#352=DIRECTION('center_axis',(0.,0.,1.));
#353=DIRECTION('ref_axis',(1.,0.,0.));
#354=DIRECTION('center_axis',(0.,0.,-1.));
#355=DIRECTION('ref_axis',(-1.,0.,0.));
#356=DIRECTION('center_axis',(0.,0.,1.));
#357=DIRECTION('ref_axis',(1.,0.,0.));
#358=DIRECTION('center_axis',(0.,0.,1.));
#359=DIRECTION('ref_axis',(1.,0.,0.));
#360=DIRECTION('center_axis',(0.,0.,-1.));
#361=DIRECTION('ref_axis',(-1.,0.,0.));
#362=DIRECTION('center_axis',(0.,0.,1.));
#363=DIRECTION('ref_axis',(1.,0.,0.));
#364=DIRECTION('center_axis',(0.,0.,1.));
#365=DIRECTION('ref_axis',(1.,0.,0.));
#366=DIRECTION('center_axis',(0.,0.,-1.));
#367=DIRECTION('ref_axis',(-1.,0.,0.));
#368=DIRECTION('center_axis',(0.,0.,1.));
#369=DIRECTION('ref_axis',(1.,0.,0.));
#370=DIRECTION('center_axis',(0.,0.,1.));
#371=DIRECTION('ref_axis',(1.,0.,0.));
#372=DIRECTION('center_axis',(0.,0.,-1.));
#373=DIRECTION('ref_axis',(-1.,0.,0.));
#374=DIRECTION('center_axis',(0.,0.,1.));
#375=DIRECTION('ref_axis',(1.,0.,0.));
#376=DIRECTION('center_axis',(0.,0.,1.));
#377=DIRECTION('ref_axis',(1.,0.,0.));
#378=CARTESIAN_POINT('',(0.,0.,0.));
#379=CARTESIAN_POINT('Origin',(0.,0.,3.));
#380=CARTESIAN_POINT('',(5.4,0.,3.));
#381=CARTESIAN_POINT('Origin',(0.,0.,3.));
#382=CARTESIAN_POINT('',(4.5,0.,3.));
#383=CARTESIAN_POINT('Origin',(0.,0.,3.));
#384=CARTESIAN_POINT('Origin',(0.,0.,2.));
#385=CARTESIAN_POINT('',(8.50000000000001,0.,2.));
#386=CARTESIAN_POINT('Origin',(0.,0.,2.));
#387=CARTESIAN_POINT('',(5.4,0.,2.));
#388=CARTESIAN_POINT('Origin',(0.,0.,2.));
#389=CARTESIAN_POINT('Origin',(15.9999999999999,0.,-7.89827121323603E-15));
#390=CARTESIAN_POINT('',(-15.9999999999999,0.,-1.04083408558608E-14));
#391=CARTESIAN_POINT('Origin',(0.,0.,-1.04083408558608E-14));
#392=CARTESIAN_POINT('',(8.50000000000001,0.,0.));
#393=CARTESIAN_POINT('Origin',(0.,0.,0.));
#394=CARTESIAN_POINT('',(1.22950000000002,13.,1.07407647519219E-15));
#395=CARTESIAN_POINT('Origin',(2.388061E-15,13.,1.07407647519219E-15));
#396=CARTESIAN_POINT('',(14.2295,-1.592041E-15,1.07407647519219E-15));
#397=CARTESIAN_POINT('Origin',(13.,-1.592041E-15,1.07407647519219E-15));
#398=CARTESIAN_POINT('',(1.22950000000001,-13.,1.07407647519219E-15));
#399=CARTESIAN_POINT('Origin',(-7.960204E-16,-13.,1.07407647519219E-15));
#400=CARTESIAN_POINT('',(-11.7705,0.,1.07407647519219E-15));
#401=CARTESIAN_POINT('Origin',(-13.,0.,1.07407647519219E-15));
#402=CARTESIAN_POINT('Origin',(0.,0.,-5.38820157061122E-15));
#403=CARTESIAN_POINT('',(-15.9999999999999,0.,-41.6));
#404=CARTESIAN_POINT('Origin',(0.,0.,-41.6));
#405=CARTESIAN_POINT('Origin',(0.,0.,-41.6));
#406=CARTESIAN_POINT('Origin',(0.,0.,2.));
#407=CARTESIAN_POINT('Origin',(0.,0.,3.));
#408=CARTESIAN_POINT('Origin',(0.,0.,3.76));
#409=CARTESIAN_POINT('',(4.5,0.,3.76));
#410=CARTESIAN_POINT('Origin',(0.,0.,3.76));
#411=CARTESIAN_POINT('Origin',(0.,0.,3.76));
#412=CARTESIAN_POINT('',(4.00000000032074,0.,5.00000000010914));
#413=CARTESIAN_POINT('Origin',(0.,0.,5.00000000010914));
#414=CARTESIAN_POINT('Origin',(0.,0.,20.5));
#415=CARTESIAN_POINT('',(2.10713075057055,-3.4,20.5));
#416=CARTESIAN_POINT('',(-2.10713075057055,-3.4,20.5));
#417=CARTESIAN_POINT('Origin',(0.,0.,20.5));
#418=CARTESIAN_POINT('',(2.10713075057055,-3.4,5.5));
#419=CARTESIAN_POINT('',(2.10713075057055,-3.4,5.5));
#420=CARTESIAN_POINT('',(-2.10713075057055,-3.4,5.5));
#421=CARTESIAN_POINT('Origin',(0.,0.,5.5));
#422=CARTESIAN_POINT('',(-2.10713075057055,-3.4,5.5));
#423=CARTESIAN_POINT('Origin',(0.,0.,20.5));
#424=CARTESIAN_POINT('',(2.10713075057055,-3.4,20.5));
#425=CARTESIAN_POINT('Origin',(2.10713075057055,-3.4,5.5));
#426=CARTESIAN_POINT('',(2.10713075057055,-3.4,5.5));
#427=CARTESIAN_POINT('Origin',(0.,0.,5.5));
#428=CARTESIAN_POINT('Origin',(-13.,0.,-4.));
#429=CARTESIAN_POINT('',(-11.7705,0.,-4.));
#430=CARTESIAN_POINT('Origin',(-13.,0.,-4.));
#431=CARTESIAN_POINT('Origin',(-13.,0.,0.));
#432=CARTESIAN_POINT('Origin',(-7.960204E-16,-13.,-4.));
#433=CARTESIAN_POINT('',(1.22950000000001,-13.,-4.));
#434=CARTESIAN_POINT('Origin',(-7.960204E-16,-13.,-4.));
#435=CARTESIAN_POINT('Origin',(-7.960204E-16,-13.,0.));
#436=CARTESIAN_POINT('Origin',(13.,-1.592041E-15,-4.));
#437=CARTESIAN_POINT('',(14.2295,-1.592041E-15,-4.));
#438=CARTESIAN_POINT('Origin',(13.,-1.592041E-15,-4.));
#439=CARTESIAN_POINT('Origin',(13.,-1.592041E-15,0.));
#440=CARTESIAN_POINT('Origin',(2.388061E-15,13.,-4.));
#441=CARTESIAN_POINT('',(1.22950000000002,13.,-4.));
#442=CARTESIAN_POINT('Origin',(2.388061E-15,13.,-4.));
#443=CARTESIAN_POINT('Origin',(2.388061E-15,13.,0.));
#444=UNCERTAINTY_MEASURE_WITH_UNIT(LENGTH_MEASURE(0.01),#448,
'DISTANCE_ACCURACY_VALUE',
'Maximum model space distance between geometric entities at asserted c
onnectivities');
#445=UNCERTAINTY_MEASURE_WITH_UNIT(LENGTH_MEASURE(1.E-6),#448,
'DISTANCE_ACCURACY_VALUE',
'Maximum model space distance between geometric entities at asserted c
onnectivities');
#446=(
GEOMETRIC_REPRESENTATION_CONTEXT(3)
GLOBAL_UNCERTAINTY_ASSIGNED_CONTEXT((#444))
GLOBAL_UNIT_ASSIGNED_CONTEXT((#448,#451,#449))
REPRESENTATION_CONTEXT('','3D')
);
#447=(
GEOMETRIC_REPRESENTATION_CONTEXT(3)
GLOBAL_UNCERTAINTY_ASSIGNED_CONTEXT((#445))
GLOBAL_UNIT_ASSIGNED_CONTEXT((#448,#451,#449))
REPRESENTATION_CONTEXT('','3D')
);
#448=(
LENGTH_UNIT()
NAMED_UNIT(*)
SI_UNIT(.MILLI.,.METRE.)
);
#449=(
NAMED_UNIT(*)
SI_UNIT($,.STERADIAN.)
SOLID_ANGLE_UNIT()
);
#450=DIMENSIONAL_EXPONENTS(0.,0.,0.,0.,0.,0.,0.);
#451=(
CONVERSION_BASED_UNIT('degree',#453)
NAMED_UNIT(#450)
PLANE_ANGLE_UNIT()
);
#452=(
NAMED_UNIT(*)
PLANE_ANGLE_UNIT()
SI_UNIT($,.RADIAN.)
);
#453=PLANE_ANGLE_MEASURE_WITH_UNIT(PLANE_ANGLE_MEASURE(0.01745329252),#452);
#454=SHAPE_DEFINITION_REPRESENTATION(#455,#456);
#455=PRODUCT_DEFINITION_SHAPE('',$,#458);
#456=SHAPE_REPRESENTATION('',(#251),#446);
#457=PRODUCT_DEFINITION_CONTEXT('part definition',#462,'design');
#458=PRODUCT_DEFINITION('Gear Box','Gear Box',#459,#457);
#459=PRODUCT_DEFINITION_FORMATION('',$,#464);
#460=PRODUCT_RELATED_PRODUCT_CATEGORY('Gear Box','Gear Box',(#464));
#461=APPLICATION_PROTOCOL_DEFINITION('international standard',
'automotive_design',2009,#462);
#462=APPLICATION_CONTEXT(
'Core Data for Automotive Mechanical Design Process');
#463=PRODUCT_CONTEXT('part definition',#462,'mechanical');
#464=PRODUCT('Gear Box','Gear Box',$,(#463));
#465=PRESENTATION_STYLE_ASSIGNMENT((#466));
#466=SURFACE_STYLE_USAGE(.BOTH.,#467);
#467=SURFACE_SIDE_STYLE('',(#468));
#468=SURFACE_STYLE_FILL_AREA(#469);
#469=FILL_AREA_STYLE('',(#470));
#470=FILL_AREA_STYLE_COLOUR('',#471);
#471=COLOUR_RGB('',0.792156862745098,0.819607843137255,0.933333333333333);
ENDSEC;
END-ISO-10303-21;
