ISO-10303-21;
HEADER;
/* Generated by software containing ST-Developer
 * from STEP Tools, Inc. (www.steptools.com) 
 */

FILE_DESCRIPTION(
/* description */ (''),
/* implementation_level */ '2;1');

FILE_NAME(
/* name */ 
'C:\\Users\\kkruger\\OneDrive - Stellenbosch University\\Doseerwerk\\N
avorsing\\Studente\\Uitruilstudente\\Maier\\\\Pot Support_ipt_f4f9dd70.
STEP',
/* time_stamp */ '2018-05-05T13:42:09+02:00',
/* author */ ('22480064'),
/* organization */ (''),
/* preprocessor_version */ 'ST-DEVELOPER v16.1',
/* originating_system */ 'Autodesk Inventor 2016',
/* authorisation */ '');

FILE_SCHEMA (('AUTOMOTIVE_DESIGN { 1 0 10303 214 3 1 1 }'));
ENDSEC;

DATA;
#10=MECHANICAL_DESIGN_GEOMETRIC_PRESENTATION_REPRESENTATION('',(#13),#1123);
#11=SHAPE_REPRESENTATION_RELATIONSHIP('SRR','None',#1132,#12);
#12=ADVANCED_BREP_SHAPE_REPRESENTATION('',(#14),#1122);
#13=STYLED_ITEM('',(#1141),#14);
#14=MANIFOLD_SOLID_BREP('Solid1',#667);
#15=CYLINDRICAL_SURFACE('',#679,2.5);
#16=CYLINDRICAL_SURFACE('',#683,2.5);
#17=CYLINDRICAL_SURFACE('',#691,2.2);
#18=CYLINDRICAL_SURFACE('',#693,2.2);
#19=CYLINDRICAL_SURFACE('',#695,2.2);
#20=CYLINDRICAL_SURFACE('',#697,2.2);
#21=CYLINDRICAL_SURFACE('',#706,2.7366);
#22=CYLINDRICAL_SURFACE('',#707,0.7366);
#23=CYLINDRICAL_SURFACE('',#714,0.7366);
#24=CYLINDRICAL_SURFACE('',#715,2.7366);
#25=CYLINDRICAL_SURFACE('',#716,2.5);
#26=CYLINDRICAL_SURFACE('',#720,2.5);
#27=CYLINDRICAL_SURFACE('',#731,4.7625);
#28=CYLINDRICAL_SURFACE('',#733,4.7625);
#29=FACE_BOUND('',#105,.T.);
#30=FACE_BOUND('',#106,.T.);
#31=FACE_BOUND('',#113,.T.);
#32=FACE_BOUND('',#114,.T.);
#33=FACE_BOUND('',#136,.T.);
#34=FACE_BOUND('',#139,.T.);
#35=CIRCLE('',#673,2.5);
#36=CIRCLE('',#674,2.5);
#37=CIRCLE('',#675,2.2);
#38=CIRCLE('',#676,2.2);
#39=CIRCLE('',#677,2.2);
#40=CIRCLE('',#678,2.2);
#41=CIRCLE('',#680,2.5);
#42=CIRCLE('',#684,2.5);
#43=CIRCLE('',#687,2.2);
#44=CIRCLE('',#688,2.2);
#45=CIRCLE('',#689,2.2);
#46=CIRCLE('',#690,2.2);
#47=CIRCLE('',#701,0.7366);
#48=CIRCLE('',#702,2.7366);
#49=CIRCLE('',#704,0.7366);
#50=CIRCLE('',#705,2.7366);
#51=CIRCLE('',#709,2.7366);
#52=CIRCLE('',#710,0.7366);
#53=CIRCLE('',#712,2.7366);
#54=CIRCLE('',#713,0.7366);
#55=CIRCLE('',#717,2.5);
#56=CIRCLE('',#718,2.5);
#57=CIRCLE('',#721,2.5);
#58=CIRCLE('',#722,2.5);
#59=CIRCLE('',#724,4.7625);
#60=CIRCLE('',#725,4.7625);
#61=CIRCLE('',#728,4.7625);
#62=CIRCLE('',#729,4.7625);
#63=FACE_OUTER_BOUND('',#101,.T.);
#64=FACE_OUTER_BOUND('',#102,.T.);
#65=FACE_OUTER_BOUND('',#103,.T.);
#66=FACE_OUTER_BOUND('',#104,.T.);
#67=FACE_OUTER_BOUND('',#107,.T.);
#68=FACE_OUTER_BOUND('',#108,.T.);
#69=FACE_OUTER_BOUND('',#109,.T.);
#70=FACE_OUTER_BOUND('',#110,.T.);
#71=FACE_OUTER_BOUND('',#111,.T.);
#72=FACE_OUTER_BOUND('',#112,.T.);
#73=FACE_OUTER_BOUND('',#115,.T.);
#74=FACE_OUTER_BOUND('',#116,.T.);
#75=FACE_OUTER_BOUND('',#117,.T.);
#76=FACE_OUTER_BOUND('',#118,.T.);
#77=FACE_OUTER_BOUND('',#119,.T.);
#78=FACE_OUTER_BOUND('',#120,.T.);
#79=FACE_OUTER_BOUND('',#121,.T.);
#80=FACE_OUTER_BOUND('',#122,.T.);
#81=FACE_OUTER_BOUND('',#123,.T.);
#82=FACE_OUTER_BOUND('',#124,.T.);
#83=FACE_OUTER_BOUND('',#125,.T.);
#84=FACE_OUTER_BOUND('',#126,.T.);
#85=FACE_OUTER_BOUND('',#127,.T.);
#86=FACE_OUTER_BOUND('',#128,.T.);
#87=FACE_OUTER_BOUND('',#129,.T.);
#88=FACE_OUTER_BOUND('',#130,.T.);
#89=FACE_OUTER_BOUND('',#131,.T.);
#90=FACE_OUTER_BOUND('',#132,.T.);
#91=FACE_OUTER_BOUND('',#133,.T.);
#92=FACE_OUTER_BOUND('',#134,.T.);
#93=FACE_OUTER_BOUND('',#135,.T.);
#94=FACE_OUTER_BOUND('',#137,.T.);
#95=FACE_OUTER_BOUND('',#138,.T.);
#96=FACE_OUTER_BOUND('',#140,.T.);
#97=FACE_OUTER_BOUND('',#141,.T.);
#98=FACE_OUTER_BOUND('',#142,.T.);
#99=FACE_OUTER_BOUND('',#143,.T.);
#100=FACE_OUTER_BOUND('',#144,.T.);
#101=EDGE_LOOP('',(#421,#422,#423,#424));
#102=EDGE_LOOP('',(#425,#426,#427,#428));
#103=EDGE_LOOP('',(#429,#430,#431,#432));
#104=EDGE_LOOP('',(#433,#434,#435,#436,#437,#438));
#105=EDGE_LOOP('',(#439,#440,#441,#442));
#106=EDGE_LOOP('',(#443,#444,#445,#446));
#107=EDGE_LOOP('',(#447,#448,#449,#450));
#108=EDGE_LOOP('',(#451,#452,#453,#454));
#109=EDGE_LOOP('',(#455,#456,#457,#458));
#110=EDGE_LOOP('',(#459,#460,#461,#462));
#111=EDGE_LOOP('',(#463,#464,#465,#466));
#112=EDGE_LOOP('',(#467,#468,#469,#470,#471,#472));
#113=EDGE_LOOP('',(#473,#474,#475,#476));
#114=EDGE_LOOP('',(#477,#478,#479,#480));
#115=EDGE_LOOP('',(#481,#482,#483,#484));
#116=EDGE_LOOP('',(#485,#486,#487,#488));
#117=EDGE_LOOP('',(#489,#490,#491,#492));
#118=EDGE_LOOP('',(#493,#494,#495,#496));
#119=EDGE_LOOP('',(#497,#498,#499,#500));
#120=EDGE_LOOP('',(#501,#502,#503,#504));
#121=EDGE_LOOP('',(#505,#506,#507,#508));
#122=EDGE_LOOP('',(#509,#510,#511,#512));
#123=EDGE_LOOP('',(#513,#514,#515,#516));
#124=EDGE_LOOP('',(#517,#518,#519,#520));
#125=EDGE_LOOP('',(#521,#522,#523,#524));
#126=EDGE_LOOP('',(#525,#526,#527,#528));
#127=EDGE_LOOP('',(#529,#530,#531,#532));
#128=EDGE_LOOP('',(#533,#534,#535,#536));
#129=EDGE_LOOP('',(#537,#538,#539,#540));
#130=EDGE_LOOP('',(#541,#542,#543,#544));
#131=EDGE_LOOP('',(#545,#546,#547,#548));
#132=EDGE_LOOP('',(#549,#550,#551,#552));
#133=EDGE_LOOP('',(#553,#554,#555,#556));
#134=EDGE_LOOP('',(#557,#558,#559,#560));
#135=EDGE_LOOP('',(#561,#562,#563,#564,#565,#566));
#136=EDGE_LOOP('',(#567,#568,#569,#570));
#137=EDGE_LOOP('',(#571,#572,#573,#574));
#138=EDGE_LOOP('',(#575,#576,#577,#578,#579,#580));
#139=EDGE_LOOP('',(#581,#582,#583,#584));
#140=EDGE_LOOP('',(#585,#586,#587,#588));
#141=EDGE_LOOP('',(#589,#590,#591,#592));
#142=EDGE_LOOP('',(#593,#594,#595,#596));
#143=EDGE_LOOP('',(#597,#598,#599,#600));
#144=EDGE_LOOP('',(#601,#602,#603,#604));
#145=LINE('',#937,#209);
#146=LINE('',#939,#210);
#147=LINE('',#941,#211);
#148=LINE('',#942,#212);
#149=LINE('',#945,#213);
#150=LINE('',#947,#214);
#151=LINE('',#948,#215);
#152=LINE('',#951,#216);
#153=LINE('',#953,#217);
#154=LINE('',#954,#218);
#155=LINE('',#958,#219);
#156=LINE('',#960,#220);
#157=LINE('',#962,#221);
#158=LINE('',#966,#222);
#159=LINE('',#970,#223);
#160=LINE('',#974,#224);
#161=LINE('',#978,#225);
#162=LINE('',#982,#226);
#163=LINE('',#988,#227);
#164=LINE('',#989,#228);
#165=LINE('',#992,#229);
#166=LINE('',#993,#230);
#167=LINE('',#996,#231);
#168=LINE('',#998,#232);
#169=LINE('',#999,#233);
#170=LINE('',#1003,#234);
#171=LINE('',#1005,#235);
#172=LINE('',#1007,#236);
#173=LINE('',#1012,#237);
#174=LINE('',#1015,#238);
#175=LINE('',#1020,#239);
#176=LINE('',#1023,#240);
#177=LINE('',#1025,#241);
#178=LINE('',#1026,#242);
#179=LINE('',#1028,#243);
#180=LINE('',#1030,#244);
#181=LINE('',#1033,#245);
#182=LINE('',#1034,#246);
#183=LINE('',#1036,#247);
#184=LINE('',#1038,#248);
#185=LINE('',#1041,#249);
#186=LINE('',#1042,#250);
#187=LINE('',#1054,#251);
#188=LINE('',#1061,#252);
#189=LINE('',#1064,#253);
#190=LINE('',#1066,#254);
#191=LINE('',#1072,#255);
#192=LINE('',#1075,#256);
#193=LINE('',#1078,#257);
#194=LINE('',#1080,#258);
#195=LINE('',#1081,#259);
#196=LINE('',#1087,#260);
#197=LINE('',#1089,#261);
#198=LINE('',#1090,#262);
#199=LINE('',#1093,#263);
#200=LINE('',#1097,#264);
#201=LINE('',#1100,#265);
#202=LINE('',#1102,#266);
#203=LINE('',#1107,#267);
#204=LINE('',#1110,#268);
#205=LINE('',#1113,#269);
#206=LINE('',#1114,#270);
#207=LINE('',#1116,#271);
#208=LINE('',#1118,#272);
#209=VECTOR('',#739,43.5268);
#210=VECTOR('',#740,2.);
#211=VECTOR('',#741,43.5268);
#212=VECTOR('',#742,2.);
#213=VECTOR('',#745,20.);
#214=VECTOR('',#746,43.5268);
#215=VECTOR('',#747,20.);
#216=VECTOR('',#750,2.);
#217=VECTOR('',#751,43.5268);
#218=VECTOR('',#752,2.);
#219=VECTOR('',#755,8.50875509888796);
#220=VECTOR('',#756,20.);
#221=VECTOR('',#757,8.50875509888797);
#222=VECTOR('',#760,15.);
#223=VECTOR('',#763,3.5);
#224=VECTOR('',#766,3.5);
#225=VECTOR('',#769,3.5);
#226=VECTOR('',#772,3.5);
#227=VECTOR('',#779,2.);
#228=VECTOR('',#780,2.);
#229=VECTOR('',#783,2.);
#230=VECTOR('',#784,8.50875509888796);
#231=VECTOR('',#787,2.);
#232=VECTOR('',#788,8.50875509888796);
#233=VECTOR('',#789,2.);
#234=VECTOR('',#794,2.);
#235=VECTOR('',#797,15.);
#236=VECTOR('',#800,20.);
#237=VECTOR('',#803,3.5);
#238=VECTOR('',#806,3.5);
#239=VECTOR('',#809,3.5);
#240=VECTOR('',#812,3.5);
#241=VECTOR('',#815,1.99999999999999);
#242=VECTOR('',#816,1.99999999999999);
#243=VECTOR('',#819,2.);
#244=VECTOR('',#822,2.);
#245=VECTOR('',#827,1.99999999999999);
#246=VECTOR('',#828,1.99999999999999);
#247=VECTOR('',#831,2.);
#248=VECTOR('',#834,2.);
#249=VECTOR('',#839,20.);
#250=VECTOR('',#840,20.);
#251=VECTOR('',#859,2.);
#252=VECTOR('',#868,2.);
#253=VECTOR('',#873,20.);
#254=VECTOR('',#876,20.);
#255=VECTOR('',#881,2.);
#256=VECTOR('',#884,2.);
#257=VECTOR('',#887,15.);
#258=VECTOR('',#888,15.);
#259=VECTOR('',#889,2.);
#260=VECTOR('',#896,2.);
#261=VECTOR('',#899,22.5087550988879);
#262=VECTOR('',#900,22.5087550988879);
#263=VECTOR('',#901,3.5);
#264=VECTOR('',#904,3.5);
#265=VECTOR('',#909,22.5087550988879);
#266=VECTOR('',#912,22.5087550988879);
#267=VECTOR('',#915,3.5);
#268=VECTOR('',#918,3.5);
#269=VECTOR('',#923,2.);
#270=VECTOR('',#924,2.);
#271=VECTOR('',#927,2.00000000000004);
#272=VECTOR('',#930,2.);
#273=VERTEX_POINT('',#935);
#274=VERTEX_POINT('',#936);
#275=VERTEX_POINT('',#938);
#276=VERTEX_POINT('',#940);
#277=VERTEX_POINT('',#944);
#278=VERTEX_POINT('',#946);
#279=VERTEX_POINT('',#950);
#280=VERTEX_POINT('',#952);
#281=VERTEX_POINT('',#956);
#282=VERTEX_POINT('',#957);
#283=VERTEX_POINT('',#959);
#284=VERTEX_POINT('',#961);
#285=VERTEX_POINT('',#963);
#286=VERTEX_POINT('',#965);
#287=VERTEX_POINT('',#968);
#288=VERTEX_POINT('',#969);
#289=VERTEX_POINT('',#971);
#290=VERTEX_POINT('',#973);
#291=VERTEX_POINT('',#976);
#292=VERTEX_POINT('',#977);
#293=VERTEX_POINT('',#979);
#294=VERTEX_POINT('',#981);
#295=VERTEX_POINT('',#985);
#296=VERTEX_POINT('',#986);
#297=VERTEX_POINT('',#991);
#298=VERTEX_POINT('',#995);
#299=VERTEX_POINT('',#997);
#300=VERTEX_POINT('',#1001);
#301=VERTEX_POINT('',#1008);
#302=VERTEX_POINT('',#1009);
#303=VERTEX_POINT('',#1011);
#304=VERTEX_POINT('',#1013);
#305=VERTEX_POINT('',#1016);
#306=VERTEX_POINT('',#1017);
#307=VERTEX_POINT('',#1019);
#308=VERTEX_POINT('',#1021);
#309=VERTEX_POINT('',#1052);
#310=VERTEX_POINT('',#1053);
#311=VERTEX_POINT('',#1058);
#312=VERTEX_POINT('',#1060);
#313=VERTEX_POINT('',#1068);
#314=VERTEX_POINT('',#1069);
#315=VERTEX_POINT('',#1071);
#316=VERTEX_POINT('',#1073);
#317=VERTEX_POINT('',#1077);
#318=VERTEX_POINT('',#1079);
#319=VERTEX_POINT('',#1083);
#320=VERTEX_POINT('',#1085);
#321=VERTEX_POINT('',#1091);
#322=VERTEX_POINT('',#1092);
#323=VERTEX_POINT('',#1094);
#324=VERTEX_POINT('',#1096);
#325=VERTEX_POINT('',#1103);
#326=VERTEX_POINT('',#1104);
#327=VERTEX_POINT('',#1106);
#328=VERTEX_POINT('',#1108);
#329=EDGE_CURVE('',#273,#274,#145,.T.);
#330=EDGE_CURVE('',#274,#275,#146,.T.);
#331=EDGE_CURVE('',#276,#275,#147,.T.);
#332=EDGE_CURVE('',#276,#273,#148,.T.);
#333=EDGE_CURVE('',#275,#277,#149,.T.);
#334=EDGE_CURVE('',#277,#278,#150,.T.);
#335=EDGE_CURVE('',#278,#276,#151,.T.);
#336=EDGE_CURVE('',#277,#279,#152,.T.);
#337=EDGE_CURVE('',#279,#280,#153,.T.);
#338=EDGE_CURVE('',#280,#278,#154,.T.);
#339=EDGE_CURVE('',#281,#282,#155,.T.);
#340=EDGE_CURVE('',#281,#283,#156,.T.);
#341=EDGE_CURVE('',#284,#283,#157,.T.);
#342=EDGE_CURVE('',#285,#284,#35,.T.);
#343=EDGE_CURVE('',#286,#285,#158,.T.);
#344=EDGE_CURVE('',#282,#286,#36,.T.);
#345=EDGE_CURVE('',#287,#288,#159,.T.);
#346=EDGE_CURVE('',#288,#289,#37,.T.);
#347=EDGE_CURVE('',#289,#290,#160,.T.);
#348=EDGE_CURVE('',#290,#287,#38,.T.);
#349=EDGE_CURVE('',#291,#292,#161,.T.);
#350=EDGE_CURVE('',#292,#293,#39,.T.);
#351=EDGE_CURVE('',#293,#294,#162,.T.);
#352=EDGE_CURVE('',#294,#291,#40,.T.);
#353=EDGE_CURVE('',#295,#296,#41,.T.);
#354=EDGE_CURVE('',#282,#295,#163,.T.);
#355=EDGE_CURVE('',#286,#296,#164,.T.);
#356=EDGE_CURVE('',#281,#297,#165,.T.);
#357=EDGE_CURVE('',#297,#295,#166,.T.);
#358=EDGE_CURVE('',#298,#283,#167,.T.);
#359=EDGE_CURVE('',#299,#298,#168,.T.);
#360=EDGE_CURVE('',#284,#299,#169,.T.);
#361=EDGE_CURVE('',#300,#299,#42,.T.);
#362=EDGE_CURVE('',#285,#300,#170,.T.);
#363=EDGE_CURVE('',#296,#300,#171,.T.);
#364=EDGE_CURVE('',#297,#298,#172,.T.);
#365=EDGE_CURVE('',#301,#302,#43,.T.);
#366=EDGE_CURVE('',#303,#301,#173,.T.);
#367=EDGE_CURVE('',#304,#303,#44,.T.);
#368=EDGE_CURVE('',#302,#304,#174,.T.);
#369=EDGE_CURVE('',#305,#306,#45,.T.);
#370=EDGE_CURVE('',#307,#305,#175,.T.);
#371=EDGE_CURVE('',#308,#307,#46,.T.);
#372=EDGE_CURVE('',#306,#308,#176,.T.);
#373=EDGE_CURVE('',#292,#305,#177,.T.);
#374=EDGE_CURVE('',#293,#306,#178,.T.);
#375=EDGE_CURVE('',#291,#307,#179,.T.);
#376=EDGE_CURVE('',#294,#308,#180,.T.);
#377=EDGE_CURVE('',#288,#301,#181,.T.);
#378=EDGE_CURVE('',#289,#302,#182,.T.);
#379=EDGE_CURVE('',#287,#303,#183,.T.);
#380=EDGE_CURVE('',#290,#304,#184,.T.);
#381=EDGE_CURVE('',#274,#279,#185,.T.);
#382=EDGE_CURVE('',#280,#273,#186,.T.);
#383=EDGE_CURVE('',#297,#278,#47,.F.);
#384=EDGE_CURVE('',#281,#280,#48,.T.);
#385=EDGE_CURVE('',#276,#298,#49,.T.);
#386=EDGE_CURVE('',#273,#283,#50,.T.);
#387=EDGE_CURVE('',#309,#310,#187,.T.);
#388=EDGE_CURVE('',#310,#275,#51,.T.);
#389=EDGE_CURVE('',#309,#274,#52,.T.);
#390=EDGE_CURVE('',#277,#311,#53,.F.);
#391=EDGE_CURVE('',#311,#312,#188,.T.);
#392=EDGE_CURVE('',#279,#312,#54,.T.);
#393=EDGE_CURVE('',#309,#312,#189,.T.);
#394=EDGE_CURVE('',#310,#311,#190,.T.);
#395=EDGE_CURVE('',#313,#314,#55,.T.);
#396=EDGE_CURVE('',#315,#313,#191,.T.);
#397=EDGE_CURVE('',#315,#316,#56,.T.);
#398=EDGE_CURVE('',#316,#314,#192,.T.);
#399=EDGE_CURVE('',#314,#317,#193,.T.);
#400=EDGE_CURVE('',#316,#318,#194,.T.);
#401=EDGE_CURVE('',#318,#317,#195,.T.);
#402=EDGE_CURVE('',#317,#319,#57,.T.);
#403=EDGE_CURVE('',#318,#320,#58,.T.);
#404=EDGE_CURVE('',#320,#319,#196,.T.);
#405=EDGE_CURVE('',#309,#315,#197,.T.);
#406=EDGE_CURVE('',#320,#312,#198,.T.);
#407=EDGE_CURVE('',#321,#322,#199,.T.);
#408=EDGE_CURVE('',#322,#323,#59,.T.);
#409=EDGE_CURVE('',#323,#324,#200,.T.);
#410=EDGE_CURVE('',#324,#321,#60,.T.);
#411=EDGE_CURVE('',#319,#311,#201,.T.);
#412=EDGE_CURVE('',#310,#313,#202,.T.);
#413=EDGE_CURVE('',#325,#326,#61,.T.);
#414=EDGE_CURVE('',#327,#325,#203,.T.);
#415=EDGE_CURVE('',#328,#327,#62,.T.);
#416=EDGE_CURVE('',#326,#328,#204,.T.);
#417=EDGE_CURVE('',#322,#325,#205,.T.);
#418=EDGE_CURVE('',#323,#326,#206,.T.);
#419=EDGE_CURVE('',#321,#327,#207,.T.);
#420=EDGE_CURVE('',#324,#328,#208,.T.);
#421=ORIENTED_EDGE('',*,*,#329,.T.);
#422=ORIENTED_EDGE('',*,*,#330,.T.);
#423=ORIENTED_EDGE('',*,*,#331,.F.);
#424=ORIENTED_EDGE('',*,*,#332,.T.);
#425=ORIENTED_EDGE('',*,*,#331,.T.);
#426=ORIENTED_EDGE('',*,*,#333,.T.);
#427=ORIENTED_EDGE('',*,*,#334,.T.);
#428=ORIENTED_EDGE('',*,*,#335,.T.);
#429=ORIENTED_EDGE('',*,*,#334,.F.);
#430=ORIENTED_EDGE('',*,*,#336,.T.);
#431=ORIENTED_EDGE('',*,*,#337,.T.);
#432=ORIENTED_EDGE('',*,*,#338,.T.);
#433=ORIENTED_EDGE('',*,*,#339,.F.);
#434=ORIENTED_EDGE('',*,*,#340,.T.);
#435=ORIENTED_EDGE('',*,*,#341,.F.);
#436=ORIENTED_EDGE('',*,*,#342,.F.);
#437=ORIENTED_EDGE('',*,*,#343,.F.);
#438=ORIENTED_EDGE('',*,*,#344,.F.);
#439=ORIENTED_EDGE('',*,*,#345,.T.);
#440=ORIENTED_EDGE('',*,*,#346,.T.);
#441=ORIENTED_EDGE('',*,*,#347,.T.);
#442=ORIENTED_EDGE('',*,*,#348,.T.);
#443=ORIENTED_EDGE('',*,*,#349,.T.);
#444=ORIENTED_EDGE('',*,*,#350,.T.);
#445=ORIENTED_EDGE('',*,*,#351,.T.);
#446=ORIENTED_EDGE('',*,*,#352,.T.);
#447=ORIENTED_EDGE('',*,*,#353,.F.);
#448=ORIENTED_EDGE('',*,*,#354,.F.);
#449=ORIENTED_EDGE('',*,*,#344,.T.);
#450=ORIENTED_EDGE('',*,*,#355,.T.);
#451=ORIENTED_EDGE('',*,*,#356,.F.);
#452=ORIENTED_EDGE('',*,*,#339,.T.);
#453=ORIENTED_EDGE('',*,*,#354,.T.);
#454=ORIENTED_EDGE('',*,*,#357,.F.);
#455=ORIENTED_EDGE('',*,*,#358,.F.);
#456=ORIENTED_EDGE('',*,*,#359,.F.);
#457=ORIENTED_EDGE('',*,*,#360,.F.);
#458=ORIENTED_EDGE('',*,*,#341,.T.);
#459=ORIENTED_EDGE('',*,*,#361,.F.);
#460=ORIENTED_EDGE('',*,*,#362,.F.);
#461=ORIENTED_EDGE('',*,*,#342,.T.);
#462=ORIENTED_EDGE('',*,*,#360,.T.);
#463=ORIENTED_EDGE('',*,*,#363,.F.);
#464=ORIENTED_EDGE('',*,*,#355,.F.);
#465=ORIENTED_EDGE('',*,*,#343,.T.);
#466=ORIENTED_EDGE('',*,*,#362,.T.);
#467=ORIENTED_EDGE('',*,*,#364,.F.);
#468=ORIENTED_EDGE('',*,*,#357,.T.);
#469=ORIENTED_EDGE('',*,*,#353,.T.);
#470=ORIENTED_EDGE('',*,*,#363,.T.);
#471=ORIENTED_EDGE('',*,*,#361,.T.);
#472=ORIENTED_EDGE('',*,*,#359,.T.);
#473=ORIENTED_EDGE('',*,*,#365,.F.);
#474=ORIENTED_EDGE('',*,*,#366,.F.);
#475=ORIENTED_EDGE('',*,*,#367,.F.);
#476=ORIENTED_EDGE('',*,*,#368,.F.);
#477=ORIENTED_EDGE('',*,*,#369,.F.);
#478=ORIENTED_EDGE('',*,*,#370,.F.);
#479=ORIENTED_EDGE('',*,*,#371,.F.);
#480=ORIENTED_EDGE('',*,*,#372,.F.);
#481=ORIENTED_EDGE('',*,*,#373,.T.);
#482=ORIENTED_EDGE('',*,*,#369,.T.);
#483=ORIENTED_EDGE('',*,*,#374,.F.);
#484=ORIENTED_EDGE('',*,*,#350,.F.);
#485=ORIENTED_EDGE('',*,*,#375,.T.);
#486=ORIENTED_EDGE('',*,*,#370,.T.);
#487=ORIENTED_EDGE('',*,*,#373,.F.);
#488=ORIENTED_EDGE('',*,*,#349,.F.);
#489=ORIENTED_EDGE('',*,*,#376,.T.);
#490=ORIENTED_EDGE('',*,*,#371,.T.);
#491=ORIENTED_EDGE('',*,*,#375,.F.);
#492=ORIENTED_EDGE('',*,*,#352,.F.);
#493=ORIENTED_EDGE('',*,*,#374,.T.);
#494=ORIENTED_EDGE('',*,*,#372,.T.);
#495=ORIENTED_EDGE('',*,*,#376,.F.);
#496=ORIENTED_EDGE('',*,*,#351,.F.);
#497=ORIENTED_EDGE('',*,*,#377,.T.);
#498=ORIENTED_EDGE('',*,*,#365,.T.);
#499=ORIENTED_EDGE('',*,*,#378,.F.);
#500=ORIENTED_EDGE('',*,*,#346,.F.);
#501=ORIENTED_EDGE('',*,*,#379,.T.);
#502=ORIENTED_EDGE('',*,*,#366,.T.);
#503=ORIENTED_EDGE('',*,*,#377,.F.);
#504=ORIENTED_EDGE('',*,*,#345,.F.);
#505=ORIENTED_EDGE('',*,*,#380,.T.);
#506=ORIENTED_EDGE('',*,*,#367,.T.);
#507=ORIENTED_EDGE('',*,*,#379,.F.);
#508=ORIENTED_EDGE('',*,*,#348,.F.);
#509=ORIENTED_EDGE('',*,*,#378,.T.);
#510=ORIENTED_EDGE('',*,*,#368,.T.);
#511=ORIENTED_EDGE('',*,*,#380,.F.);
#512=ORIENTED_EDGE('',*,*,#347,.F.);
#513=ORIENTED_EDGE('',*,*,#381,.F.);
#514=ORIENTED_EDGE('',*,*,#329,.F.);
#515=ORIENTED_EDGE('',*,*,#382,.F.);
#516=ORIENTED_EDGE('',*,*,#337,.F.);
#517=ORIENTED_EDGE('',*,*,#356,.T.);
#518=ORIENTED_EDGE('',*,*,#383,.T.);
#519=ORIENTED_EDGE('',*,*,#338,.F.);
#520=ORIENTED_EDGE('',*,*,#384,.F.);
#521=ORIENTED_EDGE('',*,*,#385,.T.);
#522=ORIENTED_EDGE('',*,*,#358,.T.);
#523=ORIENTED_EDGE('',*,*,#386,.F.);
#524=ORIENTED_EDGE('',*,*,#332,.F.);
#525=ORIENTED_EDGE('',*,*,#382,.T.);
#526=ORIENTED_EDGE('',*,*,#386,.T.);
#527=ORIENTED_EDGE('',*,*,#340,.F.);
#528=ORIENTED_EDGE('',*,*,#384,.T.);
#529=ORIENTED_EDGE('',*,*,#335,.F.);
#530=ORIENTED_EDGE('',*,*,#383,.F.);
#531=ORIENTED_EDGE('',*,*,#364,.T.);
#532=ORIENTED_EDGE('',*,*,#385,.F.);
#533=ORIENTED_EDGE('',*,*,#387,.T.);
#534=ORIENTED_EDGE('',*,*,#388,.T.);
#535=ORIENTED_EDGE('',*,*,#330,.F.);
#536=ORIENTED_EDGE('',*,*,#389,.F.);
#537=ORIENTED_EDGE('',*,*,#390,.T.);
#538=ORIENTED_EDGE('',*,*,#391,.T.);
#539=ORIENTED_EDGE('',*,*,#392,.F.);
#540=ORIENTED_EDGE('',*,*,#336,.F.);
#541=ORIENTED_EDGE('',*,*,#381,.T.);
#542=ORIENTED_EDGE('',*,*,#392,.T.);
#543=ORIENTED_EDGE('',*,*,#393,.F.);
#544=ORIENTED_EDGE('',*,*,#389,.T.);
#545=ORIENTED_EDGE('',*,*,#333,.F.);
#546=ORIENTED_EDGE('',*,*,#388,.F.);
#547=ORIENTED_EDGE('',*,*,#394,.T.);
#548=ORIENTED_EDGE('',*,*,#390,.F.);
#549=ORIENTED_EDGE('',*,*,#395,.F.);
#550=ORIENTED_EDGE('',*,*,#396,.F.);
#551=ORIENTED_EDGE('',*,*,#397,.T.);
#552=ORIENTED_EDGE('',*,*,#398,.T.);
#553=ORIENTED_EDGE('',*,*,#399,.F.);
#554=ORIENTED_EDGE('',*,*,#398,.F.);
#555=ORIENTED_EDGE('',*,*,#400,.T.);
#556=ORIENTED_EDGE('',*,*,#401,.T.);
#557=ORIENTED_EDGE('',*,*,#402,.F.);
#558=ORIENTED_EDGE('',*,*,#401,.F.);
#559=ORIENTED_EDGE('',*,*,#403,.T.);
#560=ORIENTED_EDGE('',*,*,#404,.T.);
#561=ORIENTED_EDGE('',*,*,#405,.F.);
#562=ORIENTED_EDGE('',*,*,#393,.T.);
#563=ORIENTED_EDGE('',*,*,#406,.F.);
#564=ORIENTED_EDGE('',*,*,#403,.F.);
#565=ORIENTED_EDGE('',*,*,#400,.F.);
#566=ORIENTED_EDGE('',*,*,#397,.F.);
#567=ORIENTED_EDGE('',*,*,#407,.T.);
#568=ORIENTED_EDGE('',*,*,#408,.T.);
#569=ORIENTED_EDGE('',*,*,#409,.T.);
#570=ORIENTED_EDGE('',*,*,#410,.T.);
#571=ORIENTED_EDGE('',*,*,#391,.F.);
#572=ORIENTED_EDGE('',*,*,#411,.F.);
#573=ORIENTED_EDGE('',*,*,#404,.F.);
#574=ORIENTED_EDGE('',*,*,#406,.T.);
#575=ORIENTED_EDGE('',*,*,#394,.F.);
#576=ORIENTED_EDGE('',*,*,#412,.T.);
#577=ORIENTED_EDGE('',*,*,#395,.T.);
#578=ORIENTED_EDGE('',*,*,#399,.T.);
#579=ORIENTED_EDGE('',*,*,#402,.T.);
#580=ORIENTED_EDGE('',*,*,#411,.T.);
#581=ORIENTED_EDGE('',*,*,#413,.F.);
#582=ORIENTED_EDGE('',*,*,#414,.F.);
#583=ORIENTED_EDGE('',*,*,#415,.F.);
#584=ORIENTED_EDGE('',*,*,#416,.F.);
#585=ORIENTED_EDGE('',*,*,#387,.F.);
#586=ORIENTED_EDGE('',*,*,#405,.T.);
#587=ORIENTED_EDGE('',*,*,#396,.T.);
#588=ORIENTED_EDGE('',*,*,#412,.F.);
#589=ORIENTED_EDGE('',*,*,#417,.T.);
#590=ORIENTED_EDGE('',*,*,#413,.T.);
#591=ORIENTED_EDGE('',*,*,#418,.F.);
#592=ORIENTED_EDGE('',*,*,#408,.F.);
#593=ORIENTED_EDGE('',*,*,#419,.T.);
#594=ORIENTED_EDGE('',*,*,#414,.T.);
#595=ORIENTED_EDGE('',*,*,#417,.F.);
#596=ORIENTED_EDGE('',*,*,#407,.F.);
#597=ORIENTED_EDGE('',*,*,#420,.T.);
#598=ORIENTED_EDGE('',*,*,#415,.T.);
#599=ORIENTED_EDGE('',*,*,#419,.F.);
#600=ORIENTED_EDGE('',*,*,#410,.F.);
#601=ORIENTED_EDGE('',*,*,#418,.T.);
#602=ORIENTED_EDGE('',*,*,#416,.T.);
#603=ORIENTED_EDGE('',*,*,#420,.F.);
#604=ORIENTED_EDGE('',*,*,#409,.F.);
#605=PLANE('',#669);
#606=PLANE('',#670);
#607=PLANE('',#671);
#608=PLANE('',#672);
#609=PLANE('',#681);
#610=PLANE('',#682);
#611=PLANE('',#685);
#612=PLANE('',#686);
#613=PLANE('',#692);
#614=PLANE('',#694);
#615=PLANE('',#696);
#616=PLANE('',#698);
#617=PLANE('',#699);
#618=PLANE('',#700);
#619=PLANE('',#703);
#620=PLANE('',#708);
#621=PLANE('',#711);
#622=PLANE('',#719);
#623=PLANE('',#723);
#624=PLANE('',#726);
#625=PLANE('',#727);
#626=PLANE('',#730);
#627=PLANE('',#732);
#628=PLANE('',#734);
#629=ADVANCED_FACE('',(#63),#605,.T.);
#630=ADVANCED_FACE('',(#64),#606,.T.);
#631=ADVANCED_FACE('',(#65),#607,.T.);
#632=ADVANCED_FACE('',(#66,#29,#30),#608,.F.);
#633=ADVANCED_FACE('',(#67),#15,.T.);
#634=ADVANCED_FACE('',(#68),#609,.T.);
#635=ADVANCED_FACE('',(#69),#610,.T.);
#636=ADVANCED_FACE('',(#70),#16,.T.);
#637=ADVANCED_FACE('',(#71),#611,.T.);
#638=ADVANCED_FACE('',(#72,#31,#32),#612,.T.);
#639=ADVANCED_FACE('',(#73),#17,.F.);
#640=ADVANCED_FACE('',(#74),#613,.F.);
#641=ADVANCED_FACE('',(#75),#18,.F.);
#642=ADVANCED_FACE('',(#76),#614,.F.);
#643=ADVANCED_FACE('',(#77),#19,.F.);
#644=ADVANCED_FACE('',(#78),#615,.F.);
#645=ADVANCED_FACE('',(#79),#20,.F.);
#646=ADVANCED_FACE('',(#80),#616,.F.);
#647=ADVANCED_FACE('',(#81),#617,.F.);
#648=ADVANCED_FACE('',(#82),#618,.T.);
#649=ADVANCED_FACE('',(#83),#619,.T.);
#650=ADVANCED_FACE('',(#84),#21,.T.);
#651=ADVANCED_FACE('',(#85),#22,.F.);
#652=ADVANCED_FACE('',(#86),#620,.F.);
#653=ADVANCED_FACE('',(#87),#621,.F.);
#654=ADVANCED_FACE('',(#88),#23,.F.);
#655=ADVANCED_FACE('',(#89),#24,.T.);
#656=ADVANCED_FACE('',(#90),#25,.T.);
#657=ADVANCED_FACE('',(#91),#622,.T.);
#658=ADVANCED_FACE('',(#92),#26,.T.);
#659=ADVANCED_FACE('',(#93,#33),#623,.F.);
#660=ADVANCED_FACE('',(#94),#624,.T.);
#661=ADVANCED_FACE('',(#95,#34),#625,.T.);
#662=ADVANCED_FACE('',(#96),#626,.T.);
#663=ADVANCED_FACE('',(#97),#27,.F.);
#664=ADVANCED_FACE('',(#98),#627,.F.);
#665=ADVANCED_FACE('',(#99),#28,.F.);
#666=ADVANCED_FACE('',(#100),#628,.F.);
#667=CLOSED_SHELL('',(#629,#630,#631,#632,#633,#634,#635,#636,#637,#638,
#639,#640,#641,#642,#643,#644,#645,#646,#647,#648,#649,#650,#651,#652,#653,
#654,#655,#656,#657,#658,#659,#660,#661,#662,#663,#664,#665,#666));
#668=AXIS2_PLACEMENT_3D('placement',#933,#735,#736);
#669=AXIS2_PLACEMENT_3D('',#934,#737,#738);
#670=AXIS2_PLACEMENT_3D('',#943,#743,#744);
#671=AXIS2_PLACEMENT_3D('',#949,#748,#749);
#672=AXIS2_PLACEMENT_3D('',#955,#753,#754);
#673=AXIS2_PLACEMENT_3D('',#964,#758,#759);
#674=AXIS2_PLACEMENT_3D('',#967,#761,#762);
#675=AXIS2_PLACEMENT_3D('',#972,#764,#765);
#676=AXIS2_PLACEMENT_3D('',#975,#767,#768);
#677=AXIS2_PLACEMENT_3D('',#980,#770,#771);
#678=AXIS2_PLACEMENT_3D('',#983,#773,#774);
#679=AXIS2_PLACEMENT_3D('',#984,#775,#776);
#680=AXIS2_PLACEMENT_3D('',#987,#777,#778);
#681=AXIS2_PLACEMENT_3D('',#990,#781,#782);
#682=AXIS2_PLACEMENT_3D('',#994,#785,#786);
#683=AXIS2_PLACEMENT_3D('',#1000,#790,#791);
#684=AXIS2_PLACEMENT_3D('',#1002,#792,#793);
#685=AXIS2_PLACEMENT_3D('',#1004,#795,#796);
#686=AXIS2_PLACEMENT_3D('',#1006,#798,#799);
#687=AXIS2_PLACEMENT_3D('',#1010,#801,#802);
#688=AXIS2_PLACEMENT_3D('',#1014,#804,#805);
#689=AXIS2_PLACEMENT_3D('',#1018,#807,#808);
#690=AXIS2_PLACEMENT_3D('',#1022,#810,#811);
#691=AXIS2_PLACEMENT_3D('',#1024,#813,#814);
#692=AXIS2_PLACEMENT_3D('',#1027,#817,#818);
#693=AXIS2_PLACEMENT_3D('',#1029,#820,#821);
#694=AXIS2_PLACEMENT_3D('',#1031,#823,#824);
#695=AXIS2_PLACEMENT_3D('',#1032,#825,#826);
#696=AXIS2_PLACEMENT_3D('',#1035,#829,#830);
#697=AXIS2_PLACEMENT_3D('',#1037,#832,#833);
#698=AXIS2_PLACEMENT_3D('',#1039,#835,#836);
#699=AXIS2_PLACEMENT_3D('',#1040,#837,#838);
#700=AXIS2_PLACEMENT_3D('',#1043,#841,#842);
#701=AXIS2_PLACEMENT_3D('',#1044,#843,#844);
#702=AXIS2_PLACEMENT_3D('',#1045,#845,#846);
#703=AXIS2_PLACEMENT_3D('',#1046,#847,#848);
#704=AXIS2_PLACEMENT_3D('',#1047,#849,#850);
#705=AXIS2_PLACEMENT_3D('',#1048,#851,#852);
#706=AXIS2_PLACEMENT_3D('',#1049,#853,#854);
#707=AXIS2_PLACEMENT_3D('',#1050,#855,#856);
#708=AXIS2_PLACEMENT_3D('',#1051,#857,#858);
#709=AXIS2_PLACEMENT_3D('',#1055,#860,#861);
#710=AXIS2_PLACEMENT_3D('',#1056,#862,#863);
#711=AXIS2_PLACEMENT_3D('',#1057,#864,#865);
#712=AXIS2_PLACEMENT_3D('',#1059,#866,#867);
#713=AXIS2_PLACEMENT_3D('',#1062,#869,#870);
#714=AXIS2_PLACEMENT_3D('',#1063,#871,#872);
#715=AXIS2_PLACEMENT_3D('',#1065,#874,#875);
#716=AXIS2_PLACEMENT_3D('',#1067,#877,#878);
#717=AXIS2_PLACEMENT_3D('',#1070,#879,#880);
#718=AXIS2_PLACEMENT_3D('',#1074,#882,#883);
#719=AXIS2_PLACEMENT_3D('',#1076,#885,#886);
#720=AXIS2_PLACEMENT_3D('',#1082,#890,#891);
#721=AXIS2_PLACEMENT_3D('',#1084,#892,#893);
#722=AXIS2_PLACEMENT_3D('',#1086,#894,#895);
#723=AXIS2_PLACEMENT_3D('',#1088,#897,#898);
#724=AXIS2_PLACEMENT_3D('',#1095,#902,#903);
#725=AXIS2_PLACEMENT_3D('',#1098,#905,#906);
#726=AXIS2_PLACEMENT_3D('',#1099,#907,#908);
#727=AXIS2_PLACEMENT_3D('',#1101,#910,#911);
#728=AXIS2_PLACEMENT_3D('',#1105,#913,#914);
#729=AXIS2_PLACEMENT_3D('',#1109,#916,#917);
#730=AXIS2_PLACEMENT_3D('',#1111,#919,#920);
#731=AXIS2_PLACEMENT_3D('',#1112,#921,#922);
#732=AXIS2_PLACEMENT_3D('',#1115,#925,#926);
#733=AXIS2_PLACEMENT_3D('',#1117,#928,#929);
#734=AXIS2_PLACEMENT_3D('',#1119,#931,#932);
#735=DIRECTION('axis',(0.,0.,1.));
#736=DIRECTION('refdir',(1.,0.,0.));
#737=DIRECTION('center_axis',(0.,0.,-1.));
#738=DIRECTION('ref_axis',(-1.,0.,0.));
#739=DIRECTION('',(-1.,0.,0.));
#740=DIRECTION('',(0.,1.,0.));
#741=DIRECTION('',(-1.,0.,0.));
#742=DIRECTION('',(0.,-1.,0.));
#743=DIRECTION('center_axis',(0.,1.,0.));
#744=DIRECTION('ref_axis',(0.,0.,1.));
#745=DIRECTION('',(0.,0.,1.));
#746=DIRECTION('',(1.,0.,0.));
#747=DIRECTION('',(0.,0.,-1.));
#748=DIRECTION('center_axis',(0.,0.,1.));
#749=DIRECTION('ref_axis',(1.,0.,0.));
#750=DIRECTION('',(0.,-1.,0.));
#751=DIRECTION('',(1.,0.,0.));
#752=DIRECTION('',(0.,1.,0.));
#753=DIRECTION('center_axis',(-1.,-3.49148133884313E-15,0.));
#754=DIRECTION('ref_axis',(0.,0.,1.));
#755=DIRECTION('',(-3.13152185970027E-15,1.,0.));
#756=DIRECTION('',(0.,0.,-1.));
#757=DIRECTION('',(3.13152185970026E-15,-1.,0.));
#758=DIRECTION('center_axis',(-1.,-3.49148133884313E-15,0.));
#759=DIRECTION('ref_axis',(0.,0.,1.));
#760=DIRECTION('',(0.,0.,-1.));
#761=DIRECTION('center_axis',(-1.,-3.49148133884313E-15,0.));
#762=DIRECTION('ref_axis',(0.,0.,1.));
#763=DIRECTION('',(-2.53765262771464E-15,1.,-7.93016446160825E-17));
#764=DIRECTION('center_axis',(-1.,-3.49148133884313E-15,0.));
#765=DIRECTION('ref_axis',(0.,0.,1.));
#766=DIRECTION('',(2.53765262771464E-15,-1.,3.1720657846433E-16));
#767=DIRECTION('center_axis',(-1.,-3.49148133884313E-15,0.));
#768=DIRECTION('ref_axis',(0.,0.,1.));
#769=DIRECTION('',(-2.53765262771464E-15,1.,0.));
#770=DIRECTION('center_axis',(-1.,-3.49148133884313E-15,0.));
#771=DIRECTION('ref_axis',(0.,0.,1.));
#772=DIRECTION('',(2.53765262771464E-15,-1.,0.));
#773=DIRECTION('center_axis',(-1.,-3.49148133884313E-15,0.));
#774=DIRECTION('ref_axis',(0.,0.,1.));
#775=DIRECTION('center_axis',(-1.,-3.49148133884313E-15,0.));
#776=DIRECTION('ref_axis',(0.,0.,1.));
#777=DIRECTION('center_axis',(-1.,-3.49148133884313E-15,0.));
#778=DIRECTION('ref_axis',(0.,0.,1.));
#779=DIRECTION('',(-1.,-3.33066907387547E-15,0.));
#780=DIRECTION('',(-1.,-3.33066907387547E-15,0.));
#781=DIRECTION('center_axis',(0.,0.,1.));
#782=DIRECTION('ref_axis',(1.,0.,0.));
#783=DIRECTION('',(-1.,-3.46944695195361E-15,0.));
#784=DIRECTION('',(-3.13152185970027E-15,1.,0.));
#785=DIRECTION('center_axis',(0.,0.,-1.));
#786=DIRECTION('ref_axis',(-1.,0.,0.));
#787=DIRECTION('',(1.,3.46944695195361E-15,0.));
#788=DIRECTION('',(3.13152185970027E-15,-1.,0.));
#789=DIRECTION('',(-1.,-3.33066907387547E-15,0.));
#790=DIRECTION('center_axis',(-1.,-3.49148133884313E-15,0.));
#791=DIRECTION('ref_axis',(0.,0.,1.));
#792=DIRECTION('center_axis',(-1.,-3.49148133884313E-15,0.));
#793=DIRECTION('ref_axis',(0.,0.,1.));
#794=DIRECTION('',(-1.,-3.33066907387547E-15,0.));
#795=DIRECTION('center_axis',(-3.49148133884313E-15,1.,0.));
#796=DIRECTION('ref_axis',(0.,0.,1.));
#797=DIRECTION('',(0.,0.,-1.));
#798=DIRECTION('center_axis',(-1.,-3.49148133884313E-15,0.));
#799=DIRECTION('ref_axis',(0.,0.,1.));
#800=DIRECTION('',(0.,0.,-1.));
#801=DIRECTION('center_axis',(-1.,-3.49148133884313E-15,0.));
#802=DIRECTION('ref_axis',(0.,0.,-1.));
#803=DIRECTION('',(-5.07530525542928E-15,1.,-7.93016446160826E-17));
#804=DIRECTION('center_axis',(-1.,-3.49148133884313E-15,0.));
#805=DIRECTION('ref_axis',(0.,0.,-1.));
#806=DIRECTION('',(5.07530525542928E-15,-1.,0.));
#807=DIRECTION('center_axis',(-1.,-3.49148133884313E-15,0.));
#808=DIRECTION('ref_axis',(0.,0.,1.));
#809=DIRECTION('',(-5.07530525542928E-15,1.,0.));
#810=DIRECTION('center_axis',(-1.,-3.49148133884313E-15,0.));
#811=DIRECTION('ref_axis',(0.,0.,1.));
#812=DIRECTION('',(5.07530525542928E-15,-1.,0.));
#813=DIRECTION('center_axis',(-1.,-3.49148133884313E-15,0.));
#814=DIRECTION('ref_axis',(0.,0.,1.));
#815=DIRECTION('',(-1.,-3.88578058618806E-15,0.));
#816=DIRECTION('',(-1.,-3.88578058618806E-15,0.));
#817=DIRECTION('center_axis',(0.,0.,1.));
#818=DIRECTION('ref_axis',(1.,0.,0.));
#819=DIRECTION('',(-1.,-3.60822483003176E-15,0.));
#820=DIRECTION('center_axis',(-1.,-3.49148133884313E-15,0.));
#821=DIRECTION('ref_axis',(0.,0.,1.));
#822=DIRECTION('',(-1.,-3.60822483003176E-15,0.));
#823=DIRECTION('center_axis',(0.,0.,-1.));
#824=DIRECTION('ref_axis',(-1.,0.,0.));
#825=DIRECTION('center_axis',(-1.,-3.49148133884313E-15,0.));
#826=DIRECTION('ref_axis',(0.,0.,1.));
#827=DIRECTION('',(-1.,-3.88578058618806E-15,0.));
#828=DIRECTION('',(-1.,-3.88578058618806E-15,0.));
#829=DIRECTION('center_axis',(-4.32625331744722E-31,1.23908819712629E-16,
1.));
#830=DIRECTION('ref_axis',(1.,0.,0.));
#831=DIRECTION('',(-1.,-3.60822483003176E-15,0.));
#832=DIRECTION('center_axis',(-1.,-3.49148133884313E-15,0.));
#833=DIRECTION('ref_axis',(0.,0.,1.));
#834=DIRECTION('',(-1.,-3.60822483003176E-15,0.));
#835=DIRECTION('center_axis',(8.65250663489445E-31,-2.47817639425258E-16,
-1.));
#836=DIRECTION('ref_axis',(-1.,0.,0.));
#837=DIRECTION('center_axis',(0.,1.,0.));
#838=DIRECTION('ref_axis',(0.,0.,1.));
#839=DIRECTION('',(0.,0.,1.));
#840=DIRECTION('',(0.,0.,-1.));
#841=DIRECTION('center_axis',(0.,0.,1.));
#842=DIRECTION('ref_axis',(1.,0.,0.));
#843=DIRECTION('center_axis',(0.,0.,1.));
#844=DIRECTION('ref_axis',(1.,0.,0.));
#845=DIRECTION('center_axis',(0.,0.,-1.));
#846=DIRECTION('ref_axis',(1.,0.,0.));
#847=DIRECTION('center_axis',(0.,0.,-1.));
#848=DIRECTION('ref_axis',(-1.,0.,0.));
#849=DIRECTION('center_axis',(0.,0.,1.));
#850=DIRECTION('ref_axis',(1.,0.,0.));
#851=DIRECTION('center_axis',(0.,0.,1.));
#852=DIRECTION('ref_axis',(-1.,0.,0.));
#853=DIRECTION('center_axis',(0.,0.,1.));
#854=DIRECTION('ref_axis',(1.,0.,0.));
#855=DIRECTION('center_axis',(0.,0.,1.));
#856=DIRECTION('ref_axis',(1.,0.,0.));
#857=DIRECTION('center_axis',(0.,0.,1.));
#858=DIRECTION('ref_axis',(1.,0.,0.));
#859=DIRECTION('',(-1.,-3.33066907387547E-15,0.));
#860=DIRECTION('center_axis',(0.,0.,-1.));
#861=DIRECTION('ref_axis',(-1.,0.,0.));
#862=DIRECTION('center_axis',(0.,0.,-1.));
#863=DIRECTION('ref_axis',(1.,0.,0.));
#864=DIRECTION('center_axis',(0.,0.,-1.));
#865=DIRECTION('ref_axis',(-1.,0.,0.));
#866=DIRECTION('center_axis',(0.,0.,-1.));
#867=DIRECTION('ref_axis',(-1.,0.,0.));
#868=DIRECTION('',(1.,3.33066907387547E-15,0.));
#869=DIRECTION('center_axis',(0.,0.,1.));
#870=DIRECTION('ref_axis',(-1.,0.,0.));
#871=DIRECTION('center_axis',(0.,0.,-1.));
#872=DIRECTION('ref_axis',(-1.,0.,0.));
#873=DIRECTION('',(0.,0.,1.));
#874=DIRECTION('center_axis',(0.,0.,-1.));
#875=DIRECTION('ref_axis',(-1.,0.,0.));
#876=DIRECTION('',(0.,0.,1.));
#877=DIRECTION('center_axis',(-1.,-3.49148133884313E-15,0.));
#878=DIRECTION('ref_axis',(0.,0.,1.));
#879=DIRECTION('center_axis',(-1.,-3.49148133884313E-15,0.));
#880=DIRECTION('ref_axis',(0.,0.,-1.));
#881=DIRECTION('',(-1.,-4.44089209850062E-15,0.));
#882=DIRECTION('center_axis',(-1.,-3.49148133884313E-15,0.));
#883=DIRECTION('ref_axis',(0.,0.,-1.));
#884=DIRECTION('',(-1.,-2.22044604925032E-15,0.));
#885=DIRECTION('center_axis',(3.49148133884313E-15,-1.,0.));
#886=DIRECTION('ref_axis',(0.,0.,-1.));
#887=DIRECTION('',(0.,0.,1.));
#888=DIRECTION('',(0.,0.,1.));
#889=DIRECTION('',(-1.,-2.22044604925032E-15,0.));
#890=DIRECTION('center_axis',(-1.,-3.49148133884313E-15,0.));
#891=DIRECTION('ref_axis',(0.,0.,1.));
#892=DIRECTION('center_axis',(-1.,-3.49148133884313E-15,0.));
#893=DIRECTION('ref_axis',(0.,0.,-1.));
#894=DIRECTION('center_axis',(-1.,-3.49148133884313E-15,0.));
#895=DIRECTION('ref_axis',(0.,0.,-1.));
#896=DIRECTION('',(-1.,-4.44089209850062E-15,0.));
#897=DIRECTION('center_axis',(-1.,-3.49148133884313E-15,0.));
#898=DIRECTION('ref_axis',(0.,0.,1.));
#899=DIRECTION('',(3.5513318005295E-15,-1.,0.));
#900=DIRECTION('',(-3.5513318005295E-15,1.,0.));
#901=DIRECTION('',(0.,0.,-1.));
#902=DIRECTION('center_axis',(-1.,-3.49148133884313E-15,0.));
#903=DIRECTION('ref_axis',(3.49148133884313E-15,-1.,0.));
#904=DIRECTION('',(0.,0.,1.));
#905=DIRECTION('center_axis',(-1.,-3.49148133884313E-15,0.));
#906=DIRECTION('ref_axis',(3.49148133884313E-15,-1.,0.));
#907=DIRECTION('center_axis',(0.,0.,1.));
#908=DIRECTION('ref_axis',(1.,0.,0.));
#909=DIRECTION('',(-3.5513318005295E-15,1.,0.));
#910=DIRECTION('center_axis',(-1.,-3.49148133884313E-15,0.));
#911=DIRECTION('ref_axis',(0.,0.,1.));
#912=DIRECTION('',(3.5513318005295E-15,-1.,0.));
#913=DIRECTION('center_axis',(-1.,-3.49148133884313E-15,0.));
#914=DIRECTION('ref_axis',(3.49148133884313E-15,-1.,0.));
#915=DIRECTION('',(0.,0.,-1.));
#916=DIRECTION('center_axis',(-1.,-3.49148133884313E-15,0.));
#917=DIRECTION('ref_axis',(3.49148133884313E-15,-1.,0.));
#918=DIRECTION('',(0.,0.,1.));
#919=DIRECTION('center_axis',(0.,0.,-1.));
#920=DIRECTION('ref_axis',(-1.,0.,0.));
#921=DIRECTION('center_axis',(-1.,-3.49148133884313E-15,0.));
#922=DIRECTION('ref_axis',(3.49148133884313E-15,-1.,0.));
#923=DIRECTION('',(-1.,-3.33066907387547E-15,0.));
#924=DIRECTION('',(-1.,-2.22044604925031E-15,0.));
#925=DIRECTION('center_axis',(-3.49148133884313E-15,1.,0.));
#926=DIRECTION('ref_axis',(0.,0.,1.));
#927=DIRECTION('',(-1.,-3.33066907387541E-15,0.));
#928=DIRECTION('center_axis',(-1.,-3.49148133884313E-15,0.));
#929=DIRECTION('ref_axis',(3.49148133884313E-15,-1.,0.));
#930=DIRECTION('',(-1.,-2.22044604925031E-15,0.));
#931=DIRECTION('center_axis',(3.49148133884313E-15,-1.,0.));
#932=DIRECTION('ref_axis',(0.,0.,-1.));
#933=CARTESIAN_POINT('',(0.,0.,0.));
#934=CARTESIAN_POINT('Origin',(2.50000000000002,-2.,-20.));
#935=CARTESIAN_POINT('',(71.2634,-2.,-20.));
#936=CARTESIAN_POINT('',(27.7366,-2.,-20.));
#937=CARTESIAN_POINT('',(71.2634,-2.,-20.));
#938=CARTESIAN_POINT('',(27.7366,0.,-20.));
#939=CARTESIAN_POINT('',(27.7366,-2.,-20.));
#940=CARTESIAN_POINT('',(71.2634,0.,-20.));
#941=CARTESIAN_POINT('',(71.2634,0.,-20.));
#942=CARTESIAN_POINT('',(71.2634,0.,-20.));
#943=CARTESIAN_POINT('Origin',(82.5,0.,-2.5));
#944=CARTESIAN_POINT('',(27.7366,0.,0.));
#945=CARTESIAN_POINT('',(27.7366,0.,-20.));
#946=CARTESIAN_POINT('',(71.2634,0.,0.));
#947=CARTESIAN_POINT('',(27.7366,0.,0.));
#948=CARTESIAN_POINT('',(71.2634,0.,0.));
#949=CARTESIAN_POINT('Origin',(2.50000000000002,-2.,0.));
#950=CARTESIAN_POINT('',(27.7366,-2.,0.));
#951=CARTESIAN_POINT('',(27.7366,0.,0.));
#952=CARTESIAN_POINT('',(71.2634,-2.,0.));
#953=CARTESIAN_POINT('',(27.7366,-2.,0.));
#954=CARTESIAN_POINT('',(71.2634,-2.,0.));
#955=CARTESIAN_POINT('Origin',(74.,9.24535509888798,-2.5));
#956=CARTESIAN_POINT('',(74.,0.736600000000013,0.));
#957=CARTESIAN_POINT('',(74.,9.24535509888798,0.));
#958=CARTESIAN_POINT('',(74.,0.736600000000018,0.));
#959=CARTESIAN_POINT('',(74.,0.736600000000004,-20.));
#960=CARTESIAN_POINT('',(74.,0.736600000000004,0.));
#961=CARTESIAN_POINT('',(74.,9.24535509888798,-20.));
#962=CARTESIAN_POINT('',(74.,9.24535509888798,-20.));
#963=CARTESIAN_POINT('',(74.,11.745355098888,-17.5));
#964=CARTESIAN_POINT('Origin',(74.,9.24535509888798,-17.5));
#965=CARTESIAN_POINT('',(74.,11.745355098888,-2.5));
#966=CARTESIAN_POINT('',(74.,11.745355098888,-2.5));
#967=CARTESIAN_POINT('Origin',(74.,9.24535509888798,-2.5));
#968=CARTESIAN_POINT('',(74.,4.49535509888797,-2.3));
#969=CARTESIAN_POINT('',(74.,7.99535509888798,-2.3));
#970=CARTESIAN_POINT('',(74.,4.49535509888797,-2.3));
#971=CARTESIAN_POINT('',(74.,7.99535509888798,-6.7));
#972=CARTESIAN_POINT('Origin',(74.,7.99535509888798,-4.5));
#973=CARTESIAN_POINT('',(74.,4.49535509888797,-6.7));
#974=CARTESIAN_POINT('',(74.,7.99535509888798,-6.7));
#975=CARTESIAN_POINT('Origin',(74.,4.49535509888797,-4.5));
#976=CARTESIAN_POINT('',(74.,4.49535509888797,-13.3));
#977=CARTESIAN_POINT('',(74.,7.99535509888798,-13.3));
#978=CARTESIAN_POINT('',(74.,4.49535509888797,-13.3));
#979=CARTESIAN_POINT('',(74.,7.99535509888798,-17.7));
#980=CARTESIAN_POINT('Origin',(74.,7.99535509888798,-15.5));
#981=CARTESIAN_POINT('',(74.,4.49535509888797,-17.7));
#982=CARTESIAN_POINT('',(74.,7.99535509888798,-17.7));
#983=CARTESIAN_POINT('Origin',(74.,4.49535509888797,-15.5));
#984=CARTESIAN_POINT('Origin',(74.,9.24535509888798,-2.5));
#985=CARTESIAN_POINT('',(72.,9.24535509888796,0.));
#986=CARTESIAN_POINT('',(72.,11.745355098888,-2.5));
#987=CARTESIAN_POINT('Origin',(72.,9.24535509888796,-2.5));
#988=CARTESIAN_POINT('',(74.,9.24535509888798,0.));
#989=CARTESIAN_POINT('',(74.,11.745355098888,-2.5));
#990=CARTESIAN_POINT('Origin',(74.0000000000003,-70.754644901112,0.));
#991=CARTESIAN_POINT('',(72.,0.736600000000004,0.));
#992=CARTESIAN_POINT('',(74.,0.736600000000004,0.));
#993=CARTESIAN_POINT('',(72.,0.736600000000004,0.));
#994=CARTESIAN_POINT('Origin',(74.0000000000003,-70.754644901112,-20.));
#995=CARTESIAN_POINT('',(72.,0.736600000000004,-20.));
#996=CARTESIAN_POINT('',(72.,0.736599999999997,-20.));
#997=CARTESIAN_POINT('',(72.,9.24535509888796,-20.));
#998=CARTESIAN_POINT('',(72.,9.24535509888796,-20.));
#999=CARTESIAN_POINT('',(74.,9.24535509888798,-20.));
#1000=CARTESIAN_POINT('Origin',(74.,9.24535509888798,-17.5));
#1001=CARTESIAN_POINT('',(72.,11.745355098888,-17.5));
#1002=CARTESIAN_POINT('Origin',(72.,9.24535509888796,-17.5));
#1003=CARTESIAN_POINT('',(74.,11.745355098888,-17.5));
#1004=CARTESIAN_POINT('Origin',(74.,11.745355098888,-2.5));
#1005=CARTESIAN_POINT('',(72.,11.745355098888,-2.5));
#1006=CARTESIAN_POINT('Origin',(72.,9.24535509888796,-2.5));
#1007=CARTESIAN_POINT('',(72.,0.73659999999999,0.));
#1008=CARTESIAN_POINT('',(72.,7.99535509888796,-2.3));
#1009=CARTESIAN_POINT('',(72.,7.99535509888796,-6.7));
#1010=CARTESIAN_POINT('Origin',(72.,7.99535509888796,-4.5));
#1011=CARTESIAN_POINT('',(72.,4.49535509888796,-2.3));
#1012=CARTESIAN_POINT('',(72.,4.49535509888796,-2.3));
#1013=CARTESIAN_POINT('',(72.,4.49535509888796,-6.7));
#1014=CARTESIAN_POINT('Origin',(72.,4.49535509888796,-4.5));
#1015=CARTESIAN_POINT('',(72.,7.99535509888796,-6.7));
#1016=CARTESIAN_POINT('',(72.,7.99535509888796,-13.3));
#1017=CARTESIAN_POINT('',(72.,7.99535509888796,-17.7));
#1018=CARTESIAN_POINT('Origin',(72.,7.99535509888796,-15.5));
#1019=CARTESIAN_POINT('',(72.,4.49535509888796,-13.3));
#1020=CARTESIAN_POINT('',(72.,4.49535509888796,-13.3));
#1021=CARTESIAN_POINT('',(72.,4.49535509888796,-17.7));
#1022=CARTESIAN_POINT('Origin',(72.,4.49535509888796,-15.5));
#1023=CARTESIAN_POINT('',(72.,7.99535509888796,-17.7));
#1024=CARTESIAN_POINT('Origin',(82.,7.995355098888,-15.5));
#1025=CARTESIAN_POINT('',(74.,7.99535509888798,-13.3));
#1026=CARTESIAN_POINT('',(74.,7.99535509888798,-17.7));
#1027=CARTESIAN_POINT('Origin',(82.,7.995355098888,-13.3));
#1028=CARTESIAN_POINT('',(74.,4.49535509888797,-13.3));
#1029=CARTESIAN_POINT('Origin',(82.,4.495355098888,-15.5));
#1030=CARTESIAN_POINT('',(74.,4.49535509888797,-17.7));
#1031=CARTESIAN_POINT('Origin',(82.,7.995355098888,-17.7));
#1032=CARTESIAN_POINT('Origin',(82.,7.995355098888,-4.5));
#1033=CARTESIAN_POINT('',(74.,7.99535509888798,-2.3));
#1034=CARTESIAN_POINT('',(74.,7.99535509888798,-6.7));
#1035=CARTESIAN_POINT('Origin',(82.,7.995355098888,-2.3));
#1036=CARTESIAN_POINT('',(74.,4.49535509888797,-2.3));
#1037=CARTESIAN_POINT('Origin',(82.,4.495355098888,-4.5));
#1038=CARTESIAN_POINT('',(74.,4.49535509888797,-6.7));
#1039=CARTESIAN_POINT('Origin',(82.,7.995355098888,-6.7));
#1040=CARTESIAN_POINT('Origin',(82.5,-2.,-2.5));
#1041=CARTESIAN_POINT('',(27.7366,-2.,-20.));
#1042=CARTESIAN_POINT('',(71.2634,-2.,0.));
#1043=CARTESIAN_POINT('Origin',(71.2634,0.7366,0.));
#1044=CARTESIAN_POINT('Origin',(71.2634,0.7366,0.));
#1045=CARTESIAN_POINT('Origin',(71.2634,0.7366,0.));
#1046=CARTESIAN_POINT('Origin',(71.2634,0.7366,-20.));
#1047=CARTESIAN_POINT('Origin',(71.2634,0.7366,-20.));
#1048=CARTESIAN_POINT('Origin',(71.2634,0.7366,-20.));
#1049=CARTESIAN_POINT('Origin',(71.2634,0.7366,-30.2840118764638));
#1050=CARTESIAN_POINT('Origin',(71.2634,0.7366,-30.2840118764638));
#1051=CARTESIAN_POINT('Origin',(27.7366,-2.7366,-20.));
#1052=CARTESIAN_POINT('',(27.,-2.7366,-20.));
#1053=CARTESIAN_POINT('',(25.,-2.73660000000001,-20.));
#1054=CARTESIAN_POINT('',(27.,-2.7366,-20.));
#1055=CARTESIAN_POINT('Origin',(27.7366,-2.7366,-20.));
#1056=CARTESIAN_POINT('Origin',(27.7366,-2.7366,-20.));
#1057=CARTESIAN_POINT('Origin',(27.7366,-2.7366,0.));
#1058=CARTESIAN_POINT('',(25.,-2.73660000000001,0.));
#1059=CARTESIAN_POINT('Origin',(27.7366,-2.7366,0.));
#1060=CARTESIAN_POINT('',(27.,-2.7366,0.));
#1061=CARTESIAN_POINT('',(25.,-2.73660000000001,0.));
#1062=CARTESIAN_POINT('Origin',(27.7366,-2.7366,0.));
#1063=CARTESIAN_POINT('Origin',(27.7366,-2.7366,10.2840118764638));
#1064=CARTESIAN_POINT('',(27.,-2.7366,-20.));
#1065=CARTESIAN_POINT('Origin',(27.7366,-2.7366,10.2840118764638));
#1066=CARTESIAN_POINT('',(25.,-2.73660000000001,-20.));
#1067=CARTESIAN_POINT('Origin',(27.0000000000001,-25.245355098888,-17.5));
#1068=CARTESIAN_POINT('',(25.0000000000001,-25.2453550988879,-20.));
#1069=CARTESIAN_POINT('',(25.0000000000001,-27.745355098888,-17.5));
#1070=CARTESIAN_POINT('Origin',(25.0000000000001,-25.245355098888,-17.5));
#1071=CARTESIAN_POINT('',(27.0000000000001,-25.2453550988879,-20.));
#1072=CARTESIAN_POINT('',(27.0000000000001,-25.2453550988879,-20.));
#1073=CARTESIAN_POINT('',(27.0000000000001,-27.745355098888,-17.5));
#1074=CARTESIAN_POINT('Origin',(27.0000000000001,-25.245355098888,-17.5));
#1075=CARTESIAN_POINT('',(27.0000000000001,-27.745355098888,-17.5));
#1076=CARTESIAN_POINT('Origin',(27.0000000000001,-27.745355098888,-2.50000000000002));
#1077=CARTESIAN_POINT('',(25.0000000000001,-27.745355098888,-2.50000000000002));
#1078=CARTESIAN_POINT('',(25.0000000000001,-27.745355098888,-17.5));
#1079=CARTESIAN_POINT('',(27.0000000000001,-27.745355098888,-2.50000000000002));
#1080=CARTESIAN_POINT('',(27.0000000000001,-27.745355098888,-17.5));
#1081=CARTESIAN_POINT('',(27.0000000000001,-27.745355098888,-2.50000000000002));
#1082=CARTESIAN_POINT('Origin',(27.0000000000001,-25.245355098888,-2.5));
#1083=CARTESIAN_POINT('',(25.0000000000001,-25.2453550988879,0.));
#1084=CARTESIAN_POINT('Origin',(25.0000000000001,-25.245355098888,-2.5));
#1085=CARTESIAN_POINT('',(27.0000000000001,-25.2453550988879,0.));
#1086=CARTESIAN_POINT('Origin',(27.0000000000001,-25.245355098888,-2.5));
#1087=CARTESIAN_POINT('',(27.0000000000001,-25.2453550988879,0.));
#1088=CARTESIAN_POINT('Origin',(26.9999999999998,54.7546449011121,-2.5));
#1089=CARTESIAN_POINT('',(27.,-2.7366,-20.));
#1090=CARTESIAN_POINT('',(27.0000000000001,-25.2453550988879,0.));
#1091=CARTESIAN_POINT('',(27.0000000000001,-13.9875,-8.25));
#1092=CARTESIAN_POINT('',(27.,-13.9875,-11.75));
#1093=CARTESIAN_POINT('',(27.,-13.9875,-8.25));
#1094=CARTESIAN_POINT('',(27.0000000000001,-23.5125,-11.75));
#1095=CARTESIAN_POINT('Origin',(27.,-18.75,-11.75));
#1096=CARTESIAN_POINT('',(27.0000000000001,-23.5125,-8.25));
#1097=CARTESIAN_POINT('',(27.0000000000001,-23.5125,-11.75));
#1098=CARTESIAN_POINT('Origin',(27.,-18.75,-8.25));
#1099=CARTESIAN_POINT('Origin',(27.0000000000001,-25.2453550988879,0.));
#1100=CARTESIAN_POINT('',(25.0000000000001,-25.2453550988879,0.));
#1101=CARTESIAN_POINT('Origin',(24.9999999999998,54.754644901112,-2.5));
#1102=CARTESIAN_POINT('',(25.,-2.73660000000001,-20.));
#1103=CARTESIAN_POINT('',(25.,-13.9875,-11.75));
#1104=CARTESIAN_POINT('',(25.0000000000001,-23.5125,-11.75));
#1105=CARTESIAN_POINT('Origin',(25.,-18.75,-11.75));
#1106=CARTESIAN_POINT('',(25.,-13.9875,-8.25));
#1107=CARTESIAN_POINT('',(25.,-13.9875,-8.25));
#1108=CARTESIAN_POINT('',(25.0000000000001,-23.5125,-8.25));
#1109=CARTESIAN_POINT('Origin',(25.,-18.75,-8.25));
#1110=CARTESIAN_POINT('',(25.0000000000001,-23.5125,-11.75));
#1111=CARTESIAN_POINT('Origin',(27.0000000000001,-25.2453550988879,-20.));
#1112=CARTESIAN_POINT('Origin',(35.,-18.75,-11.75));
#1113=CARTESIAN_POINT('',(27.,-13.9875,-11.75));
#1114=CARTESIAN_POINT('',(27.0000000000001,-23.5125,-11.75));
#1115=CARTESIAN_POINT('Origin',(35.,-13.9875,-11.75));
#1116=CARTESIAN_POINT('',(27.0000000000001,-13.9875,-8.25));
#1117=CARTESIAN_POINT('Origin',(35.,-18.75,-8.25));
#1118=CARTESIAN_POINT('',(27.0000000000001,-23.5125,-8.25));
#1119=CARTESIAN_POINT('Origin',(35.0000000000001,-23.5125,-11.75));
#1120=UNCERTAINTY_MEASURE_WITH_UNIT(LENGTH_MEASURE(0.01),#1124,
'DISTANCE_ACCURACY_VALUE',
'Maximum model space distance between geometric entities at asserted c
onnectivities');
#1121=UNCERTAINTY_MEASURE_WITH_UNIT(LENGTH_MEASURE(1.E-6),#1124,
'DISTANCE_ACCURACY_VALUE',
'Maximum model space distance between geometric entities at asserted c
onnectivities');
#1122=(
GEOMETRIC_REPRESENTATION_CONTEXT(3)
GLOBAL_UNCERTAINTY_ASSIGNED_CONTEXT((#1120))
GLOBAL_UNIT_ASSIGNED_CONTEXT((#1124,#1127,#1125))
REPRESENTATION_CONTEXT('','3D')
);
#1123=(
GEOMETRIC_REPRESENTATION_CONTEXT(3)
GLOBAL_UNCERTAINTY_ASSIGNED_CONTEXT((#1121))
GLOBAL_UNIT_ASSIGNED_CONTEXT((#1124,#1127,#1125))
REPRESENTATION_CONTEXT('','3D')
);
#1124=(
LENGTH_UNIT()
NAMED_UNIT(*)
SI_UNIT(.MILLI.,.METRE.)
);
#1125=(
NAMED_UNIT(*)
SI_UNIT($,.STERADIAN.)
SOLID_ANGLE_UNIT()
);
#1126=DIMENSIONAL_EXPONENTS(0.,0.,0.,0.,0.,0.,0.);
#1127=(
CONVERSION_BASED_UNIT('degree',#1129)
NAMED_UNIT(#1126)
PLANE_ANGLE_UNIT()
);
#1128=(
NAMED_UNIT(*)
PLANE_ANGLE_UNIT()
SI_UNIT($,.RADIAN.)
);
#1129=PLANE_ANGLE_MEASURE_WITH_UNIT(PLANE_ANGLE_MEASURE(0.01745329252),
#1128);
#1130=SHAPE_DEFINITION_REPRESENTATION(#1131,#1132);
#1131=PRODUCT_DEFINITION_SHAPE('',$,#1134);
#1132=SHAPE_REPRESENTATION('',(#668),#1122);
#1133=PRODUCT_DEFINITION_CONTEXT('part definition',#1138,'design');
#1134=PRODUCT_DEFINITION('Pot Support','Pot Support',#1135,#1133);
#1135=PRODUCT_DEFINITION_FORMATION('',$,#1140);
#1136=PRODUCT_RELATED_PRODUCT_CATEGORY('Pot Support','Pot Support',(#1140));
#1137=APPLICATION_PROTOCOL_DEFINITION('international standard',
'automotive_design',2009,#1138);
#1138=APPLICATION_CONTEXT(
'Core Data for Automotive Mechanical Design Process');
#1139=PRODUCT_CONTEXT('part definition',#1138,'mechanical');
#1140=PRODUCT('Pot Support','Pot Support',$,(#1139));
#1141=PRESENTATION_STYLE_ASSIGNMENT((#1142));
#1142=SURFACE_STYLE_USAGE(.BOTH.,#1143);
#1143=SURFACE_SIDE_STYLE('',(#1144));
#1144=SURFACE_STYLE_FILL_AREA(#1145);
#1145=FILL_AREA_STYLE('',(#1146));
#1146=FILL_AREA_STYLE_COLOUR('',#1147);
#1147=COLOUR_RGB('',0.792156862745098,0.819607843137255,0.933333333333333);
ENDSEC;
END-ISO-10303-21;
