ISO-10303-21;
HEADER;
/* Generated by software containing ST-Developer
 * from STEP Tools, Inc. (www.steptools.com) 
 */

FILE_DESCRIPTION(
/* description */ (''),
/* implementation_level */ '2;1');

FILE_NAME(
/* name */ 
'C:\\Users\\kkruger\\OneDrive - Stellenbosch University\\Doseerwerk\\N
avorsing\\Studente\\Uitruilstudente\\Maier\\\\Support Motor _new_ipt_2
258bfa6.STEP',
/* time_stamp */ '2018-05-05T13:42:10+02:00',
/* author */ ('22480064'),
/* organization */ (''),
/* preprocessor_version */ 'ST-DEVELOPER v16.1',
/* originating_system */ 'Autodesk Inventor 2016',
/* authorisation */ '');

FILE_SCHEMA (('AUTOMOTIVE_DESIGN { 1 0 10303 214 3 1 1 }'));
ENDSEC;

DATA;
#10=MECHANICAL_DESIGN_GEOMETRIC_PRESENTATION_REPRESENTATION('',(#14,#17,
#20,#16,#15,#18,#19),#945);
#11=SHAPE_REPRESENTATION_RELATIONSHIP('SRR','None',#954,#12);
#12=ADVANCED_BREP_SHAPE_REPRESENTATION('',(#13),#944);
#13=MANIFOLD_SOLID_BREP('Solid1',#472);
#14=STYLED_ITEM('',(#964),#463);
#15=STYLED_ITEM('',(#964),#465);
#16=STYLED_ITEM('',(#964),#467);
#17=STYLED_ITEM('',(#964),#469);
#18=STYLED_ITEM('',(#964),#470);
#19=STYLED_ITEM('',(#964),#471);
#20=STYLED_ITEM('',(#963),#13);
#21=CONICAL_SURFACE('',#513,3.15,45.);
#22=CONICAL_SURFACE('',#514,3.15,45.);
#23=CONICAL_SURFACE('',#515,3.15,45.);
#24=CONICAL_SURFACE('',#516,3.15,45.);
#25=CONICAL_SURFACE('',#520,1.65,58.9999999999999);
#26=CONICAL_SURFACE('',#522,1.65,58.9999999999999);
#27=CONICAL_SURFACE('',#524,1.65,58.9999999999999);
#28=CONICAL_SURFACE('',#526,1.65,58.9999999999999);
#29=PLANE('',#493);
#30=PLANE('',#500);
#31=PLANE('',#504);
#32=PLANE('',#505);
#33=PLANE('',#510);
#34=PLANE('',#511);
#35=PLANE('',#512);
#36=PLANE('',#519);
#37=FACE_BOUND('',#100,.T.);
#38=FACE_BOUND('',#102,.T.);
#39=FACE_BOUND('',#104,.T.);
#40=FACE_BOUND('',#106,.T.);
#41=FACE_BOUND('',#108,.T.);
#42=FACE_BOUND('',#110,.T.);
#43=FACE_BOUND('',#111,.T.);
#44=FACE_BOUND('',#112,.T.);
#45=FACE_BOUND('',#113,.T.);
#46=FACE_BOUND('',#114,.T.);
#47=FACE_BOUND('',#115,.T.);
#48=FACE_BOUND('',#117,.T.);
#49=FACE_BOUND('',#118,.T.);
#50=FACE_BOUND('',#121,.T.);
#51=FACE_BOUND('',#122,.T.);
#52=FACE_BOUND('',#123,.T.);
#53=FACE_BOUND('',#124,.T.);
#54=FACE_BOUND('',#129,.T.);
#55=FACE_BOUND('',#131,.T.);
#56=FACE_BOUND('',#133,.T.);
#57=FACE_BOUND('',#135,.T.);
#58=FACE_BOUND('',#138,.T.);
#59=FACE_BOUND('',#139,.T.);
#60=FACE_BOUND('',#140,.T.);
#61=FACE_BOUND('',#141,.T.);
#62=FACE_BOUND('',#142,.T.);
#63=FACE_BOUND('',#145,.T.);
#64=FACE_BOUND('',#148,.T.);
#65=FACE_BOUND('',#151,.T.);
#66=FACE_BOUND('',#154,.T.);
#67=FACE_BOUND('',#156,.T.);
#68=FACE_BOUND('',#158,.T.);
#69=FACE_OUTER_BOUND('',#98,.T.);
#70=FACE_OUTER_BOUND('',#99,.T.);
#71=FACE_OUTER_BOUND('',#101,.T.);
#72=FACE_OUTER_BOUND('',#103,.T.);
#73=FACE_OUTER_BOUND('',#105,.T.);
#74=FACE_OUTER_BOUND('',#107,.T.);
#75=FACE_OUTER_BOUND('',#109,.T.);
#76=FACE_OUTER_BOUND('',#116,.T.);
#77=FACE_OUTER_BOUND('',#119,.T.);
#78=FACE_OUTER_BOUND('',#120,.T.);
#79=FACE_OUTER_BOUND('',#125,.T.);
#80=FACE_OUTER_BOUND('',#126,.T.);
#81=FACE_OUTER_BOUND('',#127,.T.);
#82=FACE_OUTER_BOUND('',#128,.T.);
#83=FACE_OUTER_BOUND('',#130,.T.);
#84=FACE_OUTER_BOUND('',#132,.T.);
#85=FACE_OUTER_BOUND('',#134,.T.);
#86=FACE_OUTER_BOUND('',#136,.T.);
#87=FACE_OUTER_BOUND('',#137,.T.);
#88=FACE_OUTER_BOUND('',#143,.T.);
#89=FACE_OUTER_BOUND('',#144,.T.);
#90=FACE_OUTER_BOUND('',#146,.T.);
#91=FACE_OUTER_BOUND('',#147,.T.);
#92=FACE_OUTER_BOUND('',#149,.T.);
#93=FACE_OUTER_BOUND('',#150,.T.);
#94=FACE_OUTER_BOUND('',#152,.T.);
#95=FACE_OUTER_BOUND('',#153,.T.);
#96=FACE_OUTER_BOUND('',#155,.T.);
#97=FACE_OUTER_BOUND('',#157,.T.);
#98=EDGE_LOOP('',(#326,#327,#328,#329,#330,#331));
#99=EDGE_LOOP('',(#332));
#100=EDGE_LOOP('',(#333));
#101=EDGE_LOOP('',(#334));
#102=EDGE_LOOP('',(#335));
#103=EDGE_LOOP('',(#336));
#104=EDGE_LOOP('',(#337));
#105=EDGE_LOOP('',(#338));
#106=EDGE_LOOP('',(#339));
#107=EDGE_LOOP('',(#340));
#108=EDGE_LOOP('',(#341));
#109=EDGE_LOOP('',(#342,#343,#344,#345,#346,#347,#348,#349));
#110=EDGE_LOOP('',(#350));
#111=EDGE_LOOP('',(#351));
#112=EDGE_LOOP('',(#352));
#113=EDGE_LOOP('',(#353));
#114=EDGE_LOOP('',(#354));
#115=EDGE_LOOP('',(#355));
#116=EDGE_LOOP('',(#356,#357,#358,#359,#360,#361));
#117=EDGE_LOOP('',(#362));
#118=EDGE_LOOP('',(#363));
#119=EDGE_LOOP('',(#364,#365,#366,#367));
#120=EDGE_LOOP('',(#368,#369,#370,#371));
#121=EDGE_LOOP('',(#372));
#122=EDGE_LOOP('',(#373));
#123=EDGE_LOOP('',(#374));
#124=EDGE_LOOP('',(#375));
#125=EDGE_LOOP('',(#376,#377,#378,#379));
#126=EDGE_LOOP('',(#380,#381,#382,#383,#384,#385));
#127=EDGE_LOOP('',(#386,#387,#388,#389,#390,#391));
#128=EDGE_LOOP('',(#392));
#129=EDGE_LOOP('',(#393));
#130=EDGE_LOOP('',(#394));
#131=EDGE_LOOP('',(#395));
#132=EDGE_LOOP('',(#396));
#133=EDGE_LOOP('',(#397,#398));
#134=EDGE_LOOP('',(#399));
#135=EDGE_LOOP('',(#400));
#136=EDGE_LOOP('',(#401,#402,#403,#404));
#137=EDGE_LOOP('',(#405,#406,#407,#408));
#138=EDGE_LOOP('',(#409));
#139=EDGE_LOOP('',(#410));
#140=EDGE_LOOP('',(#411));
#141=EDGE_LOOP('',(#412));
#142=EDGE_LOOP('',(#413));
#143=EDGE_LOOP('',(#414));
#144=EDGE_LOOP('',(#415));
#145=EDGE_LOOP('',(#416));
#146=EDGE_LOOP('',(#417));
#147=EDGE_LOOP('',(#418));
#148=EDGE_LOOP('',(#419));
#149=EDGE_LOOP('',(#420));
#150=EDGE_LOOP('',(#421));
#151=EDGE_LOOP('',(#422));
#152=EDGE_LOOP('',(#423));
#153=EDGE_LOOP('',(#424));
#154=EDGE_LOOP('',(#425));
#155=EDGE_LOOP('',(#426));
#156=EDGE_LOOP('',(#427));
#157=EDGE_LOOP('',(#428));
#158=EDGE_LOOP('',(#429));
#159=B_SPLINE_CURVE_WITH_KNOTS('',3,(#674,#675,#676,#677,#678,#679),
 .UNSPECIFIED.,.F.,.F.,(4,2,4),(-2.00153815904391,-1.89087084597361,-1.78020353290331),
 .UNSPECIFIED.);
#160=B_SPLINE_CURVE_WITH_KNOTS('',3,(#778,#779,#780,#781,#782,#783,#784,
#785,#786,#787,#788,#789,#790,#791,#792,#793,#794,#795,#796,#797,#798,#799,
#800,#801,#802,#803,#804,#805,#806,#807,#808,#809,#810,#811,#812,#813,#814,
#815),.UNSPECIFIED.,.T.,.F.,(4,2,2,2,2,2,2,2,2,2,2,2,2,2,2,2,2,2,4),(0.,
0.0900819497060585,0.180163899412117,0.262749958134171,0.304042987495198,
0.345336016856225,0.386629046217251,0.427922075578278,0.510508134300332,
0.60059008400639,0.690672033712449,0.745065069350843,0.799458104989238,
0.843422520571807,0.887386936154377,0.931351351736947,0.975315767319516,
1.02970880295791,1.08410183859631),.UNSPECIFIED.);
#161=B_SPLINE_CURVE_WITH_KNOTS('',3,(#819,#820,#821,#822,#823,#824,#825,
#826,#827,#828,#829,#830,#831,#832,#833,#834,#835,#836,#837,#838,#839,#840,
#841,#842,#843,#844,#845,#846,#847,#848,#849,#850,#851,#852,#853,#854,#855,
#856),.UNSPECIFIED.,.T.,.F.,(4,2,2,2,2,2,2,2,2,2,2,2,2,2,2,2,2,2,4),(0.,
0.0900819497060585,0.180163899412117,0.262749958134171,0.304042987495198,
0.345336016856225,0.386629046217251,0.427922075578278,0.510508134300332,
0.600590084006391,0.690672033712449,0.745065069350844,0.799458104989238,
0.843422520571808,0.887386936154377,0.931351351736947,0.975315767319516,
1.02970880295791,1.08410183859631),.UNSPECIFIED.);
#162=B_SPLINE_CURVE_WITH_KNOTS('',3,(#860,#861,#862,#863,#864,#865,#866,
#867,#868,#869,#870,#871,#872,#873,#874,#875,#876,#877,#878,#879,#880,#881,
#882,#883,#884,#885,#886,#887,#888,#889,#890,#891,#892,#893,#894,#895,#896,
#897),.UNSPECIFIED.,.T.,.F.,(4,2,2,2,2,2,2,2,2,2,2,2,2,2,2,2,2,2,4),(0.,
0.0900819497060587,0.180163899412117,0.262749958134171,0.304042987495198,
0.345336016856224,0.386629046217251,0.427922075578278,0.510508134300331,
0.60059008400639,0.690672033712449,0.745065069350843,0.799458104989237,
0.843422520571807,0.887386936154376,0.931351351736946,0.975315767319516,
1.02970880295791,1.0841018385963),.UNSPECIFIED.);
#163=B_SPLINE_CURVE_WITH_KNOTS('',3,(#901,#902,#903,#904,#905,#906,#907,
#908,#909,#910,#911,#912,#913,#914,#915,#916,#917,#918,#919,#920,#921,#922,
#923,#924,#925,#926,#927,#928,#929,#930,#931,#932,#933,#934,#935,#936,#937,
#938),.UNSPECIFIED.,.T.,.F.,(4,2,2,2,2,2,2,2,2,2,2,2,2,2,2,2,2,2,4),(0.,
0.0900819497060587,0.180163899412117,0.262749958134171,0.304042987495198,
0.345336016856224,0.386629046217251,0.427922075578278,0.510508134300331,
0.60059008400639,0.690672033712449,0.745065069350843,0.799458104989237,
0.843422520571807,0.887386936154376,0.931351351736946,0.975315767319516,
1.02970880295791,1.0841018385963),.UNSPECIFIED.);
#164=LINE('',#670,#184);
#165=LINE('',#682,#185);
#166=LINE('',#711,#186);
#167=LINE('',#713,#187);
#168=LINE('',#715,#188);
#169=LINE('',#717,#189);
#170=LINE('',#718,#190);
#171=LINE('',#732,#191);
#172=LINE('',#736,#192);
#173=LINE('',#738,#193);
#174=LINE('',#740,#194);
#175=LINE('',#741,#195);
#176=LINE('',#747,#196);
#177=LINE('',#748,#197);
#178=LINE('',#750,#198);
#179=LINE('',#760,#199);
#180=LINE('',#763,#200);
#181=LINE('',#764,#201);
#182=LINE('',#767,#202);
#183=LINE('',#768,#203);
#184=VECTOR('',#536,6.);
#185=VECTOR('',#541,6.);
#186=VECTOR('',#576,61.5623885849585);
#187=VECTOR('',#577,20.);
#188=VECTOR('',#578,75.);
#189=VECTOR('',#579,20.);
#190=VECTOR('',#580,61.5623885849584);
#191=VECTOR('',#593,57.3702606989757);
#192=VECTOR('',#596,57.3702606989757);
#193=VECTOR('',#597,20.);
#194=VECTOR('',#598,75.);
#195=VECTOR('',#599,20.);
#196=VECTOR('',#606,12.);
#197=VECTOR('',#607,12.);
#198=VECTOR('',#610,12.);
#199=VECTOR('',#621,12.);
#200=VECTOR('',#624,6.);
#201=VECTOR('',#625,4.19212788598274);
#202=VECTOR('',#628,4.19212788598282);
#203=VECTOR('',#629,6.);
#204=CIRCLE('',#475,16.);
#205=CIRCLE('',#476,16.);
#206=CIRCLE('',#477,16.);
#207=CIRCLE('',#479,8.5);
#208=CIRCLE('',#480,8.5);
#209=CIRCLE('',#482,1.7);
#210=CIRCLE('',#483,1.7);
#211=CIRCLE('',#485,1.7);
#212=CIRCLE('',#486,1.7);
#213=CIRCLE('',#488,1.7);
#214=CIRCLE('',#489,1.7);
#215=CIRCLE('',#491,1.7);
#216=CIRCLE('',#492,1.7);
#217=CIRCLE('',#494,3.15);
#218=CIRCLE('',#495,3.15);
#219=CIRCLE('',#496,3.15);
#220=CIRCLE('',#497,1.64999999999999);
#221=CIRCLE('',#498,1.64999999999999);
#222=CIRCLE('',#499,3.15);
#223=CIRCLE('',#501,16.25);
#224=CIRCLE('',#502,1.65);
#225=CIRCLE('',#503,1.65);
#226=CIRCLE('',#506,1.64999999999999);
#227=CIRCLE('',#507,1.64999999999999);
#228=CIRCLE('',#508,1.64999999999999);
#229=CIRCLE('',#509,1.64999999999999);
#230=CIRCLE('',#518,16.25);
#231=VERTEX_POINT('',#666);
#232=VERTEX_POINT('',#667);
#233=VERTEX_POINT('',#669);
#234=VERTEX_POINT('',#671);
#235=VERTEX_POINT('',#673);
#236=VERTEX_POINT('',#680);
#237=VERTEX_POINT('',#684);
#238=VERTEX_POINT('',#686);
#239=VERTEX_POINT('',#689);
#240=VERTEX_POINT('',#691);
#241=VERTEX_POINT('',#694);
#242=VERTEX_POINT('',#696);
#243=VERTEX_POINT('',#699);
#244=VERTEX_POINT('',#701);
#245=VERTEX_POINT('',#704);
#246=VERTEX_POINT('',#706);
#247=VERTEX_POINT('',#710);
#248=VERTEX_POINT('',#712);
#249=VERTEX_POINT('',#714);
#250=VERTEX_POINT('',#716);
#251=VERTEX_POINT('',#719);
#252=VERTEX_POINT('',#721);
#253=VERTEX_POINT('',#723);
#254=VERTEX_POINT('',#725);
#255=VERTEX_POINT('',#727);
#256=VERTEX_POINT('',#730);
#257=VERTEX_POINT('',#731);
#258=VERTEX_POINT('',#733);
#259=VERTEX_POINT('',#735);
#260=VERTEX_POINT('',#737);
#261=VERTEX_POINT('',#739);
#262=VERTEX_POINT('',#742);
#263=VERTEX_POINT('',#744);
#264=VERTEX_POINT('',#751);
#265=VERTEX_POINT('',#753);
#266=VERTEX_POINT('',#755);
#267=VERTEX_POINT('',#757);
#268=VERTEX_POINT('',#762);
#269=VERTEX_POINT('',#766);
#270=VERTEX_POINT('',#777);
#271=VERTEX_POINT('',#818);
#272=VERTEX_POINT('',#859);
#273=VERTEX_POINT('',#900);
#274=EDGE_CURVE('',#231,#232,#204,.T.);
#275=EDGE_CURVE('',#233,#231,#164,.T.);
#276=EDGE_CURVE('',#234,#233,#205,.T.);
#277=EDGE_CURVE('',#234,#235,#159,.T.);
#278=EDGE_CURVE('',#236,#235,#206,.T.);
#279=EDGE_CURVE('',#236,#232,#165,.T.);
#280=EDGE_CURVE('',#237,#237,#207,.T.);
#281=EDGE_CURVE('',#238,#238,#208,.T.);
#282=EDGE_CURVE('',#239,#239,#209,.T.);
#283=EDGE_CURVE('',#240,#240,#210,.F.);
#284=EDGE_CURVE('',#241,#241,#211,.T.);
#285=EDGE_CURVE('',#242,#242,#212,.F.);
#286=EDGE_CURVE('',#243,#243,#213,.T.);
#287=EDGE_CURVE('',#244,#244,#214,.F.);
#288=EDGE_CURVE('',#245,#245,#215,.T.);
#289=EDGE_CURVE('',#246,#246,#216,.F.);
#290=EDGE_CURVE('',#234,#235,#217,.T.);
#291=EDGE_CURVE('',#233,#247,#166,.T.);
#292=EDGE_CURVE('',#247,#248,#167,.T.);
#293=EDGE_CURVE('',#248,#249,#168,.T.);
#294=EDGE_CURVE('',#249,#250,#169,.T.);
#295=EDGE_CURVE('',#250,#236,#170,.T.);
#296=EDGE_CURVE('',#251,#251,#218,.T.);
#297=EDGE_CURVE('',#252,#252,#219,.T.);
#298=EDGE_CURVE('',#253,#253,#220,.T.);
#299=EDGE_CURVE('',#254,#254,#221,.T.);
#300=EDGE_CURVE('',#255,#255,#222,.T.);
#301=EDGE_CURVE('',#256,#257,#171,.T.);
#302=EDGE_CURVE('',#258,#256,#223,.T.);
#303=EDGE_CURVE('',#259,#258,#172,.T.);
#304=EDGE_CURVE('',#260,#259,#173,.T.);
#305=EDGE_CURVE('',#261,#260,#174,.T.);
#306=EDGE_CURVE('',#257,#261,#175,.T.);
#307=EDGE_CURVE('',#262,#262,#224,.T.);
#308=EDGE_CURVE('',#263,#263,#225,.T.);
#309=EDGE_CURVE('',#248,#261,#176,.T.);
#310=EDGE_CURVE('',#247,#257,#177,.T.);
#311=EDGE_CURVE('',#249,#260,#178,.T.);
#312=EDGE_CURVE('',#264,#264,#226,.T.);
#313=EDGE_CURVE('',#265,#265,#227,.T.);
#314=EDGE_CURVE('',#266,#266,#228,.T.);
#315=EDGE_CURVE('',#267,#267,#229,.T.);
#316=EDGE_CURVE('',#250,#259,#179,.T.);
#317=EDGE_CURVE('',#258,#268,#180,.F.);
#318=EDGE_CURVE('',#232,#268,#181,.T.);
#319=EDGE_CURVE('',#269,#231,#182,.T.);
#320=EDGE_CURVE('',#269,#256,#183,.T.);
#321=EDGE_CURVE('',#268,#269,#230,.T.);
#322=EDGE_CURVE('',#270,#270,#160,.T.);
#323=EDGE_CURVE('',#271,#271,#161,.T.);
#324=EDGE_CURVE('',#272,#272,#162,.T.);
#325=EDGE_CURVE('',#273,#273,#163,.T.);
#326=ORIENTED_EDGE('',*,*,#274,.F.);
#327=ORIENTED_EDGE('',*,*,#275,.F.);
#328=ORIENTED_EDGE('',*,*,#276,.F.);
#329=ORIENTED_EDGE('',*,*,#277,.T.);
#330=ORIENTED_EDGE('',*,*,#278,.F.);
#331=ORIENTED_EDGE('',*,*,#279,.T.);
#332=ORIENTED_EDGE('',*,*,#280,.T.);
#333=ORIENTED_EDGE('',*,*,#281,.T.);
#334=ORIENTED_EDGE('',*,*,#282,.T.);
#335=ORIENTED_EDGE('',*,*,#283,.F.);
#336=ORIENTED_EDGE('',*,*,#284,.T.);
#337=ORIENTED_EDGE('',*,*,#285,.F.);
#338=ORIENTED_EDGE('',*,*,#286,.T.);
#339=ORIENTED_EDGE('',*,*,#287,.F.);
#340=ORIENTED_EDGE('',*,*,#288,.T.);
#341=ORIENTED_EDGE('',*,*,#289,.F.);
#342=ORIENTED_EDGE('',*,*,#290,.F.);
#343=ORIENTED_EDGE('',*,*,#276,.T.);
#344=ORIENTED_EDGE('',*,*,#291,.T.);
#345=ORIENTED_EDGE('',*,*,#292,.T.);
#346=ORIENTED_EDGE('',*,*,#293,.T.);
#347=ORIENTED_EDGE('',*,*,#294,.T.);
#348=ORIENTED_EDGE('',*,*,#295,.T.);
#349=ORIENTED_EDGE('',*,*,#278,.T.);
#350=ORIENTED_EDGE('',*,*,#296,.F.);
#351=ORIENTED_EDGE('',*,*,#297,.F.);
#352=ORIENTED_EDGE('',*,*,#280,.F.);
#353=ORIENTED_EDGE('',*,*,#298,.F.);
#354=ORIENTED_EDGE('',*,*,#299,.F.);
#355=ORIENTED_EDGE('',*,*,#300,.F.);
#356=ORIENTED_EDGE('',*,*,#301,.F.);
#357=ORIENTED_EDGE('',*,*,#302,.F.);
#358=ORIENTED_EDGE('',*,*,#303,.F.);
#359=ORIENTED_EDGE('',*,*,#304,.F.);
#360=ORIENTED_EDGE('',*,*,#305,.F.);
#361=ORIENTED_EDGE('',*,*,#306,.F.);
#362=ORIENTED_EDGE('',*,*,#307,.T.);
#363=ORIENTED_EDGE('',*,*,#308,.T.);
#364=ORIENTED_EDGE('',*,*,#306,.T.);
#365=ORIENTED_EDGE('',*,*,#309,.F.);
#366=ORIENTED_EDGE('',*,*,#292,.F.);
#367=ORIENTED_EDGE('',*,*,#310,.T.);
#368=ORIENTED_EDGE('',*,*,#305,.T.);
#369=ORIENTED_EDGE('',*,*,#311,.F.);
#370=ORIENTED_EDGE('',*,*,#293,.F.);
#371=ORIENTED_EDGE('',*,*,#309,.T.);
#372=ORIENTED_EDGE('',*,*,#312,.F.);
#373=ORIENTED_EDGE('',*,*,#313,.F.);
#374=ORIENTED_EDGE('',*,*,#314,.F.);
#375=ORIENTED_EDGE('',*,*,#315,.F.);
#376=ORIENTED_EDGE('',*,*,#304,.T.);
#377=ORIENTED_EDGE('',*,*,#316,.F.);
#378=ORIENTED_EDGE('',*,*,#294,.F.);
#379=ORIENTED_EDGE('',*,*,#311,.T.);
#380=ORIENTED_EDGE('',*,*,#303,.T.);
#381=ORIENTED_EDGE('',*,*,#317,.T.);
#382=ORIENTED_EDGE('',*,*,#318,.F.);
#383=ORIENTED_EDGE('',*,*,#279,.F.);
#384=ORIENTED_EDGE('',*,*,#295,.F.);
#385=ORIENTED_EDGE('',*,*,#316,.T.);
#386=ORIENTED_EDGE('',*,*,#319,.F.);
#387=ORIENTED_EDGE('',*,*,#320,.T.);
#388=ORIENTED_EDGE('',*,*,#301,.T.);
#389=ORIENTED_EDGE('',*,*,#310,.F.);
#390=ORIENTED_EDGE('',*,*,#291,.F.);
#391=ORIENTED_EDGE('',*,*,#275,.T.);
#392=ORIENTED_EDGE('',*,*,#282,.F.);
#393=ORIENTED_EDGE('',*,*,#297,.T.);
#394=ORIENTED_EDGE('',*,*,#284,.F.);
#395=ORIENTED_EDGE('',*,*,#296,.T.);
#396=ORIENTED_EDGE('',*,*,#286,.F.);
#397=ORIENTED_EDGE('',*,*,#290,.T.);
#398=ORIENTED_EDGE('',*,*,#277,.F.);
#399=ORIENTED_EDGE('',*,*,#288,.F.);
#400=ORIENTED_EDGE('',*,*,#300,.T.);
#401=ORIENTED_EDGE('',*,*,#302,.T.);
#402=ORIENTED_EDGE('',*,*,#320,.F.);
#403=ORIENTED_EDGE('',*,*,#321,.F.);
#404=ORIENTED_EDGE('',*,*,#317,.F.);
#405=ORIENTED_EDGE('',*,*,#318,.T.);
#406=ORIENTED_EDGE('',*,*,#321,.T.);
#407=ORIENTED_EDGE('',*,*,#319,.T.);
#408=ORIENTED_EDGE('',*,*,#274,.T.);
#409=ORIENTED_EDGE('',*,*,#283,.T.);
#410=ORIENTED_EDGE('',*,*,#287,.T.);
#411=ORIENTED_EDGE('',*,*,#289,.T.);
#412=ORIENTED_EDGE('',*,*,#285,.T.);
#413=ORIENTED_EDGE('',*,*,#281,.F.);
#414=ORIENTED_EDGE('',*,*,#322,.T.);
#415=ORIENTED_EDGE('',*,*,#322,.F.);
#416=ORIENTED_EDGE('',*,*,#315,.T.);
#417=ORIENTED_EDGE('',*,*,#323,.T.);
#418=ORIENTED_EDGE('',*,*,#323,.F.);
#419=ORIENTED_EDGE('',*,*,#314,.T.);
#420=ORIENTED_EDGE('',*,*,#324,.T.);
#421=ORIENTED_EDGE('',*,*,#324,.F.);
#422=ORIENTED_EDGE('',*,*,#313,.T.);
#423=ORIENTED_EDGE('',*,*,#325,.T.);
#424=ORIENTED_EDGE('',*,*,#325,.F.);
#425=ORIENTED_EDGE('',*,*,#312,.T.);
#426=ORIENTED_EDGE('',*,*,#308,.F.);
#427=ORIENTED_EDGE('',*,*,#299,.T.);
#428=ORIENTED_EDGE('',*,*,#307,.F.);
#429=ORIENTED_EDGE('',*,*,#298,.T.);
#430=CYLINDRICAL_SURFACE('',#474,16.);
#431=CYLINDRICAL_SURFACE('',#478,8.5);
#432=CYLINDRICAL_SURFACE('',#481,1.7);
#433=CYLINDRICAL_SURFACE('',#484,1.7);
#434=CYLINDRICAL_SURFACE('',#487,1.7);
#435=CYLINDRICAL_SURFACE('',#490,1.7);
#436=CYLINDRICAL_SURFACE('',#517,16.25);
#437=CYLINDRICAL_SURFACE('',#521,1.64999999999999);
#438=CYLINDRICAL_SURFACE('',#523,1.64999999999999);
#439=CYLINDRICAL_SURFACE('',#525,1.64999999999999);
#440=CYLINDRICAL_SURFACE('',#527,1.64999999999999);
#441=CYLINDRICAL_SURFACE('',#528,1.64999999999999);
#442=CYLINDRICAL_SURFACE('',#529,1.64999999999999);
#443=ADVANCED_FACE('',(#69),#430,.T.);
#444=ADVANCED_FACE('',(#70,#37),#431,.F.);
#445=ADVANCED_FACE('',(#71,#38),#432,.F.);
#446=ADVANCED_FACE('',(#72,#39),#433,.F.);
#447=ADVANCED_FACE('',(#73,#40),#434,.F.);
#448=ADVANCED_FACE('',(#74,#41),#435,.F.);
#449=ADVANCED_FACE('',(#75,#42,#43,#44,#45,#46,#47),#29,.T.);
#450=ADVANCED_FACE('',(#76,#48,#49),#30,.F.);
#451=ADVANCED_FACE('',(#77),#31,.F.);
#452=ADVANCED_FACE('',(#78,#50,#51,#52,#53),#32,.F.);
#453=ADVANCED_FACE('',(#79),#33,.F.);
#454=ADVANCED_FACE('',(#80),#34,.F.);
#455=ADVANCED_FACE('',(#81),#35,.F.);
#456=ADVANCED_FACE('',(#82,#54),#21,.F.);
#457=ADVANCED_FACE('',(#83,#55),#22,.F.);
#458=ADVANCED_FACE('',(#84,#56),#23,.F.);
#459=ADVANCED_FACE('',(#85,#57),#24,.F.);
#460=ADVANCED_FACE('',(#86),#436,.F.);
#461=ADVANCED_FACE('',(#87,#58,#59,#60,#61,#62),#36,.T.);
#462=ADVANCED_FACE('',(#88),#25,.F.);
#463=ADVANCED_FACE('',(#89,#63),#437,.F.);
#464=ADVANCED_FACE('',(#90),#26,.F.);
#465=ADVANCED_FACE('',(#91,#64),#438,.F.);
#466=ADVANCED_FACE('',(#92),#27,.F.);
#467=ADVANCED_FACE('',(#93,#65),#439,.F.);
#468=ADVANCED_FACE('',(#94),#28,.F.);
#469=ADVANCED_FACE('',(#95,#66),#440,.F.);
#470=ADVANCED_FACE('',(#96,#67),#441,.F.);
#471=ADVANCED_FACE('',(#97,#68),#442,.F.);
#472=CLOSED_SHELL('',(#443,#444,#445,#446,#447,#448,#449,#450,#451,#452,
#453,#454,#455,#456,#457,#458,#459,#460,#461,#462,#463,#464,#465,#466,#467,
#468,#469,#470,#471));
#473=AXIS2_PLACEMENT_3D('placement',#664,#530,#531);
#474=AXIS2_PLACEMENT_3D('',#665,#532,#533);
#475=AXIS2_PLACEMENT_3D('',#668,#534,#535);
#476=AXIS2_PLACEMENT_3D('',#672,#537,#538);
#477=AXIS2_PLACEMENT_3D('',#681,#539,#540);
#478=AXIS2_PLACEMENT_3D('',#683,#542,#543);
#479=AXIS2_PLACEMENT_3D('',#685,#544,#545);
#480=AXIS2_PLACEMENT_3D('',#687,#546,#547);
#481=AXIS2_PLACEMENT_3D('',#688,#548,#549);
#482=AXIS2_PLACEMENT_3D('',#690,#550,#551);
#483=AXIS2_PLACEMENT_3D('',#692,#552,#553);
#484=AXIS2_PLACEMENT_3D('',#693,#554,#555);
#485=AXIS2_PLACEMENT_3D('',#695,#556,#557);
#486=AXIS2_PLACEMENT_3D('',#697,#558,#559);
#487=AXIS2_PLACEMENT_3D('',#698,#560,#561);
#488=AXIS2_PLACEMENT_3D('',#700,#562,#563);
#489=AXIS2_PLACEMENT_3D('',#702,#564,#565);
#490=AXIS2_PLACEMENT_3D('',#703,#566,#567);
#491=AXIS2_PLACEMENT_3D('',#705,#568,#569);
#492=AXIS2_PLACEMENT_3D('',#707,#570,#571);
#493=AXIS2_PLACEMENT_3D('',#708,#572,#573);
#494=AXIS2_PLACEMENT_3D('',#709,#574,#575);
#495=AXIS2_PLACEMENT_3D('',#720,#581,#582);
#496=AXIS2_PLACEMENT_3D('',#722,#583,#584);
#497=AXIS2_PLACEMENT_3D('',#724,#585,#586);
#498=AXIS2_PLACEMENT_3D('',#726,#587,#588);
#499=AXIS2_PLACEMENT_3D('',#728,#589,#590);
#500=AXIS2_PLACEMENT_3D('',#729,#591,#592);
#501=AXIS2_PLACEMENT_3D('',#734,#594,#595);
#502=AXIS2_PLACEMENT_3D('',#743,#600,#601);
#503=AXIS2_PLACEMENT_3D('',#745,#602,#603);
#504=AXIS2_PLACEMENT_3D('',#746,#604,#605);
#505=AXIS2_PLACEMENT_3D('',#749,#608,#609);
#506=AXIS2_PLACEMENT_3D('',#752,#611,#612);
#507=AXIS2_PLACEMENT_3D('',#754,#613,#614);
#508=AXIS2_PLACEMENT_3D('',#756,#615,#616);
#509=AXIS2_PLACEMENT_3D('',#758,#617,#618);
#510=AXIS2_PLACEMENT_3D('',#759,#619,#620);
#511=AXIS2_PLACEMENT_3D('',#761,#622,#623);
#512=AXIS2_PLACEMENT_3D('',#765,#626,#627);
#513=AXIS2_PLACEMENT_3D('',#769,#630,#631);
#514=AXIS2_PLACEMENT_3D('',#770,#632,#633);
#515=AXIS2_PLACEMENT_3D('',#771,#634,#635);
#516=AXIS2_PLACEMENT_3D('',#772,#636,#637);
#517=AXIS2_PLACEMENT_3D('',#773,#638,#639);
#518=AXIS2_PLACEMENT_3D('',#774,#640,#641);
#519=AXIS2_PLACEMENT_3D('',#775,#642,#643);
#520=AXIS2_PLACEMENT_3D('',#776,#644,#645);
#521=AXIS2_PLACEMENT_3D('',#816,#646,#647);
#522=AXIS2_PLACEMENT_3D('',#817,#648,#649);
#523=AXIS2_PLACEMENT_3D('',#857,#650,#651);
#524=AXIS2_PLACEMENT_3D('',#858,#652,#653);
#525=AXIS2_PLACEMENT_3D('',#898,#654,#655);
#526=AXIS2_PLACEMENT_3D('',#899,#656,#657);
#527=AXIS2_PLACEMENT_3D('',#939,#658,#659);
#528=AXIS2_PLACEMENT_3D('',#940,#660,#661);
#529=AXIS2_PLACEMENT_3D('',#941,#662,#663);
#530=DIRECTION('axis',(0.,0.,1.));
#531=DIRECTION('refdir',(1.,0.,0.));
#532=DIRECTION('center_axis',(0.,0.,-1.));
#533=DIRECTION('ref_axis',(-1.,0.,0.));
#534=DIRECTION('center_axis',(0.,0.,-1.));
#535=DIRECTION('ref_axis',(-1.,0.,0.));
#536=DIRECTION('',(0.,0.,-1.));
#537=DIRECTION('center_axis',(0.,0.,1.));
#538=DIRECTION('ref_axis',(1.,0.,0.));
#539=DIRECTION('center_axis',(0.,0.,1.));
#540=DIRECTION('ref_axis',(1.,0.,0.));
#541=DIRECTION('',(0.,0.,-1.));
#542=DIRECTION('center_axis',(0.,0.,-1.));
#543=DIRECTION('ref_axis',(-1.,0.,0.));
#544=DIRECTION('center_axis',(0.,0.,1.));
#545=DIRECTION('ref_axis',(1.,0.,0.));
#546=DIRECTION('center_axis',(0.,0.,-1.));
#547=DIRECTION('ref_axis',(-1.,0.,0.));
#548=DIRECTION('center_axis',(0.,0.,1.));
#549=DIRECTION('ref_axis',(1.,0.,0.));
#550=DIRECTION('center_axis',(0.,0.,1.));
#551=DIRECTION('ref_axis',(1.,0.,0.));
#552=DIRECTION('center_axis',(0.,0.,-1.));
#553=DIRECTION('ref_axis',(-1.,0.,0.));
#554=DIRECTION('center_axis',(0.,0.,1.));
#555=DIRECTION('ref_axis',(-3.49148133884313E-15,-1.,0.));
#556=DIRECTION('center_axis',(0.,0.,1.));
#557=DIRECTION('ref_axis',(-3.49148133884313E-15,-1.,0.));
#558=DIRECTION('center_axis',(0.,0.,-1.));
#559=DIRECTION('ref_axis',(-1.,0.,0.));
#560=DIRECTION('center_axis',(0.,0.,1.));
#561=DIRECTION('ref_axis',(-1.,0.,0.));
#562=DIRECTION('center_axis',(0.,0.,1.));
#563=DIRECTION('ref_axis',(-1.,0.,0.));
#564=DIRECTION('center_axis',(0.,0.,-1.));
#565=DIRECTION('ref_axis',(-1.,0.,0.));
#566=DIRECTION('center_axis',(0.,0.,1.));
#567=DIRECTION('ref_axis',(1.04744440165294E-14,1.,0.));
#568=DIRECTION('center_axis',(0.,0.,1.));
#569=DIRECTION('ref_axis',(1.04744440165294E-14,1.,0.));
#570=DIRECTION('center_axis',(0.,0.,-1.));
#571=DIRECTION('ref_axis',(-1.,0.,0.));
#572=DIRECTION('center_axis',(0.,0.,1.));
#573=DIRECTION('ref_axis',(1.,0.,0.));
#574=DIRECTION('center_axis',(0.,0.,1.));
#575=DIRECTION('ref_axis',(-1.,0.,0.));
#576=DIRECTION('',(-0.375823735530974,-0.926691167440126,0.));
#577=DIRECTION('',(0.,-1.,0.));
#578=DIRECTION('',(1.,0.,0.));
#579=DIRECTION('',(0.,1.,0.));
#580=DIRECTION('',(-0.375823735530974,0.926691167440126,0.));
#581=DIRECTION('center_axis',(0.,0.,1.));
#582=DIRECTION('ref_axis',(-3.49148133884313E-15,-1.,0.));
#583=DIRECTION('center_axis',(0.,0.,1.));
#584=DIRECTION('ref_axis',(1.,0.,0.));
#585=DIRECTION('center_axis',(0.,0.,1.));
#586=DIRECTION('ref_axis',(1.,0.,0.));
#587=DIRECTION('center_axis',(0.,0.,1.));
#588=DIRECTION('ref_axis',(1.,0.,0.));
#589=DIRECTION('center_axis',(0.,0.,1.));
#590=DIRECTION('ref_axis',(1.04744440165294E-14,1.,0.));
#591=DIRECTION('center_axis',(0.,0.,1.));
#592=DIRECTION('ref_axis',(1.,0.,0.));
#593=DIRECTION('',(-0.375823735530974,-0.926691167440126,0.));
#594=DIRECTION('center_axis',(0.,0.,-1.));
#595=DIRECTION('ref_axis',(-1.,0.,0.));
#596=DIRECTION('',(-0.375823735530974,0.926691167440126,0.));
#597=DIRECTION('',(0.,1.,0.));
#598=DIRECTION('',(1.,0.,0.));
#599=DIRECTION('',(0.,-1.,0.));
#600=DIRECTION('center_axis',(0.,0.,1.));
#601=DIRECTION('ref_axis',(1.,0.,0.));
#602=DIRECTION('center_axis',(0.,0.,1.));
#603=DIRECTION('ref_axis',(1.,0.,0.));
#604=DIRECTION('center_axis',(1.,0.,0.));
#605=DIRECTION('ref_axis',(0.,0.,-1.));
#606=DIRECTION('',(0.,0.,-1.));
#607=DIRECTION('',(0.,0.,-1.));
#608=DIRECTION('center_axis',(0.,1.,0.));
#609=DIRECTION('ref_axis',(0.,0.,1.));
#610=DIRECTION('',(0.,0.,-1.));
#611=DIRECTION('center_axis',(0.,-1.,0.));
#612=DIRECTION('ref_axis',(0.,0.,-1.));
#613=DIRECTION('center_axis',(0.,-1.,0.));
#614=DIRECTION('ref_axis',(0.,0.,-1.));
#615=DIRECTION('center_axis',(0.,-1.,0.));
#616=DIRECTION('ref_axis',(0.,0.,-1.));
#617=DIRECTION('center_axis',(0.,-1.,0.));
#618=DIRECTION('ref_axis',(0.,0.,-1.));
#619=DIRECTION('center_axis',(-1.,0.,0.));
#620=DIRECTION('ref_axis',(0.,0.,1.));
#621=DIRECTION('',(0.,0.,-1.));
#622=DIRECTION('center_axis',(-0.926691167440126,-0.375823735530974,0.));
#623=DIRECTION('ref_axis',(0.,0.,1.));
#624=DIRECTION('',(0.,0.,-1.));
#625=DIRECTION('',(0.375823735530974,-0.926691167440126,0.));
#626=DIRECTION('center_axis',(0.926691167440126,-0.375823735530974,0.));
#627=DIRECTION('ref_axis',(0.,0.,-1.));
#628=DIRECTION('',(0.375823735530974,0.926691167440126,0.));
#629=DIRECTION('',(0.,0.,-1.));
#630=DIRECTION('center_axis',(0.,0.,1.));
#631=DIRECTION('ref_axis',(1.,0.,0.));
#632=DIRECTION('center_axis',(0.,0.,1.));
#633=DIRECTION('ref_axis',(-3.49148133884313E-15,-1.,0.));
#634=DIRECTION('center_axis',(0.,0.,1.));
#635=DIRECTION('ref_axis',(-1.,0.,0.));
#636=DIRECTION('center_axis',(0.,0.,1.));
#637=DIRECTION('ref_axis',(1.04744440165294E-14,1.,0.));
#638=DIRECTION('center_axis',(0.,0.,-1.));
#639=DIRECTION('ref_axis',(-1.,0.,0.));
#640=DIRECTION('center_axis',(0.,0.,-1.));
#641=DIRECTION('ref_axis',(-1.,0.,0.));
#642=DIRECTION('center_axis',(0.,0.,-1.));
#643=DIRECTION('ref_axis',(-1.,0.,0.));
#644=DIRECTION('center_axis',(0.,-1.,0.));
#645=DIRECTION('ref_axis',(0.,0.,-1.));
#646=DIRECTION('center_axis',(0.,-1.,0.));
#647=DIRECTION('ref_axis',(0.,0.,-1.));
#648=DIRECTION('center_axis',(0.,-1.,0.));
#649=DIRECTION('ref_axis',(0.,0.,-1.));
#650=DIRECTION('center_axis',(0.,-1.,0.));
#651=DIRECTION('ref_axis',(0.,0.,-1.));
#652=DIRECTION('center_axis',(0.,-1.,0.));
#653=DIRECTION('ref_axis',(0.,0.,-1.));
#654=DIRECTION('center_axis',(0.,-1.,0.));
#655=DIRECTION('ref_axis',(0.,0.,-1.));
#656=DIRECTION('center_axis',(0.,-1.,0.));
#657=DIRECTION('ref_axis',(0.,0.,-1.));
#658=DIRECTION('center_axis',(0.,-1.,0.));
#659=DIRECTION('ref_axis',(0.,0.,-1.));
#660=DIRECTION('center_axis',(0.,0.,1.));
#661=DIRECTION('ref_axis',(1.,0.,0.));
#662=DIRECTION('center_axis',(0.,0.,1.));
#663=DIRECTION('ref_axis',(1.,0.,0.));
#664=CARTESIAN_POINT('',(0.,0.,0.));
#665=CARTESIAN_POINT('Origin',(0.,0.,12.));
#666=CARTESIAN_POINT('',(-14.3633931537915,7.04932174819788,6.));
#667=CARTESIAN_POINT('',(14.3633931537915,7.04932174819785,6.));
#668=CARTESIAN_POINT('Origin',(0.,0.,6.));
#669=CARTESIAN_POINT('',(-14.3633931537915,7.04932174819789,12.));
#670=CARTESIAN_POINT('',(-14.3633931537915,7.04932174819789,12.));
#671=CARTESIAN_POINT('',(-1.06495339353392,15.9645192307692,12.));
#672=CARTESIAN_POINT('Origin',(0.,0.,12.));
#673=CARTESIAN_POINT('',(1.06495339353392,15.9645192307692,12.));
#674=CARTESIAN_POINT('Ctrl Pts',(-1.06495339353392,15.9645192307692,12.));
#675=CARTESIAN_POINT('Ctrl Pts',(-0.722078198560084,15.9873915827122,11.9056061665847));
#676=CARTESIAN_POINT('Ctrl Pts',(-0.368891043567657,16.,11.85));
#677=CARTESIAN_POINT('Ctrl Pts',(0.368891043567658,16.,11.85));
#678=CARTESIAN_POINT('Ctrl Pts',(0.722078198560081,15.9873915827122,11.9056061665847));
#679=CARTESIAN_POINT('Ctrl Pts',(1.06495339353392,15.9645192307692,12.));
#680=CARTESIAN_POINT('',(14.3633931537915,7.04932174819785,12.));
#681=CARTESIAN_POINT('Origin',(0.,0.,12.));
#682=CARTESIAN_POINT('',(14.3633931537915,7.04932174819785,12.));
#683=CARTESIAN_POINT('Origin',(0.,0.,12.));
#684=CARTESIAN_POINT('',(8.5,0.,12.));
#685=CARTESIAN_POINT('Origin',(0.,0.,12.));
#686=CARTESIAN_POINT('',(-8.5,0.,6.));
#687=CARTESIAN_POINT('Origin',(0.,0.,6.));
#688=CARTESIAN_POINT('Origin',(0.,-13.,12.));
#689=CARTESIAN_POINT('',(1.7,-13.,10.55));
#690=CARTESIAN_POINT('Origin',(0.,-13.,10.55));
#691=CARTESIAN_POINT('',(-1.7,-13.,6.));
#692=CARTESIAN_POINT('Origin',(0.,-13.,6.));
#693=CARTESIAN_POINT('Origin',(-13.,4.53892574049607E-14,12.));
#694=CARTESIAN_POINT('',(-13.,-1.69999999999995,10.55));
#695=CARTESIAN_POINT('Origin',(-13.,4.53892574049607E-14,10.55));
#696=CARTESIAN_POINT('',(-14.7,4.53892574049607E-14,6.));
#697=CARTESIAN_POINT('Origin',(-13.,4.53892574049607E-14,6.));
#698=CARTESIAN_POINT('Origin',(0.,13.,12.));
#699=CARTESIAN_POINT('',(-1.7,13.,10.55));
#700=CARTESIAN_POINT('Origin',(0.,13.,10.55));
#701=CARTESIAN_POINT('',(-1.7,13.,6.));
#702=CARTESIAN_POINT('Origin',(0.,13.,6.));
#703=CARTESIAN_POINT('Origin',(13.,-1.36167772214882E-13,12.));
#704=CARTESIAN_POINT('',(13.,1.69999999999986,10.55));
#705=CARTESIAN_POINT('Origin',(13.,-1.36167772214882E-13,10.55));
#706=CARTESIAN_POINT('',(11.3,-1.36167772214882E-13,6.));
#707=CARTESIAN_POINT('Origin',(13.,-1.36167772214882E-13,6.));
#708=CARTESIAN_POINT('Origin',(0.,0.,12.));
#709=CARTESIAN_POINT('Origin',(0.,13.,12.));
#710=CARTESIAN_POINT('',(-37.5,-50.,12.));
#711=CARTESIAN_POINT('',(-14.3633931537915,7.04932174819789,12.));
#712=CARTESIAN_POINT('',(-37.5,-70.,12.));
#713=CARTESIAN_POINT('',(-37.5,-50.,12.));
#714=CARTESIAN_POINT('',(37.5,-70.,12.));
#715=CARTESIAN_POINT('',(-37.5,-70.,12.));
#716=CARTESIAN_POINT('',(37.5,-50.,12.));
#717=CARTESIAN_POINT('',(37.5,-70.,12.));
#718=CARTESIAN_POINT('',(37.5,-50.,12.));
#719=CARTESIAN_POINT('',(-13.,-3.14999999999995,12.));
#720=CARTESIAN_POINT('Origin',(-13.,4.53892574049607E-14,12.));
#721=CARTESIAN_POINT('',(3.15,-13.,12.));
#722=CARTESIAN_POINT('Origin',(0.,-13.,12.));
#723=CARTESIAN_POINT('',(7.14999999999999,-25.,12.));
#724=CARTESIAN_POINT('Origin',(5.50000000000001,-25.,12.));
#725=CARTESIAN_POINT('',(-3.85000000000002,-25.,12.));
#726=CARTESIAN_POINT('Origin',(-5.50000000000001,-25.,12.));
#727=CARTESIAN_POINT('',(13.,3.14999999999986,12.));
#728=CARTESIAN_POINT('Origin',(13.,-1.36167772214882E-13,12.));
#729=CARTESIAN_POINT('Origin',(0.,0.,0.));
#730=CARTESIAN_POINT('',(-15.9388943157251,3.16451386347816,0.));
#731=CARTESIAN_POINT('',(-37.5,-50.,0.));
#732=CARTESIAN_POINT('',(-15.9388943157251,3.16451386347816,0.));
#733=CARTESIAN_POINT('',(15.9388943157251,3.16451386347819,0.));
#734=CARTESIAN_POINT('Origin',(0.,0.,0.));
#735=CARTESIAN_POINT('',(37.5,-50.,0.));
#736=CARTESIAN_POINT('',(37.5,-50.,0.));
#737=CARTESIAN_POINT('',(37.5,-70.,0.));
#738=CARTESIAN_POINT('',(37.5,-70.,0.));
#739=CARTESIAN_POINT('',(-37.5,-70.,0.));
#740=CARTESIAN_POINT('',(-37.5,-70.,0.));
#741=CARTESIAN_POINT('',(-37.5,-50.,0.));
#742=CARTESIAN_POINT('',(7.15,-25.,0.));
#743=CARTESIAN_POINT('Origin',(5.50000000000001,-25.,0.));
#744=CARTESIAN_POINT('',(-3.85000000000001,-25.,0.));
#745=CARTESIAN_POINT('Origin',(-5.50000000000001,-25.,0.));
#746=CARTESIAN_POINT('Origin',(-37.5,-50.,12.));
#747=CARTESIAN_POINT('',(-37.5,-70.,12.));
#748=CARTESIAN_POINT('',(-37.5,-50.,12.));
#749=CARTESIAN_POINT('Origin',(-37.5,-70.,12.));
#750=CARTESIAN_POINT('',(37.5,-70.,12.));
#751=CARTESIAN_POINT('',(-27.5,-70.,2.35000000000001));
#752=CARTESIAN_POINT('Origin',(-27.5,-70.,4.));
#753=CARTESIAN_POINT('',(27.5,-70.,2.35000000000001));
#754=CARTESIAN_POINT('Origin',(27.5,-70.,4.));
#755=CARTESIAN_POINT('',(-12.5,-70.,6.35000000000001));
#756=CARTESIAN_POINT('Origin',(-12.5,-70.,8.));
#757=CARTESIAN_POINT('',(12.5,-70.,6.35000000000001));
#758=CARTESIAN_POINT('Origin',(12.5,-70.,8.));
#759=CARTESIAN_POINT('Origin',(37.5,-50.,12.));
#760=CARTESIAN_POINT('',(37.5,-50.,12.));
#761=CARTESIAN_POINT('Origin',(14.3633931537915,7.04932174819785,12.));
#762=CARTESIAN_POINT('',(15.9388943157251,3.16451386347819,6.));
#763=CARTESIAN_POINT('',(15.9388943157251,3.16451386347819,6.));
#764=CARTESIAN_POINT('',(14.3633931537915,7.04932174819785,6.));
#765=CARTESIAN_POINT('Origin',(-37.5,-50.,12.));
#766=CARTESIAN_POINT('',(-15.9388943157251,3.16451386347816,6.));
#767=CARTESIAN_POINT('',(-15.9388943157251,3.16451386347816,6.));
#768=CARTESIAN_POINT('',(-15.9388943157251,3.16451386347812,6.));
#769=CARTESIAN_POINT('Origin',(0.,-13.,12.));
#770=CARTESIAN_POINT('Origin',(-13.,4.53892574049607E-14,12.));
#771=CARTESIAN_POINT('Origin',(0.,13.,12.));
#772=CARTESIAN_POINT('Origin',(13.,-1.36167772214882E-13,12.));
#773=CARTESIAN_POINT('Origin',(0.,0.,6.));
#774=CARTESIAN_POINT('Origin',(0.,0.,6.));
#775=CARTESIAN_POINT('Origin',(0.,0.,6.));
#776=CARTESIAN_POINT('Origin',(12.5,-54.5,4.));
#777=CARTESIAN_POINT('',(14.0030800409077,-55.6980141697021,7.31937500000001));
#778=CARTESIAN_POINT('Ctrl Pts',(14.0030800409077,-55.6980141697021,7.31937500000001));
#779=CARTESIAN_POINT('Ctrl Pts',(14.109251080706,-55.8526662829046,7.55384121978816));
#780=CARTESIAN_POINT('Ctrl Pts',(14.1644048095996,-56.0164966999719,7.82952451289979));
#781=CARTESIAN_POINT('Ctrl Pts',(14.1287672731366,-56.3169990179363,8.38264907994632));
#782=CARTESIAN_POINT('Ctrl Pts',(14.0378951774146,-56.4542969238538,8.65974481506522));
#783=CARTESIAN_POINT('Ctrl Pts',(13.7479676923819,-56.6666989817217,9.10929655310586));
#784=CARTESIAN_POINT('Ctrl Pts',(13.5447290960296,-56.7548296932736,9.30708111304221));
#785=CARTESIAN_POINT('Ctrl Pts',(13.179914664558,-56.8434112663438,9.50982480675331));
#786=CARTESIAN_POINT('Ctrl Pts',(13.0485539509606,-56.8660182674559,9.56243457070638));
#787=CARTESIAN_POINT('Ctrl Pts',(12.7774193427446,-56.8960358331053,9.63252522877112));
#788=CARTESIAN_POINT('Ctrl Pts',(12.6376434312034,-56.9034424761103,9.65));
#789=CARTESIAN_POINT('Ctrl Pts',(12.3623565687966,-56.9034424761103,9.65));
#790=CARTESIAN_POINT('Ctrl Pts',(12.2225806572554,-56.8960358331053,9.63252522877112));
#791=CARTESIAN_POINT('Ctrl Pts',(11.9514460490394,-56.8660182674559,9.56243457070638));
#792=CARTESIAN_POINT('Ctrl Pts',(11.820085335442,-56.8434112663438,9.50982480675331));
#793=CARTESIAN_POINT('Ctrl Pts',(11.4552709039704,-56.7548296932736,9.30708111304221));
#794=CARTESIAN_POINT('Ctrl Pts',(11.2520323076181,-56.6666989817217,9.10929655310586));
#795=CARTESIAN_POINT('Ctrl Pts',(10.9621048225854,-56.4542969238538,8.65974481506522));
#796=CARTESIAN_POINT('Ctrl Pts',(10.8712327268634,-56.3169990179363,8.38264907994632));
#797=CARTESIAN_POINT('Ctrl Pts',(10.8355951904004,-56.0164966999719,7.82952451289979));
#798=CARTESIAN_POINT('Ctrl Pts',(10.890748919294,-55.8526662829046,7.55384121978816));
#799=CARTESIAN_POINT('Ctrl Pts',(11.0610278649532,-55.6046325551564,7.17780025066841));
#800=CARTESIAN_POINT('Ctrl Pts',(11.1518114451451,-55.5029958900746,7.03361682031227));
#801=CARTESIAN_POINT('Ctrl Pts',(11.3776443694633,-55.3088931075021,6.77859630066389));
#802=CARTESIAN_POINT('Ctrl Pts',(11.5127008744468,-55.216508545543,6.6677034882227));
#803=CARTESIAN_POINT('Ctrl Pts',(11.7691470620212,-55.0811922035456,6.51468120035023));
#804=CARTESIAN_POINT('Ctrl Pts',(11.9056030464807,-55.0231315180094,6.45332415523406));
#805=CARTESIAN_POINT('Ctrl Pts',(12.1975914645905,-54.9423574942902,6.37087044848812));
#806=CARTESIAN_POINT('Ctrl Pts',(12.3534519480581,-54.9206024333193,6.35000000000001));
#807=CARTESIAN_POINT('Ctrl Pts',(12.6465480519419,-54.9206024333193,6.35000000000001));
#808=CARTESIAN_POINT('Ctrl Pts',(12.8024085354095,-54.9423574942902,6.37087044848812));
#809=CARTESIAN_POINT('Ctrl Pts',(13.0943969535193,-55.0231315180094,6.45332415523406));
#810=CARTESIAN_POINT('Ctrl Pts',(13.2308529379788,-55.0811922035456,6.51468120035023));
#811=CARTESIAN_POINT('Ctrl Pts',(13.4872991255532,-55.216508545543,6.6677034882227));
#812=CARTESIAN_POINT('Ctrl Pts',(13.6223556305367,-55.3088931075021,6.77859630066389));
#813=CARTESIAN_POINT('Ctrl Pts',(13.8481885548549,-55.5029958900746,7.03361682031226));
#814=CARTESIAN_POINT('Ctrl Pts',(13.9389721350468,-55.6046325551564,7.17780025066841));
#815=CARTESIAN_POINT('Ctrl Pts',(14.0030800409077,-55.6980141697021,7.31937500000001));
#816=CARTESIAN_POINT('Origin',(12.5,-70.,8.));
#817=CARTESIAN_POINT('Origin',(-12.5,-54.5,4.));
#818=CARTESIAN_POINT('',(-10.9969199590923,-55.6980141697021,7.31937500000001));
#819=CARTESIAN_POINT('Ctrl Pts',(-10.9969199590923,-55.6980141697021,7.31937500000001));
#820=CARTESIAN_POINT('Ctrl Pts',(-10.890748919294,-55.8526662829046,7.55384121978816));
#821=CARTESIAN_POINT('Ctrl Pts',(-10.8355951904004,-56.0164966999719,7.82952451289979));
#822=CARTESIAN_POINT('Ctrl Pts',(-10.8712327268634,-56.3169990179363,8.38264907994632));
#823=CARTESIAN_POINT('Ctrl Pts',(-10.9621048225854,-56.4542969238538,8.65974481506522));
#824=CARTESIAN_POINT('Ctrl Pts',(-11.252032307618,-56.6666989817217,9.10929655310586));
#825=CARTESIAN_POINT('Ctrl Pts',(-11.4552709039704,-56.7548296932736,9.30708111304221));
#826=CARTESIAN_POINT('Ctrl Pts',(-11.820085335442,-56.8434112663438,9.50982480675331));
#827=CARTESIAN_POINT('Ctrl Pts',(-11.9514460490394,-56.8660182674559,9.56243457070638));
#828=CARTESIAN_POINT('Ctrl Pts',(-12.2225806572554,-56.8960358331053,9.63252522877112));
#829=CARTESIAN_POINT('Ctrl Pts',(-12.3623565687966,-56.9034424761103,9.65));
#830=CARTESIAN_POINT('Ctrl Pts',(-12.6376434312034,-56.9034424761103,9.65));
#831=CARTESIAN_POINT('Ctrl Pts',(-12.7774193427446,-56.8960358331053,9.63252522877112));
#832=CARTESIAN_POINT('Ctrl Pts',(-13.0485539509606,-56.8660182674559,9.56243457070638));
#833=CARTESIAN_POINT('Ctrl Pts',(-13.179914664558,-56.8434112663438,9.50982480675331));
#834=CARTESIAN_POINT('Ctrl Pts',(-13.5447290960296,-56.7548296932736,9.30708111304221));
#835=CARTESIAN_POINT('Ctrl Pts',(-13.7479676923819,-56.6666989817217,9.10929655310586));
#836=CARTESIAN_POINT('Ctrl Pts',(-14.0378951774146,-56.4542969238538,8.65974481506522));
#837=CARTESIAN_POINT('Ctrl Pts',(-14.1287672731366,-56.3169990179363,8.38264907994632));
#838=CARTESIAN_POINT('Ctrl Pts',(-14.1644048095996,-56.0164966999719,7.82952451289979));
#839=CARTESIAN_POINT('Ctrl Pts',(-14.109251080706,-55.8526662829046,7.55384121978816));
#840=CARTESIAN_POINT('Ctrl Pts',(-13.9389721350468,-55.6046325551564,7.17780025066841));
#841=CARTESIAN_POINT('Ctrl Pts',(-13.8481885548549,-55.5029958900746,7.03361682031226));
#842=CARTESIAN_POINT('Ctrl Pts',(-13.6223556305367,-55.3088931075021,6.77859630066389));
#843=CARTESIAN_POINT('Ctrl Pts',(-13.4872991255532,-55.216508545543,6.66770348822271));
#844=CARTESIAN_POINT('Ctrl Pts',(-13.2308529379788,-55.0811922035456,6.51468120035023));
#845=CARTESIAN_POINT('Ctrl Pts',(-13.0943969535193,-55.0231315180094,6.45332415523406));
#846=CARTESIAN_POINT('Ctrl Pts',(-12.8024085354095,-54.9423574942902,6.37087044848812));
#847=CARTESIAN_POINT('Ctrl Pts',(-12.6465480519419,-54.9206024333193,6.35000000000001));
#848=CARTESIAN_POINT('Ctrl Pts',(-12.3534519480581,-54.9206024333193,6.35000000000001));
#849=CARTESIAN_POINT('Ctrl Pts',(-12.1975914645905,-54.9423574942902,6.37087044848812));
#850=CARTESIAN_POINT('Ctrl Pts',(-11.9056030464807,-55.0231315180094,6.45332415523406));
#851=CARTESIAN_POINT('Ctrl Pts',(-11.7691470620212,-55.0811922035456,6.51468120035023));
#852=CARTESIAN_POINT('Ctrl Pts',(-11.5127008744468,-55.216508545543,6.6677034882227));
#853=CARTESIAN_POINT('Ctrl Pts',(-11.3776443694633,-55.3088931075021,6.77859630066389));
#854=CARTESIAN_POINT('Ctrl Pts',(-11.1518114451451,-55.5029958900746,7.03361682031227));
#855=CARTESIAN_POINT('Ctrl Pts',(-11.0610278649532,-55.6046325551564,7.17780025066841));
#856=CARTESIAN_POINT('Ctrl Pts',(-10.9969199590923,-55.6980141697021,7.31937500000001));
#857=CARTESIAN_POINT('Origin',(-12.5,-70.,8.));
#858=CARTESIAN_POINT('Origin',(27.5,-54.5,8.));
#859=CARTESIAN_POINT('',(25.9969199590923,-55.6980141697021,4.680625));
#860=CARTESIAN_POINT('Ctrl Pts',(25.9969199590923,-55.6980141697021,4.680625));
#861=CARTESIAN_POINT('Ctrl Pts',(25.890748919294,-55.8526662829046,4.44615878021185));
#862=CARTESIAN_POINT('Ctrl Pts',(25.8355951904004,-56.0164966999719,4.17047548710021));
#863=CARTESIAN_POINT('Ctrl Pts',(25.8712327268634,-56.3169990179363,3.61735092005368));
#864=CARTESIAN_POINT('Ctrl Pts',(25.9621048225854,-56.4542969238538,3.34025518493478));
#865=CARTESIAN_POINT('Ctrl Pts',(26.2520323076181,-56.6666989817217,2.89070344689415));
#866=CARTESIAN_POINT('Ctrl Pts',(26.4552709039705,-56.7548296932736,2.6929188869578));
#867=CARTESIAN_POINT('Ctrl Pts',(26.820085335442,-56.8434112663438,2.49017519324669));
#868=CARTESIAN_POINT('Ctrl Pts',(26.9514460490394,-56.8660182674559,2.43756542929363));
#869=CARTESIAN_POINT('Ctrl Pts',(27.2225806572554,-56.8960358331053,2.36747477122888));
#870=CARTESIAN_POINT('Ctrl Pts',(27.3623565687966,-56.9034424761103,2.35000000000001));
#871=CARTESIAN_POINT('Ctrl Pts',(27.6376434312034,-56.9034424761103,2.35000000000001));
#872=CARTESIAN_POINT('Ctrl Pts',(27.7774193427446,-56.8960358331053,2.36747477122888));
#873=CARTESIAN_POINT('Ctrl Pts',(28.0485539509606,-56.8660182674559,2.43756542929362));
#874=CARTESIAN_POINT('Ctrl Pts',(28.179914664558,-56.8434112663439,2.49017519324669));
#875=CARTESIAN_POINT('Ctrl Pts',(28.5447290960296,-56.7548296932737,2.69291888695779));
#876=CARTESIAN_POINT('Ctrl Pts',(28.7479676923819,-56.6666989817217,2.89070344689415));
#877=CARTESIAN_POINT('Ctrl Pts',(29.0378951774146,-56.4542969238538,3.34025518493478));
#878=CARTESIAN_POINT('Ctrl Pts',(29.1287672731366,-56.3169990179363,3.61735092005368));
#879=CARTESIAN_POINT('Ctrl Pts',(29.1644048095996,-56.0164966999719,4.17047548710021));
#880=CARTESIAN_POINT('Ctrl Pts',(29.109251080706,-55.8526662829046,4.44615878021184));
#881=CARTESIAN_POINT('Ctrl Pts',(28.9389721350468,-55.6046325551564,4.82219974933159));
#882=CARTESIAN_POINT('Ctrl Pts',(28.8481885548549,-55.5029958900746,4.96638317968774));
#883=CARTESIAN_POINT('Ctrl Pts',(28.6223556305367,-55.3088931075021,5.22140369933611));
#884=CARTESIAN_POINT('Ctrl Pts',(28.4872991255532,-55.216508545543,5.33229651177729));
#885=CARTESIAN_POINT('Ctrl Pts',(28.2308529379788,-55.0811922035456,5.48531879964977));
#886=CARTESIAN_POINT('Ctrl Pts',(28.0943969535193,-55.0231315180094,5.54667584476594));
#887=CARTESIAN_POINT('Ctrl Pts',(27.8024085354095,-54.9423574942902,5.62912955151189));
#888=CARTESIAN_POINT('Ctrl Pts',(27.6465480519419,-54.9206024333193,5.64999999999999));
#889=CARTESIAN_POINT('Ctrl Pts',(27.3534519480581,-54.9206024333193,5.64999999999999));
#890=CARTESIAN_POINT('Ctrl Pts',(27.1975914645905,-54.9423574942902,5.62912955151189));
#891=CARTESIAN_POINT('Ctrl Pts',(26.9056030464808,-55.0231315180093,5.54667584476594));
#892=CARTESIAN_POINT('Ctrl Pts',(26.7691470620212,-55.0811922035456,5.48531879964977));
#893=CARTESIAN_POINT('Ctrl Pts',(26.5127008744468,-55.216508545543,5.3322965117773));
#894=CARTESIAN_POINT('Ctrl Pts',(26.3776443694633,-55.3088931075021,5.22140369933611));
#895=CARTESIAN_POINT('Ctrl Pts',(26.1518114451451,-55.5029958900747,4.96638317968773));
#896=CARTESIAN_POINT('Ctrl Pts',(26.0610278649532,-55.6046325551564,4.82219974933159));
#897=CARTESIAN_POINT('Ctrl Pts',(25.9969199590923,-55.6980141697021,4.680625));
#898=CARTESIAN_POINT('Origin',(27.5,-70.,4.));
#899=CARTESIAN_POINT('Origin',(-27.5,-54.5,8.));
#900=CARTESIAN_POINT('',(-29.0030800409077,-55.6980141697021,4.680625));
#901=CARTESIAN_POINT('Ctrl Pts',(-29.0030800409077,-55.6980141697021,4.680625));
#902=CARTESIAN_POINT('Ctrl Pts',(-29.109251080706,-55.8526662829046,4.44615878021185));
#903=CARTESIAN_POINT('Ctrl Pts',(-29.1644048095996,-56.0164966999719,4.17047548710021));
#904=CARTESIAN_POINT('Ctrl Pts',(-29.1287672731366,-56.3169990179363,3.61735092005368));
#905=CARTESIAN_POINT('Ctrl Pts',(-29.0378951774146,-56.4542969238538,3.34025518493478));
#906=CARTESIAN_POINT('Ctrl Pts',(-28.7479676923819,-56.6666989817217,2.89070344689415));
#907=CARTESIAN_POINT('Ctrl Pts',(-28.5447290960295,-56.7548296932736,2.6929188869578));
#908=CARTESIAN_POINT('Ctrl Pts',(-28.179914664558,-56.8434112663438,2.49017519324669));
#909=CARTESIAN_POINT('Ctrl Pts',(-28.0485539509606,-56.8660182674559,2.43756542929363));
#910=CARTESIAN_POINT('Ctrl Pts',(-27.7774193427446,-56.8960358331053,2.36747477122888));
#911=CARTESIAN_POINT('Ctrl Pts',(-27.6376434312034,-56.9034424761103,2.35000000000001));
#912=CARTESIAN_POINT('Ctrl Pts',(-27.3623565687966,-56.9034424761103,2.35000000000001));
#913=CARTESIAN_POINT('Ctrl Pts',(-27.2225806572554,-56.8960358331053,2.36747477122888));
#914=CARTESIAN_POINT('Ctrl Pts',(-26.9514460490394,-56.8660182674559,2.43756542929362));
#915=CARTESIAN_POINT('Ctrl Pts',(-26.820085335442,-56.8434112663439,2.49017519324669));
#916=CARTESIAN_POINT('Ctrl Pts',(-26.4552709039704,-56.7548296932737,2.69291888695779));
#917=CARTESIAN_POINT('Ctrl Pts',(-26.2520323076181,-56.6666989817217,2.89070344689415));
#918=CARTESIAN_POINT('Ctrl Pts',(-25.9621048225854,-56.4542969238538,3.34025518493478));
#919=CARTESIAN_POINT('Ctrl Pts',(-25.8712327268634,-56.3169990179363,3.61735092005368));
#920=CARTESIAN_POINT('Ctrl Pts',(-25.8355951904004,-56.0164966999719,4.17047548710021));
#921=CARTESIAN_POINT('Ctrl Pts',(-25.890748919294,-55.8526662829046,4.44615878021184));
#922=CARTESIAN_POINT('Ctrl Pts',(-26.0610278649532,-55.6046325551564,4.82219974933159));
#923=CARTESIAN_POINT('Ctrl Pts',(-26.1518114451451,-55.5029958900747,4.96638317968774));
#924=CARTESIAN_POINT('Ctrl Pts',(-26.3776443694633,-55.3088931075021,5.22140369933611));
#925=CARTESIAN_POINT('Ctrl Pts',(-26.5127008744468,-55.216508545543,5.33229651177729));
#926=CARTESIAN_POINT('Ctrl Pts',(-26.7691470620212,-55.0811922035456,5.48531879964977));
#927=CARTESIAN_POINT('Ctrl Pts',(-26.9056030464807,-55.0231315180094,5.54667584476594));
#928=CARTESIAN_POINT('Ctrl Pts',(-27.1975914645905,-54.9423574942902,5.62912955151189));
#929=CARTESIAN_POINT('Ctrl Pts',(-27.3534519480581,-54.9206024333193,5.64999999999999));
#930=CARTESIAN_POINT('Ctrl Pts',(-27.6465480519419,-54.9206024333193,5.64999999999999));
#931=CARTESIAN_POINT('Ctrl Pts',(-27.8024085354095,-54.9423574942902,5.62912955151189));
#932=CARTESIAN_POINT('Ctrl Pts',(-28.0943969535192,-55.0231315180094,5.54667584476594));
#933=CARTESIAN_POINT('Ctrl Pts',(-28.2308529379788,-55.0811922035456,5.48531879964977));
#934=CARTESIAN_POINT('Ctrl Pts',(-28.4872991255532,-55.216508545543,5.3322965117773));
#935=CARTESIAN_POINT('Ctrl Pts',(-28.6223556305366,-55.3088931075021,5.22140369933612));
#936=CARTESIAN_POINT('Ctrl Pts',(-28.8481885548549,-55.5029958900746,4.96638317968774));
#937=CARTESIAN_POINT('Ctrl Pts',(-28.9389721350468,-55.6046325551564,4.82219974933159));
#938=CARTESIAN_POINT('Ctrl Pts',(-29.0030800409077,-55.6980141697021,4.680625));
#939=CARTESIAN_POINT('Origin',(-27.5,-70.,4.));
#940=CARTESIAN_POINT('Origin',(-5.50000000000001,-25.,12.));
#941=CARTESIAN_POINT('Origin',(5.50000000000001,-25.,12.));
#942=UNCERTAINTY_MEASURE_WITH_UNIT(LENGTH_MEASURE(0.01),#946,
'DISTANCE_ACCURACY_VALUE',
'Maximum model space distance between geometric entities at asserted c
onnectivities');
#943=UNCERTAINTY_MEASURE_WITH_UNIT(LENGTH_MEASURE(1.E-6),#946,
'DISTANCE_ACCURACY_VALUE',
'Maximum model space distance between geometric entities at asserted c
onnectivities');
#944=(
GEOMETRIC_REPRESENTATION_CONTEXT(3)
GLOBAL_UNCERTAINTY_ASSIGNED_CONTEXT((#942))
GLOBAL_UNIT_ASSIGNED_CONTEXT((#946,#949,#947))
REPRESENTATION_CONTEXT('','3D')
);
#945=(
GEOMETRIC_REPRESENTATION_CONTEXT(3)
GLOBAL_UNCERTAINTY_ASSIGNED_CONTEXT((#943))
GLOBAL_UNIT_ASSIGNED_CONTEXT((#946,#949,#947))
REPRESENTATION_CONTEXT('','3D')
);
#946=(
LENGTH_UNIT()
NAMED_UNIT(*)
SI_UNIT(.MILLI.,.METRE.)
);
#947=(
NAMED_UNIT(*)
SI_UNIT($,.STERADIAN.)
SOLID_ANGLE_UNIT()
);
#948=DIMENSIONAL_EXPONENTS(0.,0.,0.,0.,0.,0.,0.);
#949=(
CONVERSION_BASED_UNIT('degree',#951)
NAMED_UNIT(#948)
PLANE_ANGLE_UNIT()
);
#950=(
NAMED_UNIT(*)
PLANE_ANGLE_UNIT()
SI_UNIT($,.RADIAN.)
);
#951=PLANE_ANGLE_MEASURE_WITH_UNIT(PLANE_ANGLE_MEASURE(0.01745329252),#950);
#952=SHAPE_DEFINITION_REPRESENTATION(#953,#954);
#953=PRODUCT_DEFINITION_SHAPE('',$,#956);
#954=SHAPE_REPRESENTATION('',(#473),#944);
#955=PRODUCT_DEFINITION_CONTEXT('part definition',#960,'design');
#956=PRODUCT_DEFINITION('Support Motor _new','Support Motor _new',#957,
#955);
#957=PRODUCT_DEFINITION_FORMATION('',$,#962);
#958=PRODUCT_RELATED_PRODUCT_CATEGORY('Support Motor _new',
'Support Motor _new',(#962));
#959=APPLICATION_PROTOCOL_DEFINITION('international standard',
'automotive_design',2009,#960);
#960=APPLICATION_CONTEXT(
'Core Data for Automotive Mechanical Design Process');
#961=PRODUCT_CONTEXT('part definition',#960,'mechanical');
#962=PRODUCT('Support Motor _new','Support Motor _new',$,(#961));
#963=PRESENTATION_STYLE_ASSIGNMENT((#965));
#964=PRESENTATION_STYLE_ASSIGNMENT((#966));
#965=SURFACE_STYLE_USAGE(.BOTH.,#967);
#966=SURFACE_STYLE_USAGE(.BOTH.,#968);
#967=SURFACE_SIDE_STYLE('',(#969));
#968=SURFACE_SIDE_STYLE('',(#970));
#969=SURFACE_STYLE_FILL_AREA(#971);
#970=SURFACE_STYLE_FILL_AREA(#972);
#971=FILL_AREA_STYLE('',(#973));
#972=FILL_AREA_STYLE('',(#974));
#973=FILL_AREA_STYLE_COLOUR('',#975);
#974=FILL_AREA_STYLE_COLOUR('',#976);
#975=COLOUR_RGB('',0.898039215686275,0.917647058823529,0.929411764705882);
#976=COLOUR_RGB('',0.866666666666667,0.909803921568627,1.);
ENDSEC;
END-ISO-10303-21;
