ISO-10303-21;
HEADER;
/* Generated by software containing ST-Developer
 * from STEP Tools, Inc. (www.steptools.com) 
 */

FILE_DESCRIPTION(
/* description */ (''),
/* implementation_level */ '2;1');

FILE_NAME(
/* name */ 
'C:\\Users\\kkruger\\OneDrive - Stellenbosch University\\Doseerwerk\\N
avorsing\\Studente\\Uitruilstudente\\Maier\\\\End stop_ipt_e8e875e.STE
P',
/* time_stamp */ '2018-05-05T13:42:09+02:00',
/* author */ ('22480064'),
/* organization */ (''),
/* preprocessor_version */ 'ST-DEVELOPER v16.1',
/* originating_system */ 'Autodesk Inventor 2016',
/* authorisation */ '');

FILE_SCHEMA (('AUTOMOTIVE_DESIGN { 1 0 10303 214 3 1 1 }'));
ENDSEC;

DATA;
#10=MECHANICAL_DESIGN_GEOMETRIC_PRESENTATION_REPRESENTATION('',(#14,#16,
#17,#15),#653);
#11=SHAPE_REPRESENTATION_RELATIONSHIP('SRR','None',#662,#12);
#12=ADVANCED_BREP_SHAPE_REPRESENTATION('',(#13),#652);
#13=MANIFOLD_SOLID_BREP('Solid1',#395);
#14=STYLED_ITEM('',(#672),#386);
#15=STYLED_ITEM('',(#672),#387);
#16=STYLED_ITEM('',(#672),#394);
#17=STYLED_ITEM('',(#671),#13);
#18=CIRCLE('',#403,1.99999999999999);
#19=CIRCLE('',#404,1.99999999999999);
#20=CIRCLE('',#406,2.);
#21=CIRCLE('',#407,2.);
#22=CIRCLE('',#409,1.25);
#23=CIRCLE('',#411,1.24999999999999);
#24=CIRCLE('',#415,5.);
#25=CIRCLE('',#416,5.);
#26=CIRCLE('',#417,5.);
#27=CIRCLE('',#418,1.24999999999999);
#28=CIRCLE('',#420,1.24999999999999);
#29=CIRCLE('',#424,5.);
#30=CIRCLE('',#426,5.);
#31=CIRCLE('',#428,5.);
#32=CYLINDRICAL_SURFACE('',#402,1.99999999999999);
#33=CYLINDRICAL_SURFACE('',#405,2.);
#34=CYLINDRICAL_SURFACE('',#421,1.25);
#35=CYLINDRICAL_SURFACE('',#422,1.24999999999999);
#36=CYLINDRICAL_SURFACE('',#423,5.);
#37=CYLINDRICAL_SURFACE('',#425,5.);
#38=CYLINDRICAL_SURFACE('',#430,5.);
#39=CYLINDRICAL_SURFACE('',#432,1.24999999999999);
#40=FACE_BOUND('',#75,.T.);
#41=FACE_BOUND('',#77,.T.);
#42=FACE_BOUND('',#81,.T.);
#43=FACE_BOUND('',#83,.T.);
#44=FACE_BOUND('',#87,.T.);
#45=FACE_BOUND('',#89,.T.);
#46=FACE_BOUND('',#90,.T.);
#47=FACE_BOUND('',#92,.T.);
#48=FACE_BOUND('',#94,.T.);
#49=FACE_BOUND('',#98,.T.);
#50=FACE_BOUND('',#103,.T.);
#51=ELLIPSE('',#399,1.76776695296637,1.25);
#52=ELLIPSE('',#401,1.76776695296636,1.24999999999999);
#53=FACE_OUTER_BOUND('',#73,.T.);
#54=FACE_OUTER_BOUND('',#74,.T.);
#55=FACE_OUTER_BOUND('',#76,.T.);
#56=FACE_OUTER_BOUND('',#78,.T.);
#57=FACE_OUTER_BOUND('',#79,.T.);
#58=FACE_OUTER_BOUND('',#80,.T.);
#59=FACE_OUTER_BOUND('',#82,.T.);
#60=FACE_OUTER_BOUND('',#84,.T.);
#61=FACE_OUTER_BOUND('',#85,.T.);
#62=FACE_OUTER_BOUND('',#86,.T.);
#63=FACE_OUTER_BOUND('',#88,.T.);
#64=FACE_OUTER_BOUND('',#91,.T.);
#65=FACE_OUTER_BOUND('',#93,.T.);
#66=FACE_OUTER_BOUND('',#95,.T.);
#67=FACE_OUTER_BOUND('',#96,.T.);
#68=FACE_OUTER_BOUND('',#97,.T.);
#69=FACE_OUTER_BOUND('',#99,.T.);
#70=FACE_OUTER_BOUND('',#100,.T.);
#71=FACE_OUTER_BOUND('',#101,.T.);
#72=FACE_OUTER_BOUND('',#102,.T.);
#73=EDGE_LOOP('',(#261,#262,#263,#264));
#74=EDGE_LOOP('',(#265,#266,#267,#268));
#75=EDGE_LOOP('',(#269));
#76=EDGE_LOOP('',(#270,#271,#272,#273));
#77=EDGE_LOOP('',(#274));
#78=EDGE_LOOP('',(#275,#276,#277,#278));
#79=EDGE_LOOP('',(#279,#280,#281,#282));
#80=EDGE_LOOP('',(#283,#284,#285,#286,#287,#288));
#81=EDGE_LOOP('',(#289));
#82=EDGE_LOOP('',(#290,#291,#292,#293,#294,#295));
#83=EDGE_LOOP('',(#296));
#84=EDGE_LOOP('',(#297,#298,#299,#300));
#85=EDGE_LOOP('',(#301,#302,#303,#304));
#86=EDGE_LOOP('',(#305,#306,#307,#308,#309,#310,#311,#312,#313));
#87=EDGE_LOOP('',(#314));
#88=EDGE_LOOP('',(#315,#316,#317,#318,#319));
#89=EDGE_LOOP('',(#320));
#90=EDGE_LOOP('',(#321,#322,#323,#324));
#91=EDGE_LOOP('',(#325));
#92=EDGE_LOOP('',(#326));
#93=EDGE_LOOP('',(#327));
#94=EDGE_LOOP('',(#328));
#95=EDGE_LOOP('',(#329,#330,#331,#332));
#96=EDGE_LOOP('',(#333,#334,#335,#336));
#97=EDGE_LOOP('',(#337,#338,#339,#340,#341,#342,#343,#344));
#98=EDGE_LOOP('',(#345,#346,#347,#348));
#99=EDGE_LOOP('',(#349,#350,#351,#352));
#100=EDGE_LOOP('',(#353,#354,#355,#356));
#101=EDGE_LOOP('',(#357,#358,#359,#360));
#102=EDGE_LOOP('',(#361));
#103=EDGE_LOOP('',(#362));
#104=LINE('',#546,#139);
#105=LINE('',#548,#140);
#106=LINE('',#550,#141);
#107=LINE('',#551,#142);
#108=LINE('',#555,#143);
#109=LINE('',#557,#144);
#110=LINE('',#559,#145);
#111=LINE('',#560,#146);
#112=LINE('',#566,#147);
#113=LINE('',#568,#148);
#114=LINE('',#570,#149);
#115=LINE('',#571,#150);
#116=LINE('',#582,#151);
#117=LINE('',#584,#152);
#118=LINE('',#586,#153);
#119=LINE('',#588,#154);
#120=LINE('',#589,#155);
#121=LINE('',#595,#156);
#122=LINE('',#597,#157);
#123=LINE('',#598,#158);
#124=LINE('',#600,#159);
#125=LINE('',#601,#160);
#126=LINE('',#606,#161);
#127=LINE('',#608,#162);
#128=LINE('',#609,#163);
#129=LINE('',#611,#164);
#130=LINE('',#612,#165);
#131=LINE('',#617,#166);
#132=LINE('',#621,#167);
#133=LINE('',#633,#168);
#134=LINE('',#636,#169);
#135=LINE('',#640,#170);
#136=LINE('',#643,#171);
#137=LINE('',#645,#172);
#138=LINE('',#647,#173);
#139=VECTOR('',#437,3.99999999999993);
#140=VECTOR('',#438,6.);
#141=VECTOR('',#439,4.);
#142=VECTOR('',#440,6.);
#143=VECTOR('',#443,24.9999976572705);
#144=VECTOR('',#444,6.);
#145=VECTOR('',#445,24.9999976572705);
#146=VECTOR('',#446,6.);
#147=VECTOR('',#451,24.9999976572705);
#148=VECTOR('',#452,6.);
#149=VECTOR('',#453,24.9999976572705);
#150=VECTOR('',#454,6.);
#151=VECTOR('',#471,4.05996487343766);
#152=VECTOR('',#472,2.);
#153=VECTOR('',#473,20.1116080018162);
#154=VECTOR('',#474,8.);
#155=VECTOR('',#475,24.1715728752538);
#156=VECTOR('',#480,20.111608001816);
#157=VECTOR('',#481,2.);
#158=VECTOR('',#482,4.05996487343775);
#159=VECTOR('',#483,24.1715728752538);
#160=VECTOR('',#484,8.);
#161=VECTOR('',#489,27.);
#162=VECTOR('',#490,8.);
#163=VECTOR('',#491,27.);
#164=VECTOR('',#494,27.);
#165=VECTOR('',#495,27.);
#166=VECTOR('',#500,24.9999976572705);
#167=VECTOR('',#503,24.9999976572705);
#168=VECTOR('',#520,2.);
#169=VECTOR('',#523,2.);
#170=VECTOR('',#528,24.9999976572705);
#171=VECTOR('',#531,24.9999976572705);
#172=VECTOR('',#534,2.);
#173=VECTOR('',#537,2.);
#174=VERTEX_POINT('',#544);
#175=VERTEX_POINT('',#545);
#176=VERTEX_POINT('',#547);
#177=VERTEX_POINT('',#549);
#178=VERTEX_POINT('',#553);
#179=VERTEX_POINT('',#554);
#180=VERTEX_POINT('',#556);
#181=VERTEX_POINT('',#558);
#182=VERTEX_POINT('',#561);
#183=VERTEX_POINT('',#564);
#184=VERTEX_POINT('',#565);
#185=VERTEX_POINT('',#567);
#186=VERTEX_POINT('',#569);
#187=VERTEX_POINT('',#572);
#188=VERTEX_POINT('',#581);
#189=VERTEX_POINT('',#583);
#190=VERTEX_POINT('',#585);
#191=VERTEX_POINT('',#587);
#192=VERTEX_POINT('',#590);
#193=VERTEX_POINT('',#593);
#194=VERTEX_POINT('',#594);
#195=VERTEX_POINT('',#596);
#196=VERTEX_POINT('',#599);
#197=VERTEX_POINT('',#602);
#198=VERTEX_POINT('',#605);
#199=VERTEX_POINT('',#607);
#200=VERTEX_POINT('',#614);
#201=VERTEX_POINT('',#616);
#202=VERTEX_POINT('',#618);
#203=VERTEX_POINT('',#620);
#204=VERTEX_POINT('',#623);
#205=VERTEX_POINT('',#626);
#206=VERTEX_POINT('',#631);
#207=VERTEX_POINT('',#635);
#208=VERTEX_POINT('',#639);
#209=VERTEX_POINT('',#641);
#210=EDGE_CURVE('',#174,#175,#104,.T.);
#211=EDGE_CURVE('',#176,#174,#105,.T.);
#212=EDGE_CURVE('',#176,#177,#106,.T.);
#213=EDGE_CURVE('',#177,#175,#107,.T.);
#214=EDGE_CURVE('',#178,#179,#108,.T.);
#215=EDGE_CURVE('',#180,#178,#109,.T.);
#216=EDGE_CURVE('',#180,#181,#110,.T.);
#217=EDGE_CURVE('',#181,#179,#111,.T.);
#218=EDGE_CURVE('',#182,#182,#51,.F.);
#219=EDGE_CURVE('',#183,#184,#112,.T.);
#220=EDGE_CURVE('',#185,#183,#113,.T.);
#221=EDGE_CURVE('',#185,#186,#114,.T.);
#222=EDGE_CURVE('',#186,#184,#115,.T.);
#223=EDGE_CURVE('',#187,#187,#52,.F.);
#224=EDGE_CURVE('',#179,#183,#18,.F.);
#225=EDGE_CURVE('',#181,#185,#19,.T.);
#226=EDGE_CURVE('',#184,#178,#20,.F.);
#227=EDGE_CURVE('',#186,#180,#21,.T.);
#228=EDGE_CURVE('',#188,#174,#116,.T.);
#229=EDGE_CURVE('',#188,#189,#117,.T.);
#230=EDGE_CURVE('',#190,#189,#118,.T.);
#231=EDGE_CURVE('',#190,#191,#119,.T.);
#232=EDGE_CURVE('',#191,#176,#120,.T.);
#233=EDGE_CURVE('',#192,#192,#22,.T.);
#234=EDGE_CURVE('',#193,#194,#121,.T.);
#235=EDGE_CURVE('',#193,#195,#122,.F.);
#236=EDGE_CURVE('',#175,#195,#123,.T.);
#237=EDGE_CURVE('',#177,#196,#124,.T.);
#238=EDGE_CURVE('',#194,#196,#125,.T.);
#239=EDGE_CURVE('',#197,#197,#23,.T.);
#240=EDGE_CURVE('',#196,#198,#126,.T.);
#241=EDGE_CURVE('',#199,#198,#127,.T.);
#242=EDGE_CURVE('',#194,#199,#128,.T.);
#243=EDGE_CURVE('',#198,#191,#129,.T.);
#244=EDGE_CURVE('',#199,#190,#130,.T.);
#245=EDGE_CURVE('',#200,#189,#24,.T.);
#246=EDGE_CURVE('',#201,#200,#131,.T.);
#247=EDGE_CURVE('',#202,#201,#25,.T.);
#248=EDGE_CURVE('',#203,#202,#132,.T.);
#249=EDGE_CURVE('',#193,#203,#26,.T.);
#250=EDGE_CURVE('',#204,#204,#27,.T.);
#251=EDGE_CURVE('',#205,#205,#28,.T.);
#252=EDGE_CURVE('',#206,#188,#29,.T.);
#253=EDGE_CURVE('',#206,#200,#133,.T.);
#254=EDGE_CURVE('',#207,#203,#134,.T.);
#255=EDGE_CURVE('',#195,#207,#30,.T.);
#256=EDGE_CURVE('',#207,#208,#135,.T.);
#257=EDGE_CURVE('',#208,#209,#31,.T.);
#258=EDGE_CURVE('',#209,#206,#136,.T.);
#259=EDGE_CURVE('',#209,#201,#137,.T.);
#260=EDGE_CURVE('',#208,#202,#138,.T.);
#261=ORIENTED_EDGE('',*,*,#210,.F.);
#262=ORIENTED_EDGE('',*,*,#211,.F.);
#263=ORIENTED_EDGE('',*,*,#212,.T.);
#264=ORIENTED_EDGE('',*,*,#213,.T.);
#265=ORIENTED_EDGE('',*,*,#214,.F.);
#266=ORIENTED_EDGE('',*,*,#215,.F.);
#267=ORIENTED_EDGE('',*,*,#216,.T.);
#268=ORIENTED_EDGE('',*,*,#217,.T.);
#269=ORIENTED_EDGE('',*,*,#218,.F.);
#270=ORIENTED_EDGE('',*,*,#219,.F.);
#271=ORIENTED_EDGE('',*,*,#220,.F.);
#272=ORIENTED_EDGE('',*,*,#221,.T.);
#273=ORIENTED_EDGE('',*,*,#222,.T.);
#274=ORIENTED_EDGE('',*,*,#223,.F.);
#275=ORIENTED_EDGE('',*,*,#224,.F.);
#276=ORIENTED_EDGE('',*,*,#217,.F.);
#277=ORIENTED_EDGE('',*,*,#225,.T.);
#278=ORIENTED_EDGE('',*,*,#220,.T.);
#279=ORIENTED_EDGE('',*,*,#226,.F.);
#280=ORIENTED_EDGE('',*,*,#222,.F.);
#281=ORIENTED_EDGE('',*,*,#227,.T.);
#282=ORIENTED_EDGE('',*,*,#215,.T.);
#283=ORIENTED_EDGE('',*,*,#228,.F.);
#284=ORIENTED_EDGE('',*,*,#229,.T.);
#285=ORIENTED_EDGE('',*,*,#230,.F.);
#286=ORIENTED_EDGE('',*,*,#231,.T.);
#287=ORIENTED_EDGE('',*,*,#232,.T.);
#288=ORIENTED_EDGE('',*,*,#211,.T.);
#289=ORIENTED_EDGE('',*,*,#233,.F.);
#290=ORIENTED_EDGE('',*,*,#234,.F.);
#291=ORIENTED_EDGE('',*,*,#235,.T.);
#292=ORIENTED_EDGE('',*,*,#236,.F.);
#293=ORIENTED_EDGE('',*,*,#213,.F.);
#294=ORIENTED_EDGE('',*,*,#237,.T.);
#295=ORIENTED_EDGE('',*,*,#238,.F.);
#296=ORIENTED_EDGE('',*,*,#239,.F.);
#297=ORIENTED_EDGE('',*,*,#240,.T.);
#298=ORIENTED_EDGE('',*,*,#241,.F.);
#299=ORIENTED_EDGE('',*,*,#242,.F.);
#300=ORIENTED_EDGE('',*,*,#238,.T.);
#301=ORIENTED_EDGE('',*,*,#243,.T.);
#302=ORIENTED_EDGE('',*,*,#231,.F.);
#303=ORIENTED_EDGE('',*,*,#244,.F.);
#304=ORIENTED_EDGE('',*,*,#241,.T.);
#305=ORIENTED_EDGE('',*,*,#230,.T.);
#306=ORIENTED_EDGE('',*,*,#245,.F.);
#307=ORIENTED_EDGE('',*,*,#246,.F.);
#308=ORIENTED_EDGE('',*,*,#247,.F.);
#309=ORIENTED_EDGE('',*,*,#248,.F.);
#310=ORIENTED_EDGE('',*,*,#249,.F.);
#311=ORIENTED_EDGE('',*,*,#234,.T.);
#312=ORIENTED_EDGE('',*,*,#242,.T.);
#313=ORIENTED_EDGE('',*,*,#244,.T.);
#314=ORIENTED_EDGE('',*,*,#250,.F.);
#315=ORIENTED_EDGE('',*,*,#212,.F.);
#316=ORIENTED_EDGE('',*,*,#232,.F.);
#317=ORIENTED_EDGE('',*,*,#243,.F.);
#318=ORIENTED_EDGE('',*,*,#240,.F.);
#319=ORIENTED_EDGE('',*,*,#237,.F.);
#320=ORIENTED_EDGE('',*,*,#251,.F.);
#321=ORIENTED_EDGE('',*,*,#225,.F.);
#322=ORIENTED_EDGE('',*,*,#216,.F.);
#323=ORIENTED_EDGE('',*,*,#227,.F.);
#324=ORIENTED_EDGE('',*,*,#221,.F.);
#325=ORIENTED_EDGE('',*,*,#218,.T.);
#326=ORIENTED_EDGE('',*,*,#233,.T.);
#327=ORIENTED_EDGE('',*,*,#223,.T.);
#328=ORIENTED_EDGE('',*,*,#239,.T.);
#329=ORIENTED_EDGE('',*,*,#252,.F.);
#330=ORIENTED_EDGE('',*,*,#253,.T.);
#331=ORIENTED_EDGE('',*,*,#245,.T.);
#332=ORIENTED_EDGE('',*,*,#229,.F.);
#333=ORIENTED_EDGE('',*,*,#249,.T.);
#334=ORIENTED_EDGE('',*,*,#254,.F.);
#335=ORIENTED_EDGE('',*,*,#255,.F.);
#336=ORIENTED_EDGE('',*,*,#235,.F.);
#337=ORIENTED_EDGE('',*,*,#228,.T.);
#338=ORIENTED_EDGE('',*,*,#210,.T.);
#339=ORIENTED_EDGE('',*,*,#236,.T.);
#340=ORIENTED_EDGE('',*,*,#255,.T.);
#341=ORIENTED_EDGE('',*,*,#256,.T.);
#342=ORIENTED_EDGE('',*,*,#257,.T.);
#343=ORIENTED_EDGE('',*,*,#258,.T.);
#344=ORIENTED_EDGE('',*,*,#252,.T.);
#345=ORIENTED_EDGE('',*,*,#224,.T.);
#346=ORIENTED_EDGE('',*,*,#219,.T.);
#347=ORIENTED_EDGE('',*,*,#226,.T.);
#348=ORIENTED_EDGE('',*,*,#214,.T.);
#349=ORIENTED_EDGE('',*,*,#246,.T.);
#350=ORIENTED_EDGE('',*,*,#253,.F.);
#351=ORIENTED_EDGE('',*,*,#258,.F.);
#352=ORIENTED_EDGE('',*,*,#259,.T.);
#353=ORIENTED_EDGE('',*,*,#247,.T.);
#354=ORIENTED_EDGE('',*,*,#259,.F.);
#355=ORIENTED_EDGE('',*,*,#257,.F.);
#356=ORIENTED_EDGE('',*,*,#260,.T.);
#357=ORIENTED_EDGE('',*,*,#248,.T.);
#358=ORIENTED_EDGE('',*,*,#260,.F.);
#359=ORIENTED_EDGE('',*,*,#256,.F.);
#360=ORIENTED_EDGE('',*,*,#254,.T.);
#361=ORIENTED_EDGE('',*,*,#251,.T.);
#362=ORIENTED_EDGE('',*,*,#250,.T.);
#363=PLANE('',#397);
#364=PLANE('',#398);
#365=PLANE('',#400);
#366=PLANE('',#408);
#367=PLANE('',#410);
#368=PLANE('',#412);
#369=PLANE('',#413);
#370=PLANE('',#414);
#371=PLANE('',#419);
#372=PLANE('',#427);
#373=PLANE('',#429);
#374=PLANE('',#431);
#375=ADVANCED_FACE('',(#53),#363,.F.);
#376=ADVANCED_FACE('',(#54,#40),#364,.F.);
#377=ADVANCED_FACE('',(#55,#41),#365,.F.);
#378=ADVANCED_FACE('',(#56),#32,.F.);
#379=ADVANCED_FACE('',(#57),#33,.F.);
#380=ADVANCED_FACE('',(#58,#42),#366,.F.);
#381=ADVANCED_FACE('',(#59,#43),#367,.F.);
#382=ADVANCED_FACE('',(#60),#368,.F.);
#383=ADVANCED_FACE('',(#61),#369,.F.);
#384=ADVANCED_FACE('',(#62,#44),#370,.F.);
#385=ADVANCED_FACE('',(#63,#45,#46),#371,.T.);
#386=ADVANCED_FACE('',(#64,#47),#34,.F.);
#387=ADVANCED_FACE('',(#65,#48),#35,.F.);
#388=ADVANCED_FACE('',(#66),#36,.F.);
#389=ADVANCED_FACE('',(#67),#37,.F.);
#390=ADVANCED_FACE('',(#68,#49),#372,.T.);
#391=ADVANCED_FACE('',(#69),#373,.F.);
#392=ADVANCED_FACE('',(#70),#38,.F.);
#393=ADVANCED_FACE('',(#71),#374,.F.);
#394=ADVANCED_FACE('',(#72,#50),#39,.F.);
#395=CLOSED_SHELL('',(#375,#376,#377,#378,#379,#380,#381,#382,#383,#384,
#385,#386,#387,#388,#389,#390,#391,#392,#393,#394));
#396=AXIS2_PLACEMENT_3D('placement',#542,#433,#434);
#397=AXIS2_PLACEMENT_3D('',#543,#435,#436);
#398=AXIS2_PLACEMENT_3D('',#552,#441,#442);
#399=AXIS2_PLACEMENT_3D('',#562,#447,#448);
#400=AXIS2_PLACEMENT_3D('',#563,#449,#450);
#401=AXIS2_PLACEMENT_3D('',#573,#455,#456);
#402=AXIS2_PLACEMENT_3D('',#574,#457,#458);
#403=AXIS2_PLACEMENT_3D('',#575,#459,#460);
#404=AXIS2_PLACEMENT_3D('',#576,#461,#462);
#405=AXIS2_PLACEMENT_3D('',#577,#463,#464);
#406=AXIS2_PLACEMENT_3D('',#578,#465,#466);
#407=AXIS2_PLACEMENT_3D('',#579,#467,#468);
#408=AXIS2_PLACEMENT_3D('',#580,#469,#470);
#409=AXIS2_PLACEMENT_3D('',#591,#476,#477);
#410=AXIS2_PLACEMENT_3D('',#592,#478,#479);
#411=AXIS2_PLACEMENT_3D('',#603,#485,#486);
#412=AXIS2_PLACEMENT_3D('',#604,#487,#488);
#413=AXIS2_PLACEMENT_3D('',#610,#492,#493);
#414=AXIS2_PLACEMENT_3D('',#613,#496,#497);
#415=AXIS2_PLACEMENT_3D('',#615,#498,#499);
#416=AXIS2_PLACEMENT_3D('',#619,#501,#502);
#417=AXIS2_PLACEMENT_3D('',#622,#504,#505);
#418=AXIS2_PLACEMENT_3D('',#624,#506,#507);
#419=AXIS2_PLACEMENT_3D('',#625,#508,#509);
#420=AXIS2_PLACEMENT_3D('',#627,#510,#511);
#421=AXIS2_PLACEMENT_3D('',#628,#512,#513);
#422=AXIS2_PLACEMENT_3D('',#629,#514,#515);
#423=AXIS2_PLACEMENT_3D('',#630,#516,#517);
#424=AXIS2_PLACEMENT_3D('',#632,#518,#519);
#425=AXIS2_PLACEMENT_3D('',#634,#521,#522);
#426=AXIS2_PLACEMENT_3D('',#637,#524,#525);
#427=AXIS2_PLACEMENT_3D('',#638,#526,#527);
#428=AXIS2_PLACEMENT_3D('',#642,#529,#530);
#429=AXIS2_PLACEMENT_3D('',#644,#532,#533);
#430=AXIS2_PLACEMENT_3D('',#646,#535,#536);
#431=AXIS2_PLACEMENT_3D('',#648,#538,#539);
#432=AXIS2_PLACEMENT_3D('',#649,#540,#541);
#433=DIRECTION('axis',(0.,0.,1.));
#434=DIRECTION('refdir',(1.,0.,0.));
#435=DIRECTION('center_axis',(0.707106781186544,0.707106781186551,0.));
#436=DIRECTION('ref_axis',(0.,0.,-1.));
#437=DIRECTION('',(0.707106781186551,-0.707106781186544,0.));
#438=DIRECTION('',(0.,0.,1.));
#439=DIRECTION('',(0.707106781186551,-0.707106781186544,0.));
#440=DIRECTION('',(0.,0.,1.));
#441=DIRECTION('center_axis',(-0.707106781186547,0.707106781186548,0.));
#442=DIRECTION('ref_axis',(0.,0.,1.));
#443=DIRECTION('',(0.707106781186548,0.707106781186546,0.));
#444=DIRECTION('',(0.,0.,1.));
#445=DIRECTION('',(0.707106781186548,0.707106781186547,0.));
#446=DIRECTION('',(0.,0.,1.));
#447=DIRECTION('center_axis',(-0.707106781186547,0.707106781186548,0.));
#448=DIRECTION('ref_axis',(-0.707106781186548,-0.707106781186547,0.));
#449=DIRECTION('center_axis',(0.707106781186547,-0.707106781186548,0.));
#450=DIRECTION('ref_axis',(0.,0.,-1.));
#451=DIRECTION('',(-0.707106781186548,-0.707106781186547,0.));
#452=DIRECTION('',(0.,0.,1.));
#453=DIRECTION('',(-0.707106781186548,-0.707106781186547,0.));
#454=DIRECTION('',(0.,0.,1.));
#455=DIRECTION('center_axis',(0.707106781186547,-0.707106781186548,0.));
#456=DIRECTION('ref_axis',(-0.707106781186548,-0.707106781186547,0.));
#457=DIRECTION('center_axis',(0.,0.,1.));
#458=DIRECTION('ref_axis',(1.,0.,0.));
#459=DIRECTION('center_axis',(0.,0.,1.));
#460=DIRECTION('ref_axis',(1.,0.,0.));
#461=DIRECTION('center_axis',(0.,0.,-1.));
#462=DIRECTION('ref_axis',(-1.,0.,0.));
#463=DIRECTION('center_axis',(0.,0.,1.));
#464=DIRECTION('ref_axis',(1.,0.,0.));
#465=DIRECTION('center_axis',(0.,0.,1.));
#466=DIRECTION('ref_axis',(1.,0.,0.));
#467=DIRECTION('center_axis',(0.,0.,-1.));
#468=DIRECTION('ref_axis',(-1.,0.,0.));
#469=DIRECTION('center_axis',(1.,-1.77635683940025E-15,0.));
#470=DIRECTION('ref_axis',(0.,0.,-1.));
#471=DIRECTION('',(-1.77635683940025E-15,-1.,0.));
#472=DIRECTION('',(0.,0.,1.));
#473=DIRECTION('',(-1.77635683940025E-15,-1.,0.));
#474=DIRECTION('',(0.,0.,-1.));
#475=DIRECTION('',(-1.77635683940025E-15,-1.,0.));
#476=DIRECTION('center_axis',(-1.,0.,0.));
#477=DIRECTION('ref_axis',(0.,0.,1.));
#478=DIRECTION('center_axis',(1.77635683940025E-15,1.,0.));
#479=DIRECTION('ref_axis',(0.,0.,1.));
#480=DIRECTION('',(1.,-1.77635683940025E-15,0.));
#481=DIRECTION('',(0.,0.,1.));
#482=DIRECTION('',(1.,-1.77635683940025E-15,0.));
#483=DIRECTION('',(1.,-1.77635683940025E-15,0.));
#484=DIRECTION('',(0.,0.,-1.));
#485=DIRECTION('center_axis',(0.,-1.,0.));
#486=DIRECTION('ref_axis',(0.,0.,-1.));
#487=DIRECTION('center_axis',(-1.,1.79897249360558E-15,0.));
#488=DIRECTION('ref_axis',(0.,0.,1.));
#489=DIRECTION('',(1.64477485129653E-15,1.,0.));
#490=DIRECTION('',(0.,0.,-1.));
#491=DIRECTION('',(1.64477485129653E-15,1.,0.));
#492=DIRECTION('center_axis',(-1.79897249360558E-15,-1.,0.));
#493=DIRECTION('ref_axis',(0.,0.,-1.));
#494=DIRECTION('',(-1.,1.80925233642618E-15,0.));
#495=DIRECTION('',(-1.,1.80925233642618E-15,0.));
#496=DIRECTION('center_axis',(0.,0.,-1.));
#497=DIRECTION('ref_axis',(-1.,0.,0.));
#498=DIRECTION('center_axis',(0.,0.,1.));
#499=DIRECTION('ref_axis',(1.,0.,0.));
#500=DIRECTION('',(-0.707106781186548,-0.707106781186547,0.));
#501=DIRECTION('center_axis',(0.,0.,1.));
#502=DIRECTION('ref_axis',(1.,0.,0.));
#503=DIRECTION('',(0.707106781186548,0.707106781186547,0.));
#504=DIRECTION('center_axis',(0.,0.,1.));
#505=DIRECTION('ref_axis',(1.,0.,0.));
#506=DIRECTION('center_axis',(0.,0.,1.));
#507=DIRECTION('ref_axis',(1.,0.,0.));
#508=DIRECTION('center_axis',(0.,0.,-1.));
#509=DIRECTION('ref_axis',(-1.,0.,0.));
#510=DIRECTION('center_axis',(0.,0.,-1.));
#511=DIRECTION('ref_axis',(-1.,0.,0.));
#512=DIRECTION('center_axis',(-1.,0.,0.));
#513=DIRECTION('ref_axis',(0.,0.,1.));
#514=DIRECTION('center_axis',(0.,-1.,0.));
#515=DIRECTION('ref_axis',(0.,0.,-1.));
#516=DIRECTION('center_axis',(0.,0.,1.));
#517=DIRECTION('ref_axis',(1.,0.,0.));
#518=DIRECTION('center_axis',(0.,0.,1.));
#519=DIRECTION('ref_axis',(1.,0.,0.));
#520=DIRECTION('',(0.,0.,1.));
#521=DIRECTION('center_axis',(0.,0.,1.));
#522=DIRECTION('ref_axis',(1.,0.,0.));
#523=DIRECTION('',(0.,0.,1.));
#524=DIRECTION('center_axis',(0.,0.,1.));
#525=DIRECTION('ref_axis',(1.,0.,0.));
#526=DIRECTION('center_axis',(0.,0.,1.));
#527=DIRECTION('ref_axis',(1.,0.,0.));
#528=DIRECTION('',(0.707106781186548,0.707106781186547,0.));
#529=DIRECTION('center_axis',(0.,0.,1.));
#530=DIRECTION('ref_axis',(1.,0.,0.));
#531=DIRECTION('',(-0.707106781186548,-0.707106781186547,0.));
#532=DIRECTION('center_axis',(-0.707106781186547,0.707106781186548,0.));
#533=DIRECTION('ref_axis',(0.,0.,1.));
#534=DIRECTION('',(0.,0.,1.));
#535=DIRECTION('center_axis',(0.,0.,1.));
#536=DIRECTION('ref_axis',(1.,0.,0.));
#537=DIRECTION('',(0.,0.,1.));
#538=DIRECTION('center_axis',(0.707106781186547,-0.707106781186548,0.));
#539=DIRECTION('ref_axis',(0.,0.,-1.));
#540=DIRECTION('center_axis',(0.,0.,1.));
#541=DIRECTION('ref_axis',(1.,0.,0.));
#542=CARTESIAN_POINT('',(0.,0.,0.));
#543=CARTESIAN_POINT('Origin',(4.76152522413126E-14,2.82842712474613,-2.));
#544=CARTESIAN_POINT('',(4.76152522413126E-14,2.82842712474613,6.));
#545=CARTESIAN_POINT('',(2.82842712474621,-4.33680868994202E-16,6.));
#546=CARTESIAN_POINT('',(4.76152522413126E-14,2.82842712474613,6.));
#547=CARTESIAN_POINT('',(5.11423314785924E-15,2.82842712474618,0.));
#548=CARTESIAN_POINT('',(4.76152522413126E-14,2.82842712474613,0.));
#549=CARTESIAN_POINT('',(2.82842712474621,3.08148791101958E-30,0.));
#550=CARTESIAN_POINT('',(5.20417042793042E-15,2.82842712474618,0.));
#551=CARTESIAN_POINT('',(2.82842712474621,3.08148791101958E-30,0.));
#552=CARTESIAN_POINT('Origin',(20.50609499785,23.3345221225961,-4.));
#553=CARTESIAN_POINT('',(2.82842712474623,5.65685424949234,6.));
#554=CARTESIAN_POINT('',(20.50609499785,23.3345221225961,6.));
#555=CARTESIAN_POINT('',(2.82842712474622,5.65685424949234,6.));
#556=CARTESIAN_POINT('',(2.82842712474623,5.65685424949235,0.));
#557=CARTESIAN_POINT('',(2.82842712474623,5.65685424949234,0.));
#558=CARTESIAN_POINT('',(20.50609499785,23.3345221225961,0.));
#559=CARTESIAN_POINT('',(2.82842712474623,5.65685424949235,0.));
#560=CARTESIAN_POINT('',(20.50609499785,23.3345221225961,0.));
#561=CARTESIAN_POINT('',(8.6215728752539,11.45,4.));
#562=CARTESIAN_POINT('Origin',(9.8715728752539,12.7,4.));
#563=CARTESIAN_POINT('Origin',(23.3345221225962,20.5060949978499,-4.));
#564=CARTESIAN_POINT('',(23.3345221225962,20.5060949978499,6.));
#565=CARTESIAN_POINT('',(5.65685424949241,2.82842712474615,6.));
#566=CARTESIAN_POINT('',(23.3345221225962,20.5060949978499,6.));
#567=CARTESIAN_POINT('',(23.3345221225962,20.5060949978499,0.));
#568=CARTESIAN_POINT('',(23.3345221225962,20.5060949978499,0.));
#569=CARTESIAN_POINT('',(5.65685424949241,2.82842712474615,0.));
#570=CARTESIAN_POINT('',(23.3345221225962,20.5060949978499,0.));
#571=CARTESIAN_POINT('',(5.65685424949241,2.82842712474615,0.));
#572=CARTESIAN_POINT('',(11.45,8.62157287525373,4.));
#573=CARTESIAN_POINT('Origin',(12.7,9.87157287525373,4.));
#574=CARTESIAN_POINT('Origin',(21.9203085602231,21.920308560223,-4.));
#575=CARTESIAN_POINT('Origin',(21.9203085602231,21.920308560223,6.));
#576=CARTESIAN_POINT('Origin',(21.9203085602231,21.920308560223,0.));
#577=CARTESIAN_POINT('Origin',(4.24264068711932,4.24264068711924,-4.));
#578=CARTESIAN_POINT('Origin',(4.24264068711932,4.24264068711924,6.));
#579=CARTESIAN_POINT('Origin',(4.24264068711932,4.24264068711924,0.));
#580=CARTESIAN_POINT('Origin',(0.,0.,8.));
#581=CARTESIAN_POINT('',(1.25060540786573E-14,6.88839199818379,6.));
#582=CARTESIAN_POINT('',(1.22362422384437E-14,6.88839199818379,6.));
#583=CARTESIAN_POINT('',(1.21430643318377E-14,6.88839199818379,8.));
#584=CARTESIAN_POINT('',(1.25060540786573E-14,6.88839199818379,6.));
#585=CARTESIAN_POINT('',(4.79616346638068E-14,27.,8.));
#586=CARTESIAN_POINT('',(4.79616346638068E-14,27.,8.));
#587=CARTESIAN_POINT('',(4.79616346638068E-14,27.,0.));
#588=CARTESIAN_POINT('',(4.79616346638068E-14,27.,8.));
#589=CARTESIAN_POINT('',(4.79616346638068E-14,27.,0.));
#590=CARTESIAN_POINT('',(2.25107459884173E-14,12.7,5.25));
#591=CARTESIAN_POINT('Origin',(2.25107459884173E-14,12.7,4.));
#592=CARTESIAN_POINT('Origin',(0.,0.,8.));
#593=CARTESIAN_POINT('',(6.88839199818396,-1.21430643318377E-14,8.));
#594=CARTESIAN_POINT('',(27.,-4.79616346638068E-14,8.));
#595=CARTESIAN_POINT('',(6.88839199818396,-1.2236242238444E-14,8.));
#596=CARTESIAN_POINT('',(6.88839199818396,-1.25060540786575E-14,6.));
#597=CARTESIAN_POINT('',(6.88839199818396,-1.25060540786575E-14,6.));
#598=CARTESIAN_POINT('',(2.82842712474621,-5.02429586778811E-15,6.));
#599=CARTESIAN_POINT('',(27.,-4.79616346638068E-14,0.));
#600=CARTESIAN_POINT('',(2.82842712474621,-5.02429586778811E-15,0.));
#601=CARTESIAN_POINT('',(27.,-4.79616346638068E-14,8.));
#602=CARTESIAN_POINT('',(12.7,-2.25519692041329E-14,2.75000000000001));
#603=CARTESIAN_POINT('Origin',(12.7,-2.25519692041329E-14,4.));
#604=CARTESIAN_POINT('Origin',(27.,-4.79616346638068E-14,8.));
#605=CARTESIAN_POINT('',(27.,27.,0.));
#606=CARTESIAN_POINT('',(27.,-4.79616346638068E-14,0.));
#607=CARTESIAN_POINT('',(27.,27.,8.));
#608=CARTESIAN_POINT('',(27.,27.,8.));
#609=CARTESIAN_POINT('',(27.,-4.79616346638068E-14,8.));
#610=CARTESIAN_POINT('Origin',(4.79616346638068E-14,27.,8.));
#611=CARTESIAN_POINT('',(27.,27.,0.));
#612=CARTESIAN_POINT('',(27.,27.,8.));
#613=CARTESIAN_POINT('Origin',(4.79616346638068E-14,27.,8.));
#614=CARTESIAN_POINT('',(0.707106781186589,7.77817459305199,8.));
#615=CARTESIAN_POINT('Origin',(4.24264068711932,4.24264068711924,8.));
#616=CARTESIAN_POINT('',(18.3847746542904,25.4558424661558,8.));
#617=CARTESIAN_POINT('',(18.3847746542904,25.4558424661558,8.));
#618=CARTESIAN_POINT('',(25.4558424661559,18.3847746542903,8.));
#619=CARTESIAN_POINT('Origin',(21.9203085602231,21.920308560223,8.));
#620=CARTESIAN_POINT('',(7.77817459305206,0.707106781186507,8.));
#621=CARTESIAN_POINT('',(7.77817459305206,0.707106781186507,8.));
#622=CARTESIAN_POINT('Origin',(4.24264068711932,4.24264068711924,8.));
#623=CARTESIAN_POINT('',(3.72487373415295,24.5251262658471,8.));
#624=CARTESIAN_POINT('Origin',(2.47487373415296,24.5251262658471,8.));
#625=CARTESIAN_POINT('Origin',(4.79616346638068E-14,27.,0.));
#626=CARTESIAN_POINT('',(1.22487373415297,24.5251262658471,0.));
#627=CARTESIAN_POINT('Origin',(2.47487373415296,24.5251262658471,0.));
#628=CARTESIAN_POINT('Origin',(2.25597318603832E-14,12.7,4.));
#629=CARTESIAN_POINT('Origin',(12.7,-2.11497486191092E-14,4.));
#630=CARTESIAN_POINT('Origin',(4.24264068711932,4.24264068711924,6.));
#631=CARTESIAN_POINT('',(0.707106781186589,7.77817459305199,6.));
#632=CARTESIAN_POINT('Origin',(4.24264068711932,4.24264068711924,6.));
#633=CARTESIAN_POINT('',(0.707106781186589,7.77817459305199,6.));
#634=CARTESIAN_POINT('Origin',(4.24264068711932,4.24264068711924,6.));
#635=CARTESIAN_POINT('',(7.77817459305206,0.707106781186507,6.));
#636=CARTESIAN_POINT('',(7.77817459305206,0.707106781186507,6.));
#637=CARTESIAN_POINT('Origin',(4.24264068711932,4.24264068711924,6.));
#638=CARTESIAN_POINT('Origin',(4.24264068711932,4.24264068711924,6.));
#639=CARTESIAN_POINT('',(25.4558424661559,18.3847746542903,6.));
#640=CARTESIAN_POINT('',(7.77817459305206,0.707106781186507,6.));
#641=CARTESIAN_POINT('',(18.3847746542904,25.4558424661558,6.));
#642=CARTESIAN_POINT('Origin',(21.9203085602231,21.920308560223,6.));
#643=CARTESIAN_POINT('',(18.3847746542904,25.4558424661558,6.));
#644=CARTESIAN_POINT('Origin',(0.707106781186589,7.77817459305199,6.));
#645=CARTESIAN_POINT('',(18.3847746542904,25.4558424661558,6.));
#646=CARTESIAN_POINT('Origin',(21.9203085602231,21.920308560223,6.));
#647=CARTESIAN_POINT('',(25.4558424661559,18.3847746542903,6.));
#648=CARTESIAN_POINT('Origin',(7.77817459305206,0.707106781186507,6.));
#649=CARTESIAN_POINT('Origin',(2.47487373415296,24.5251262658471,8.));
#650=UNCERTAINTY_MEASURE_WITH_UNIT(LENGTH_MEASURE(0.01),#654,
'DISTANCE_ACCURACY_VALUE',
'Maximum model space distance between geometric entities at asserted c
onnectivities');
#651=UNCERTAINTY_MEASURE_WITH_UNIT(LENGTH_MEASURE(1.E-6),#654,
'DISTANCE_ACCURACY_VALUE',
'Maximum model space distance between geometric entities at asserted c
onnectivities');
#652=(
GEOMETRIC_REPRESENTATION_CONTEXT(3)
GLOBAL_UNCERTAINTY_ASSIGNED_CONTEXT((#650))
GLOBAL_UNIT_ASSIGNED_CONTEXT((#654,#657,#655))
REPRESENTATION_CONTEXT('','3D')
);
#653=(
GEOMETRIC_REPRESENTATION_CONTEXT(3)
GLOBAL_UNCERTAINTY_ASSIGNED_CONTEXT((#651))
GLOBAL_UNIT_ASSIGNED_CONTEXT((#654,#657,#655))
REPRESENTATION_CONTEXT('','3D')
);
#654=(
LENGTH_UNIT()
NAMED_UNIT(*)
SI_UNIT(.MILLI.,.METRE.)
);
#655=(
NAMED_UNIT(*)
SI_UNIT($,.STERADIAN.)
SOLID_ANGLE_UNIT()
);
#656=DIMENSIONAL_EXPONENTS(0.,0.,0.,0.,0.,0.,0.);
#657=(
CONVERSION_BASED_UNIT('degree',#659)
NAMED_UNIT(#656)
PLANE_ANGLE_UNIT()
);
#658=(
NAMED_UNIT(*)
PLANE_ANGLE_UNIT()
SI_UNIT($,.RADIAN.)
);
#659=PLANE_ANGLE_MEASURE_WITH_UNIT(PLANE_ANGLE_MEASURE(0.01745329252),#658);
#660=SHAPE_DEFINITION_REPRESENTATION(#661,#662);
#661=PRODUCT_DEFINITION_SHAPE('',$,#664);
#662=SHAPE_REPRESENTATION('',(#396),#652);
#663=PRODUCT_DEFINITION_CONTEXT('part definition',#668,'design');
#664=PRODUCT_DEFINITION('End stop','End stop',#665,#663);
#665=PRODUCT_DEFINITION_FORMATION('',$,#670);
#666=PRODUCT_RELATED_PRODUCT_CATEGORY('End stop','End stop',(#670));
#667=APPLICATION_PROTOCOL_DEFINITION('international standard',
'automotive_design',2009,#668);
#668=APPLICATION_CONTEXT(
'Core Data for Automotive Mechanical Design Process');
#669=PRODUCT_CONTEXT('part definition',#668,'mechanical');
#670=PRODUCT('End stop','End stop',$,(#669));
#671=PRESENTATION_STYLE_ASSIGNMENT((#673));
#672=PRESENTATION_STYLE_ASSIGNMENT((#674));
#673=SURFACE_STYLE_USAGE(.BOTH.,#675);
#674=SURFACE_STYLE_USAGE(.BOTH.,#676);
#675=SURFACE_SIDE_STYLE('',(#677));
#676=SURFACE_SIDE_STYLE('',(#678));
#677=SURFACE_STYLE_FILL_AREA(#679);
#678=SURFACE_STYLE_FILL_AREA(#680);
#679=FILL_AREA_STYLE('',(#681));
#680=FILL_AREA_STYLE('',(#682));
#681=FILL_AREA_STYLE_COLOUR('',#683);
#682=FILL_AREA_STYLE_COLOUR('',#684);
#683=COLOUR_RGB('',0.352941176470588,0.352941176470588,0.352941176470588);
#684=COLOUR_RGB('',0.792156862745098,0.819607843137255,0.933333333333333);
ENDSEC;
END-ISO-10303-21;
