bme280.c:357:8:bme280_init	24	static
bme280.c:409:8:bme280_get_regs	40	static
bme280.c:442:8:bme280_set_regs	64	static
bme280.c:511:8:bme280_set_sensor_settings	24	static
bme280.c:554:8:bme280_get_sensor_settings	24	static
bme280.c:578:8:bme280_set_sensor_mode	24	static
bme280.c:610:8:bme280_get_sensor_mode	24	static
bme280.c:631:8:bme280_soft_reset	24	static
bme280.c:660:8:bme280_get_sensor_data	48	static
bme280.c:699:6:bme280_parse_sensor_data	32	static
bme280.c:738:8:bme280_compensate_data	32	static
bme280.c:781:15:set_osr_settings	32	static
bme280.c:802:15:set_osr_humidity_settings	24	static
bme280.c:834:15:set_osr_press_temp_settings	32	static
bme280.c:865:15:set_filter_standby_settings	32	static
bme280.c:896:13:fill_filter_settings	16	static
bme280.c:905:13:fill_standby_settings	16	static
bme280.c:914:13:fill_osr_press_settings	16	static
bme280.c:923:13:fill_osr_temp_settings	16	static
bme280.c:933:13:parse_device_settings	16	static
bme280.c:945:15:write_power_mode	24	static
bme280.c:971:15:put_device_to_sleep	32	static
bme280.c:995:15:reload_device_settings	24	static
bme280.c:1130:16:compensate_temperature	40	static
bme280.c:1163:17:compensate_pressure	216	static
bme280.c:1272:17:compensate_humidity	48	static
bme280.c:1311:15:get_calib_data	48	static
bme280.c:1347:13:interleave_reg_addr	32	static
bme280.c:1362:13:parse_temp_press_calib_data	24	static
bme280.c:1385:13:parse_humidity_calib_data	32	static
bme280.c:1408:16:are_settings_changed	24	static
bme280.c:1430:15:null_ptr_check	24	static
