stm32f3xx_hal_msp.c:84:6:HAL_MspInit	16	static
stm32f3xx_hal_msp.c:108:6:HAL_ADC_MspInit	48	static
stm32f3xx_hal_msp.c:144:6:HAL_ADC_MspDeInit	16	static
stm32f3xx_hal_msp.c:174:6:HAL_I2C_MspInit	48	static
stm32f3xx_hal_msp.c:220:6:HAL_I2C_MspDeInit	16	static
stm32f3xx_hal_msp.c:252:6:HAL_UART_MspInit	48	static
stm32f3xx_hal_msp.c:293:6:HAL_UART_MspDeInit	16	static
