Division,WeightClassKg,Place,Name,Team,BodyweightKg,Best3SquatKg,Best3BenchKg,Best3DeadliftKg,TotalKg,Equipment,Event,Sex,BirthDate
Boys,51.71,1,Braden Cayce,Wimberley,50.62,111.13,68.04,124.74,303.91,Single-ply,SBD,M,
Boys,51.71,2,Mason Falcone,Comal Davenport,49.99,113.4,52.16,122.47,288.03,Single-ply,SBD,M,
Boys,55.79,1,Marc Perez,San Antonio Southwest Legacy,55.34,136.08,77.11,154.22,367.41,Single-ply,SBD,M,
Boys,55.79,2,Silas Inclan,San Antonio Southside,55.34,131.54,61.23,131.54,324.32,Single-ply,SBD,M,
Boys,55.79,3,Jacob Tuckness,Comal Canyon Lake,54.98,108.86,77.11,131.54,317.51,Single-ply,SBD,M,
Boys,55.79,4,Joey Wilson,Comal Canyon Lake,55.07,124.74,61.23,108.86,294.84,Single-ply,SBD,M,
Boys,55.79,5,Cole Coffee,Comal Canyon Lake,51.89,102.06,56.7,115.67,274.42,Single-ply,SBD,M,
Boys,59.87,1,Ethan Brown,Bandera,58.51,170.1,106.59,176.9,453.59,Single-ply,SBD,M,
Boys,59.87,2,Miguel H Cruz,San Antonio Southwest Legacy,58.6,149.69,95.25,192.78,437.72,Single-ply,SBD,M,
Boys,59.87,3,Thomas Dorman,Comal Canyon Lake,59.33,149.69,83.91,151.95,385.55,Single-ply,SBD,M,
Boys,59.87,4,Robert Longoria,Pearsall,59.78,127.01,72.57,174.63,374.21,Single-ply,SBD,M,
Boys,59.87,5,Kaiden Lewis,Comal Canyon Lake,59.15,136.08,90.72,142.88,369.68,Single-ply,SBD,M,
Boys,59.87,6,Leo Esparza,Pearsall,57.61,131.54,70.31,147.42,349.27,Single-ply,SBD,M,
Boys,59.87,7,Joey Flewellen,Bandera,57.24,111.13,72.57,138.35,322.05,Single-ply,SBD,M,
Boys,59.87,8,Christopher Loera,San Antonio Kennedy,55.97,117.93,72.57,127.01,317.51,Single-ply,SBD,M,
Boys,59.87,9,Ashton Robinson,Bandera,59.6,117.93,70.31,127.01,315.25,Single-ply,SBD,M,
Boys,59.87,10,Connor Starjak,Comal Davenport,57.42,97.52,72.57,136.08,306.17,Single-ply,SBD,M,
Boys,59.87,11,Brandon Bower,Seguin,59.24,104.33,58.97,111.13,274.42,Single-ply,SBD,M,
Boys,59.87,DQ,Justin Abbott,Comal Canyon Lake,59.87,,,,,Single-ply,SBD,M,
Boys,67.13,1,Nacious Jaquez,San Antonio Kennedy,66.68,197.31,117.93,192.78,508.02,Single-ply,SBD,M,
Boys,67.13,2,Kingston Martinez,Pearsall,65.5,172.37,102.06,195.04,469.47,Single-ply,SBD,M,
Boys,67.13,3,Jacob Rodriguez,San Antonio Southside,64.86,190.51,97.52,174.63,462.66,Single-ply,SBD,M,
Boys,67.13,4,Reid Simpson,Comal Canyon Lake,66.13,170.1,111.13,172.37,453.59,Single-ply,SBD,M,
Boys,67.13,5,Trent Jones,Runge,66.68,163.29,90.72,167.83,421.84,Single-ply,SBD,M,
Boys,67.13,6,Tyler Adams,Pettus,66.13,142.88,92.99,151.95,387.82,Single-ply,SBD,M,
Boys,67.13,7,Talan Smith,Comal Canyon Lake,65.05,136.08,95.25,142.88,374.21,Single-ply,SBD,M,
Boys,67.13,8,Rafik Ali,Seguin,66.95,138.35,72.57,142.88,353.8,Single-ply,SBD,M,
Boys,67.13,9,Mel Garcia,Pettus,60.24,131.54,61.23,147.42,340.19,Single-ply,SBD,M,
Boys,67.13,10,Matthew Rodriguez,San Antonio Kennedy,64.77,108.86,63.5,149.69,322.05,Single-ply,SBD,M,
Boys,67.13,11,Eduardo Cerna,Seguin,67.04,104.33,70.31,131.54,306.17,Single-ply,SBD,M,
Boys,67.13,12,Hunter Avila,Comal Davenport,61.42,108.86,63.5,127.01,299.37,Single-ply,SBD,M,
Boys,67.13,13,Andres Garcia,Comal Davenport,62.96,104.33,68.04,122.47,294.84,Single-ply,SBD,M,
Boys,67.13,DQ,Gavin Gutierrez,Runge,63.32,158.76,,,,Single-ply,SBD,M,
Boys,67.13,DQ,Jo Fraga,Runge,65.95,195.04,,,,Single-ply,SBD,M,
Boys,74.84,1,Christopher Rodriguez,San Antonio Southside,69.49,226.8,127.01,204.12,557.92,Single-ply,SBD,M,
Boys,74.84,2,Jayden Correa,San Antonio Southwest Legacy,73.39,199.58,104.33,208.65,512.56,Single-ply,SBD,M,
Boys,74.84,3,Adam Gonzalez,San Antonio Southwest Legacy,73.12,188.24,95.25,208.65,492.15,Single-ply,SBD,M,
Boys,74.84,4,Randy Contreras,San Antonio Kennedy,72.12,183.7,77.11,190.51,451.32,Single-ply,SBD,M,
Boys,74.84,5,Jose Torres-Salazar,San Antonio Southwest Legacy,70.85,154.22,120.2,165.56,439.98,Single-ply,SBD,M,
Boys,74.84,6,Fernando Casas,San Antonio Kennedy,69.49,165.56,88.45,183.7,437.72,Single-ply,SBD,M,
Boys,74.84,7,Gio Alvarado,Wimberley,74.21,179.17,86.18,170.1,435.45,Single-ply,SBD,M,
Boys,74.84,8,Danny Freeman,Bandera,71.3,170.1,92.99,154.22,417.3,Single-ply,SBD,M,
Boys,74.84,9,Matthew Chavez,Bandera,73.12,158.76,97.52,161.03,417.3,Single-ply,SBD,M,
Boys,74.84,10,Patrick Hecox,Comal Davenport,70.76,136.08,117.93,156.49,410.5,Single-ply,SBD,M,
Boys,74.84,11,Benjamin Martinez,Seguin,74.66,147.42,79.38,158.76,385.55,Single-ply,SBD,M,
Boys,74.84,12,Cody Jureczki,Bandera,67.31,99.79,72.57,142.88,315.25,Single-ply,SBD,M,
Boys,82.1,1,Jacob Montoya,San Antonio Southside,79.56,199.58,133.81,201.85,535.24,Single-ply,SBD,M,
Boys,82.1,2,Matthew Staton,Bandera,78.11,195.04,136.08,201.85,532.97,Single-ply,SBD,M,
Boys,82.1,3,Matthew Elson,Comal Canyon Lake,81.37,210.92,117.93,195.04,523.9,Single-ply,SBD,M,
Boys,82.1,4,Timothy Donihoo,Yoakum,81.83,174.63,106.59,195.04,476.27,Single-ply,SBD,M,
Boys,82.1,5,Rafael Villalpando,San Antonio Southwest Legacy,80.29,170.1,104.33,188.24,462.66,Single-ply,SBD,M,
Boys,82.1,6,Jaxon Joudah,Comal Davenport,75.02,165.56,106.59,183.7,455.86,Single-ply,SBD,M,
Boys,82.1,7,Ryan Howe,Comal Davenport,77.84,147.42,90.72,183.7,421.84,Single-ply,SBD,M,
Boys,82.1,8,George Cabasos,Bandera,78.02,176.9,86.18,133.81,396.89,Single-ply,SBD,M,
Boys,82.1,9,Jack Gonzalez,Comal Davenport,81.47,158.76,83.91,147.42,390.09,Single-ply,SBD,M,
Boys,82.1,10,Caden Rodriguez,Comal Canyon Lake,76.02,145.15,81.65,154.22,381.02,Single-ply,SBD,M,
Boys,82.1,11,Kaleb Flores,Seguin,81.83,104.33,104.33,108.86,317.51,Single-ply,SBD,M,
Boys,82.1,12,Markus Advison,Comal Davenport,75.39,115.67,70.31,120.2,306.17,Single-ply,SBD,M,
Boys,89.81,1,Nathan Peralta,San Antonio Southside,87.82,247.21,147.42,247.21,641.83,Single-ply,SBD,M,
Boys,89.81,2,Trace Higginbotham,San Antonio Cornerstone Christian School,83.19,247.21,113.4,206.38,566.99,Single-ply,SBD,M,
Boys,89.81,3,Andrew Chavez,San Antonio Southside,89.45,210.92,133.81,197.31,542.04,Single-ply,SBD,M,
Boys,89.81,4,Abraham Padilla,San Antonio Southwest Legacy,88.81,226.8,115.67,183.7,526.17,Single-ply,SBD,M,
Boys,89.81,5,Rudy Lara,San Antonio Southwest Legacy,88.72,199.58,102.06,217.72,519.36,Single-ply,SBD,M,
Boys,89.81,6,Isreal Reyes,Pearsall,87.82,195.04,113.4,199.58,508.02,Single-ply,SBD,M,
Boys,89.81,7,Naythan Pena,San Antonio Southwest Legacy,88.81,183.7,122.47,188.24,494.42,Single-ply,SBD,M,
Boys,89.81,8,Nathan Shearer,San Antonio Southwest Legacy,88.9,188.24,117.93,176.9,483.08,Single-ply,SBD,M,
Boys,89.81,9,Jack Boyle,Wimberley,84.01,181.44,102.06,197.31,480.81,Single-ply,SBD,M,
Boys,89.81,10,Owen O'Neil,Wimberley,87.45,181.44,104.33,185.97,471.74,Single-ply,SBD,M,
Boys,89.81,11,Wyatt Franchione,Wimberley,87.27,174.63,108.86,176.9,460.4,Single-ply,SBD,M,
Boys,89.81,12,Nathan Mason,San Antonio Kennedy,89.09,188.24,86.18,183.7,458.13,Single-ply,SBD,M,
Boys,89.81,13,John Mireles,Seguin,84.19,136.08,79.38,136.08,351.53,Single-ply,SBD,M,
Boys,89.81,14,Luke Bertling,Seguin,87.36,124.74,97.52,124.74,347,Single-ply,SBD,M,
Boys,89.81,15,Kamren Meyer,Yoakum,89.72,115.67,74.84,129.27,319.78,Single-ply,SBD,M,
Boys,89.81,16,Jack Meyer,Yoakum,88.72,113.4,63.5,117.93,294.84,Single-ply,SBD,M,
Boys,99.79,1,Fabian Alvarez,San Antonio Southwest Legacy,97.7,235.87,145.15,240.4,621.42,Single-ply,SBD,M,
Boys,99.79,2,Alfredo Romero,San Antonio Kennedy,95.07,235.87,131.54,226.8,594.21,Single-ply,SBD,M,
Boys,99.79,3,Kaloeb Son,Bandera,97.16,231.33,133.81,215.46,580.6,Single-ply,SBD,M,
Boys,99.79,4,Callan Drum,Wimberley,93.89,183.7,88.45,183.7,455.86,Single-ply,SBD,M,
Boys,99.79,5,Jared Rogers,Seguin,98.61,174.63,106.59,165.56,446.79,Single-ply,SBD,M,
Boys,99.79,6,Lucio Ramirez,Pearsall,97.98,185.97,97.52,136.08,419.57,Single-ply,SBD,M,
Boys,99.79,7,Joseph Ramirez,Seguin,97.07,149.69,95.25,138.35,383.29,Single-ply,SBD,M,
Boys,99.79,8,Kenneth Taylor,Pearsall,94.26,133.81,70.31,115.67,319.78,Single-ply,SBD,M,
Boys,99.79,DQ,Patrick Segura,Runge,90.17,,,,,Single-ply,SBD,M,
Boys,109.77,1,Ethan Tullos-Chapa,San Antonio Southwest Legacy,108.05,283.5,183.7,251.74,718.94,Single-ply,SBD,M,
Boys,109.77,2,Cody Wilkerson,San Antonio Southside,109.5,254.01,158.76,260.82,673.58,Single-ply,SBD,M,
Boys,109.77,3,Adan Rodriguez,Comal Davenport,107.5,247.21,158.76,231.33,637.3,Single-ply,SBD,M,
Boys,109.77,4,Mauricio Pecina,Yoakum,102.69,247.21,149.69,226.8,623.69,Single-ply,SBD,M,
Boys,109.77,5,Sebastian Carrilo,Pearsall,104.69,199.58,117.93,183.7,501.22,Single-ply,SBD,M,
Boys,109.77,6,Ethan Boyd,Bandera,106.05,188.24,131.54,181.44,501.22,Single-ply,SBD,M,
Boys,109.77,7,Jorge Perez,Comal Davenport,108.05,124.74,70.31,158.76,353.8,Single-ply,SBD,M,
Boys,109.77,8,Kase Underwood,Comal Davenport,100.24,102.06,54.43,122.47,278.96,Single-ply,SBD,M,
Boys,109.77,9,Matthew Caldwell,Seguin,103.87,92.99,58.97,102.06,254.01,Single-ply,SBD,M,
Boys,124.74,1,Ethan Dranowsky,San Antonio Kennedy,112.04,263.08,147.42,233.6,644.1,Single-ply,SBD,M,
Boys,124.74,2,Isaiah Ulibarri,San Antonio Southwest Legacy,119.84,249.48,145.15,217.72,612.35,Single-ply,SBD,M,
Boys,124.74,3,Jimmy Mendoza,Comal Canyon Lake,117.57,226.8,124.74,233.6,585.13,Single-ply,SBD,M,
Boys,124.74,4,Isaiah Ricondo,San Antonio Cornerstone Christian School,118.75,226.8,142.88,215.46,585.13,Single-ply,SBD,M,
Boys,124.74,5,Jace Dawson,San Antonio Cornerstone Christian School,121.56,204.12,147.42,183.7,535.24,Single-ply,SBD,M,
Boys,124.74,6,Alexander Rivera,San Antonio Southwest Legacy,114.67,188.24,124.74,206.38,519.36,Single-ply,SBD,M,
Boys,124.74,7,Adrian Perez,San Antonio Southwest Legacy,112.04,183.7,106.59,183.7,474,Single-ply,SBD,M,
Boys,124.74,8,Colton Graham,Seguin,121.2,163.29,102.06,174.63,439.98,Single-ply,SBD,M,
Boys,124.74,9,Emiliano Prieto,Comal Davenport,119.84,142.88,83.91,165.56,392.36,Single-ply,SBD,M,
Boys,124.74,10,Jackson LaBouliere,Wimberley,115.48,142.88,95.25,142.88,381.02,Single-ply,SBD,M,
Boys,124.74,DQ,Reid Jackson,Wimberley,115.85,,,,,Single-ply,SBD,M,
Boys,124.74,DQ,Gabriel Guttierrez,Pearsall,115.12,,,,,Single-ply,SBD,M,
Boys,124.74,DQ,Ismael Gonzales,Pearsall,119.84,,,,,Single-ply,SBD,M,
Boys,139.71,1,Noah Sizemore,Bandera,133.9,258.55,133.81,206.38,598.74,Single-ply,SBD,M,
Boys,139.71,2,Manuel Reyna,San Antonio Kennedy,131.54,195.04,90.72,226.8,512.56,Single-ply,SBD,M,
Boys,139.71,3,Bryan Juarez,San Antonio Southwest Legacy,129.27,108.86,77.11,145.15,331.12,Single-ply,SBD,M,
Boys,139.71,DQ,Ryan Hughes,Pearsall,125.1,217.72,117.93,,,Single-ply,SBD,M,
Boys,139.71+,1,Sebastian Villarreal,San Antonio Kennedy,148.42,170.1,124.74,170.1,464.93,Single-ply,SBD,M,
