Division,WeightClassKg,Place,Name,Team,BodyweightKg,Best3SquatKg,Best3BenchKg,Best3DeadliftKg,TotalKg,Equipment,Event,Sex,BirthDate
Boys,51.71,1,Austin Molina,Odem,49.44,122.47,70.31,124.74,317.51,Single-ply,SBD,M,
Boys,55.79,1,Adam Romero,Odem,55.79,124.74,92.99,147.42,365.14,Single-ply,SBD,M,
Boys,59.87,1,James Adams,Odem,59.87,204.12,124.74,199.58,528.44,Single-ply,SBD,M,
Boys,59.87,2,Daniel Cantu,Corpus Christi West Oso,58.06,120.2,92.99,154.22,367.41,Single-ply,SBD,M,
Boys,67.13,1,Jerek Sanchez,Sinton,66.13,226.8,174.63,254.01,655.44,Single-ply,SBD,M,
Boys,67.13,2,Marco Gonzales,Odem,67.13,185.97,115.67,183.7,485.34,Single-ply,SBD,M,
Boys,67.13,3,Itzac Cruz,Odem,67.04,151.95,113.4,149.69,415.04,Single-ply,SBD,M,
Boys,67.13,4,Francisco Torres,Taft,66.5,151.95,77.11,165.56,394.63,Single-ply,SBD,M,
Boys,67.13,5,Jace Ruiz,Three Rivers,61.87,131.54,86.18,156.49,374.21,Single-ply,SBD,M,
Boys,67.13,6,Nick Garza,Taft,60.96,142.88,83.91,145.15,371.95,Single-ply,SBD,M,
Boys,67.13,7,Landon Longoria,Sinton,64.23,129.27,77.11,142.88,349.27,Single-ply,SBD,M,
Boys,67.13,8,Carson Guidry,Taft,62.32,113.4,86.18,136.08,335.66,Single-ply,SBD,M,
Boys,67.13,9,Royce Hernandez,Sinton,61.14,127.01,65.77,129.27,322.05,Single-ply,SBD,M,
Boys,67.13,DQ,Mark Morin,Three Rivers,62.87,117.93,72.57,,,Single-ply,SBD,M,
Boys,74.84,1,Jaden Howard,Sinton,73.03,190.51,142.88,219.99,553.38,Single-ply,SBD,M,
Boys,74.84,2,Alfredo Gomez,Taft,74.57,158.76,102.06,174.63,435.45,Single-ply,SBD,M,
Boys,74.84,3,Joseph Reyes,Corpus Christi West Oso,69.4,133.81,83.91,142.88,360.61,Single-ply,SBD,M,
Boys,74.84,DQ,Joseph Chavez,Taft,72.76,,,,,Single-ply,SBD,M,
Boys,74.84,DQ,Josh Ynfante,Odem,69.49,142.88,,,,Single-ply,SBD,M,
Boys,82.1,1,Alex Beltran,Odem,82.1,210.92,111.13,204.12,526.17,Single-ply,SBD,M,
Boys,82.1,2,Marcello Nieto,Taft,78.74,192.78,92.99,192.78,478.54,Single-ply,SBD,M,
Boys,82.1,3,Fernando Vega,Corpus Christi West Oso,76.02,151.95,106.59,174.63,433.18,Single-ply,SBD,M,
Boys,82.1,4,Jason Martinez,Taft,77.2,158.76,83.91,183.7,426.38,Single-ply,SBD,M,
Boys,82.1,5,Jaden Zapata,Sinton,80.2,158.76,81.65,172.37,412.77,Single-ply,SBD,M,
Boys,82.1,6,Xzavier Rodriguez,Odem,76.02,142.88,97.52,165.56,405.97,Single-ply,SBD,M,
Boys,82.1,7,Jaysean Banks,Three Rivers,75.48,129.27,95.25,156.49,381.02,Single-ply,SBD,M,
Boys,82.1,8,Thomas Hull,Sinton,79.2,102.06,52.16,131.54,285.76,Single-ply,SBD,M,
Boys,89.81,1,Brandon Beltran,Odem,89.81,272.16,174.63,215.46,662.24,Single-ply,SBD,M,
Boys,89.81,2,Zach Santellana,Sinton,85.37,183.7,102.06,163.29,449.06,Single-ply,SBD,M,
Boys,89.81,3,Joshua Nunez,Odem,88.99,61.23,45.36,77.11,183.7,Single-ply,SBD,M,
Boys,99.79,1,Isaac Reyes,Corpus Christi West Oso,90.26,188.24,138.35,188.24,514.83,Single-ply,SBD,M,
Boys,99.79,2,Cameron Garcia,Three Rivers,92.62,142.88,111.13,142.88,396.89,Single-ply,SBD,M,
Boys,99.79,3,Vicente Perez,Taft,95.44,129.27,74.84,124.74,328.85,Single-ply,SBD,M,
Boys,99.79,DQ,Eduardo Medina,Odem,90.63,192.78,115.67,,,Single-ply,SBD,M,
Boys,99.79,DQ,Jacob Ramos,Corpus Christi West Oso,93.98,,,,,Single-ply,SBD,M,
Boys,99.79,DQ,Jonathan Moran,Odem,96.43,133.81,,,,Single-ply,SBD,M,
Boys,109.77,1,Daniel Tamez,Odem,102.24,274.42,154.22,258.55,687.19,Single-ply,SBD,M,
Boys,109.77,2,Nathan Reyes,Corpus Christi West Oso,105.6,204.12,142.88,219.99,566.99,Single-ply,SBD,M,
Boys,109.77,DQ,Rey Salinas,Odem,105.78,167.83,,147.42,,Single-ply,SBD,M,
Boys,124.74,1,Jesse Siegford,Odem,110.04,249.48,136.08,204.12,589.67,Single-ply,SBD,M,
Boys,124.74,2,Coleman Anderson,Three Rivers,120.93,149.69,117.93,158.76,426.38,Single-ply,SBD,M,
Boys,124.74,3,Christopher Leyba,Corpus Christi West Oso,119.02,136.08,106.59,142.88,385.55,Single-ply,SBD,M,
Boys,139.71,1,Nate Martinez,Sinton,136.62,288.03,188.24,249.48,725.75,Single-ply,SBD,M,
Boys,139.71,2,Elijah Brown,Sinton,124.78,285.76,161.03,251.74,698.53,Single-ply,SBD,M,
Boys,139.71,3,Jacob Gomez,Taft,125.37,240.4,158.76,195.04,594.21,Single-ply,SBD,M,
Boys,139.71,4,Samuel Morales,Sinton,133.72,235.87,122.47,197.31,555.65,Single-ply,SBD,M,
Boys,139.71,5,Brandon Montez,Taft,127.1,183.7,102.06,190.51,476.27,Single-ply,SBD,M,
Boys,139.71,6,Joe Hernandez,Corpus Christi West Oso,127.73,183.7,147.42,142.88,474,Single-ply,SBD,M,
Boys,139.71+,1,Dalton Romo,Three Rivers,175.81,108.86,77.11,131.54,317.51,Single-ply,SBD,M,
