Division,WeightClassKg,Place,Name,Team,BodyweightKg,Best3SquatKg,Best3BenchKg,Best3DeadliftKg,TotalKg,Equipment,Event,Sex,BirthDate
Boys,51.71,1,Kennedy Pelico,League City Clear Creek,50.53,129.27,79.38,140.61,349.27,Single-ply,SBD,M,
Boys,51.71,2,Cory Newkirk,Hardin,51.71,102.06,52.16,113.4,267.62,Single-ply,SBD,M,
Boys,51.71,3,Micah Johnson,Hardin,46.81,61.23,49.9,99.79,210.92,Single-ply,SBD,M,
Boys,55.79,1,Chris McCarty,Hardin,55.52,131.54,70.31,142.88,344.73,Single-ply,SBD,M,
Boys,55.79,2,Aiden Aguillard,Buna,55.79,124.74,72.57,147.42,344.73,Single-ply,SBD,M,
Boys,55.79,3,Mark Villegas,Liberty,53.34,131.54,54.43,131.54,317.51,Single-ply,SBD,M,
Boys,59.87,1,Miguel Velez,League City Clear Creek,59.87,165.56,83.91,174.63,424.11,Single-ply,SBD,M,
Boys,59.87,2,Logan Houghton,Saratoga West Hardin,57.7,117.93,81.65,133.81,333.39,Single-ply,SBD,M,
Boys,59.87,3,Weston Louviere,Saratoga West Hardin,59.87,115.67,70.31,140.61,326.59,Single-ply,SBD,M,
Boys,67.13,1,Cody Seaman,Buna,64.59,165.56,92.99,176.9,435.45,Single-ply,SBD,M,
Boys,67.13,2,Tyler Thibodeaux,Hull-Daisetta,66.32,156.49,102.06,174.63,433.18,Single-ply,SBD,M,
Boys,67.13,3,Hau Pham,Anahuac,64.32,172.37,81.65,165.56,419.57,Single-ply,SBD,M,
Boys,67.13,4,Aiden LaFleur,Liberty,67.04,149.69,113.4,147.42,410.5,Single-ply,SBD,M,
Boys,67.13,5,Drake Brightwell,Anahuac,63.05,115.67,77.11,142.88,335.66,Single-ply,SBD,M,
Boys,67.13,6,Xander Woods,Hull-Daisetta,63.87,108.86,70.31,154.22,333.39,Single-ply,SBD,M,
Boys,67.13,7,Clay Witherspoon,Anahuac,64.05,136.08,70.31,124.74,331.12,Single-ply,SBD,M,
Boys,67.13,8,Baylor Lanferman,Anahuac,62.78,102.06,61.23,131.54,294.84,Single-ply,SBD,M,
Boys,67.13,9,Wesley Thompson,Saratoga West Hardin,66.86,90.72,74.84,113.4,278.96,Single-ply,SBD,M,
Boys,67.13,DQ,Donaldo Anastacio,Kirbyville,64.23,158.76,92.99,,,Single-ply,SBD,M,
Boys,74.84,1,Landon Gunter,League City Clear Creek,71.12,204.12,120.2,183.7,508.02,Single-ply,SBD,M,
Boys,74.84,2,Bryce Weaver,League City Clear Creek,74.75,183.7,111.13,183.7,478.54,Single-ply,SBD,M,
Boys,74.84,3,Caden Knox,Beaumont Monsignor Kelly,73.12,181.44,95.25,181.44,458.13,Single-ply,SBD,M,
Boys,74.84,4,Matthew Hughes,Hardin,73.66,192.78,124.74,185.97,503.49,Single-ply,SBD,M,
Boys,74.84,5,Kaiden Jordan,Saratoga West Hardin,73.94,172.37,97.52,172.37,442.25,Single-ply,SBD,M,
Boys,74.84,6,Caiden Anders,Hull-Daisetta,69.94,158.76,77.11,174.63,410.5,Single-ply,SBD,M,
Boys,74.84,7,Isaac Canas,League City Clear Creek,72.3,145.15,95.25,156.49,396.89,Single-ply,SBD,M,
Boys,74.84,DQ,Bryson Campbell,Anahuac,74.21,,,,,Single-ply,SBD,M,
Boys,82.1,1,Rocky Ketchum,League City Clear Creek,82.1,215.46,120.2,233.6,569.26,Single-ply,SBD,M,
Boys,82.1,2,Justin Maze,Beaumont Monsignor Kelly,75.75,217.72,122.47,217.72,557.92,Single-ply,SBD,M,
Boys,82.1,3,Bryson Sheppard,Buna,79.47,213.19,86.18,238.14,537.51,Single-ply,SBD,M,
Boys,82.1,4,Corbin Seals,Buna,81.19,185.97,124.74,176.9,487.61,Single-ply,SBD,M,
Boys,82.1,5,Roberto Alverez,Anahuac,77.38,108.86,63.5,136.08,308.44,Single-ply,SBD,M,
Boys,82.1,6,Manny Freeman,Liberty,76.29,183.7,111.13,,294.84,Single-ply,SB,M,
Boys,82.1,DQ,Nhan Pham,Anahuac,80.83,,,,,Single-ply,SBD,M,
Boys,89.81,1,Enrique Tellez,Livingston,88.63,233.6,142.88,224.53,601.01,Single-ply,SBD,M,
Boys,89.81,2,Brayden Ethier,Livingston,85.82,217.72,129.27,208.65,555.65,Single-ply,SBD,M,
Boys,89.81,3,Mason Totzer,Anahuac,87.72,192.78,113.4,204.12,510.29,Single-ply,SBD,M,
Boys,89.81,4,Jacob Kelley,Kirbyville,86.18,199.58,115.67,181.44,496.68,Single-ply,SBD,M,
Boys,89.81,5,Trace Marks,Buna,88,188.24,117.93,188.24,494.42,Single-ply,SBD,M,
Boys,89.81,6,Dalton Hendrix,Anahuac,84.28,183.7,108.86,190.51,483.08,Single-ply,SBD,M,
Boys,89.81,7,Mason Wells,Saratoga West Hardin,89.45,140.61,122.47,185.97,449.06,Single-ply,SBD,M,
Boys,89.81,DQ,Luis Moreno,Liberty,87.82,210.92,,,,Single-ply,SBD,M,
Boys,99.79,1,Shane Holst,Hardin,98.88,254.01,161.03,267.62,682.66,Single-ply,SBD,M,
Boys,99.79,2,Joe Garcia,Liberty,97.61,204.12,129.27,213.19,546.58,Single-ply,SBD,M,
Boys,99.79,3,Conner Drake,Hull-Daisetta,98.61,183.7,127.01,197.31,508.02,Single-ply,SBD,M,
Boys,99.79,4,Presley Mouton,Anahuac,90.63,172.37,111.13,183.7,467.2,Single-ply,SBD,M,
Boys,99.79,DQ,Ethan Pham,Beaumont Monsignor Kelly,98.88,,,,,Single-ply,SBD,M,
Boys,109.77,1,Aaron Raya,League City Clear Creek,102.69,204.12,127.01,215.46,546.58,Single-ply,SBD,M,
Boys,109.77,2,Holden Loper,Saratoga West Hardin,109.04,238.14,113.4,192.78,544.31,Single-ply,SBD,M,
Boys,109.77,3,Cody Mendenhall,Hardin,106.32,183.7,124.74,217.72,526.17,Single-ply,SBD,M,
Boys,109.77,4,Collin Alverson,Hull-Daisetta,103.15,192.78,127.01,183.7,503.49,Single-ply,SBD,M,
Boys,109.77,5,Adrian Ibara,Hardin,106.96,165.56,120.2,210.92,496.68,Single-ply,SBD,M,
Boys,124.74,1,Zac Davis,Liberty,111.31,226.8,142.88,226.8,596.47,Single-ply,SBD,M,
Boys,124.74,2,Cord Carter,Liberty,109.86,204.12,154.22,215.46,573.79,Single-ply,SBD,M,
Boys,124.74,3,Campbell Melcher,League City Clear Creek,118.93,199.58,127.01,201.85,528.44,Single-ply,SBD,M,
Boys,124.74,4,Jarron Roden,Kirbyville,121.65,192.78,136.08,195.04,523.9,Single-ply,SBD,M,
Boys,124.74,5,Josiah Dawsey,League City Clear Creek,113.85,192.78,133.81,195.04,521.63,Single-ply,SBD,M,
Boys,124.74,6,Lane Abshier,Hull-Daisetta,112.94,204.12,115.67,181.44,501.22,Single-ply,SBD,M,
Boys,124.74,7,Kayden Flowers,Hull-Daisetta,120.75,158.76,129.27,145.15,433.18,Single-ply,SBD,M,
Boys,124.74,8,Carlos Guitierrez,Anahuac,118.75,151.95,92.99,158.76,403.7,Single-ply,SBD,M,
Boys,139.71,1,Treye Atkinson,Livingston,132.81,226.8,111.13,215.46,553.38,Single-ply,SBD,M,
Boys,139.71,2,Jason Ford,Hull-Daisetta,131.09,165.56,113.4,176.9,455.86,Single-ply,SBD,M,
Boys,139.71,3,Grayson Vanya,Saratoga West Hardin,130.91,185.97,92.99,163.29,442.25,Single-ply,SBD,M,
Boys,,NS,Braden Lanferman,Anahuac,,,,,,Single-ply,SBD,M,
Boys,,NS,Adrian Manning,Anahuac,,,,,,Single-ply,SBD,M,
Boys,,NS,Seth Sterns,Liberty,,,,,,Single-ply,SBD,M,
