Division,WeightClassKg,Place,Name,Team,BodyweightKg,Best3SquatKg,Best3BenchKg,Best3DeadliftKg,TotalKg,Equipment,Event,Sex,BirthDate
Boys,55.79,1,Terrynce Williams,Terrell,55.79,142.88,47.63,142.88,333.39,Single-ply,SBD,M,
Boys,59.87,1,Andre Bishop,West Mesquite,59.42,124.74,74.84,147.42,347,Single-ply,SBD,M,
Boys,67.13,1,Chase Bingmon,Terrell,66.68,188.24,83.91,192.78,464.93,Single-ply,SBD,M,
Boys,67.13,2,De'Juan Limbrick,West Mesquite,66.86,174.63,102.06,183.7,460.4,Single-ply,SBD,M,
Boys,74.84,1,Caroderick Washington,West Mesquite,73.94,156.49,88.45,156.49,401.43,Single-ply,SBD,M,
Boys,74.84,2,Ethan Huckabee,Terrell,74.84,138.35,79.38,161.03,378.75,Single-ply,SBD,M,
Boys,82.1,1,Canaan Dirden,West Mesquite,81.65,183.7,113.4,206.38,503.49,Single-ply,SBD,M,
Boys,82.1,2,Nathan Reyes,West Mesquite,76.2,158.76,88.45,179.17,426.38,Single-ply,SBD,M,
Boys,89.81,1,Terry Davis,Terrell,89.81,204.12,113.4,188.24,505.76,Single-ply,SBD,M,
Boys,89.81,2,Christien Hedgeman,Terrell,89.81,183.7,83.91,192.78,460.4,Single-ply,SBD,M,
Boys,99.79,1,Cody Phillips,Terrell,99.79,170.1,99.79,192.78,462.66,Single-ply,SBD,M,
Boys,99.79,2,Vick Braylon,Terrell,99.79,183.7,104.33,170.1,458.13,Single-ply,SBD,M,
Boys,99.79,3,Marvian Proctor,West Mesquite,96.62,183.7,97.52,170.1,451.32,Single-ply,SBD,M,
Boys,99.79,4,Dean Henderson,Terrell,97.52,156.49,83.91,183.7,424.11,Single-ply,SBD,M,
Boys,99.79,5,Christian Watts,West Mesquite,94.8,154.22,90.72,174.63,419.57,Single-ply,SBD,M,
Boys,109.77,1,Vincson Haynes,West Mesquite,107.5,183.7,108.86,181.44,474,Single-ply,SBD,M,
Boys,109.77,2,Hearsey McGrady,Terrell,101.6,165.56,117.93,147.42,430.91,Single-ply,SBD,M,
Boys,109.77,3,Sameul Aguilar,West Mesquite,104.78,147.42,95.25,183.7,426.38,Single-ply,SBD,M,
Boys,124.74,1,Artavion Brown,West Mesquite,111.13,204.12,111.13,183.7,498.95,Single-ply,SBD,M,
Boys,124.74,2,Kylon Holmes,Terrell,122.47,142.88,113.4,192.78,449.06,Single-ply,SBD,M,
Boys,124.74,3,Anthony Wynne,Terrell,123.38,174.63,92.99,161.03,428.64,Single-ply,SBD,M,
Boys,124.74,4,Victor Chatman,West Mesquite,118.39,161.03,102.06,136.08,399.16,Single-ply,SBD,M,
Boys,139.71+,1,Nick Singleton,West Mesquite,167.38,226.8,124.74,204.12,555.65,Single-ply,SBD,M,
Boys,139.71+,2,Josh Nwanka,Terrell,149.69,156.49,124.74,192.78,474,Single-ply,SBD,M,
