Division,WeightClassKg,Place,Name,Team,BodyweightKg,Best3SquatKg,Best3BenchKg,Best3DeadliftKg,TotalKg,Equipment,Event,Sex,BirthDate
Boys,51.71,1,Tyler Morrow,Copperas Cove,51.12,195.04,92.99,226.8,514.83,Single-ply,SBD,M,
Boys,51.71,2,Tristian Petit,Copperas Cove,50.98,122.47,61.23,136.08,319.78,Single-ply,SBD,M,
Boys,51.71,3,Tr'Darion Taylor,Temple,51.71,108.86,63.5,124.74,297.1,Single-ply,SBD,M,
Boys,51.71,4,Colin Gascon,Belton,51.71,108.86,61.23,117.93,288.03,Single-ply,SBD,M,
Boys,51.71,DQ,Tahj Hughes,Killeen Ellison,51.71,,,,,Single-ply,SBD,M,
Boys,51.71,DQ,Andrew Gonzalez,Waco,51.26,95.25,,,,Single-ply,SBD,M,
Boys,55.79,1,Isaac Jones,Belton,55.47,174.63,102.06,195.04,471.74,Single-ply,SBD,M,
Boys,55.79,2,Nick Perez,Belton,54.79,131.54,77.11,151.95,360.61,Single-ply,SBD,M,
Boys,55.79,3,Gabriel Lopez,Waco Midway,53.43,127.01,65.77,108.86,301.64,Single-ply,SBD,M,
Boys,55.79,4,Daniel Fuentes,Temple,54.98,108.86,68.04,120.2,297.1,Single-ply,SBD,M,
Boys,55.79,5,Ke'Andre Hamilton,Waco University,55.79,111.13,54.43,115.67,281.23,Single-ply,SBD,M,
Boys,55.79,6,Lucas May,Killeen Ellison,54.7,92.99,61.23,108.86,263.08,Single-ply,SBD,M,
Boys,59.87,1,Ritchie Willess,Belton,58.79,170.1,106.59,197.31,474,Single-ply,SBD,M,
Boys,59.87,2,Malachi Seawood-Martinez,Killeen Harker Heights,59.74,127.01,72.57,131.54,331.12,Single-ply,SBD,M,
Boys,59.87,3,Trent Ward,Killeen Harker Heights,57.29,113.4,74.84,129.27,317.51,Single-ply,SBD,M,
Boys,59.87,4,Zachary Villarreal,Waco Midway,57.61,124.74,70.31,122.47,317.51,Single-ply,SBD,M,
Boys,59.87,5,Ayden Gascon,Belton,56.11,99.79,63.5,106.59,269.89,Single-ply,SBD,M,
Boys,67.13,1,Lezlie Jackson,Temple,66.68,181.44,90.72,188.24,460.4,Single-ply,SBD,M,
Boys,67.13,2,Bj Pitts,Waco Midway,66.13,174.63,97.52,185.97,458.13,Single-ply,SBD,M,
Boys,67.13,3,Jailen Alon-Alon,Killeen Harker Heights,65.63,156.49,113.4,181.44,451.32,Single-ply,SBD,M,
Boys,67.13,4,Giani Zecca,Belton,66.09,156.49,90.72,172.37,419.57,Single-ply,SBD,M,
Boys,67.13,5,Xavier Tacilbon,Copperas Cove,63.28,154.22,102.06,161.03,417.3,Single-ply,SBD,M,
Boys,67.13,6,Quintarius Fisher,Waco,65.5,156.49,77.11,158.76,392.36,Single-ply,SBD,M,
Boys,67.13,7,Jonathan Campos,Waco,65.59,154.22,74.84,163.29,392.36,Single-ply,SBD,M,
Boys,67.13,8,Joshua Donoso,Temple,61.82,149.69,88.45,149.69,387.82,Single-ply,SBD,M,
Boys,67.13,9,Tadrian Alexander,Waco Midway,60.83,142.88,79.38,147.42,369.68,Single-ply,SBD,M,
Boys,67.13,10,Duncan Davis,Waco Midway,66.36,133.81,77.11,156.49,367.41,Single-ply,SBD,M,
Boys,67.13,11,Ponciano Valdez,Temple,65.68,136.08,79.38,142.88,358.34,Single-ply,SBD,M,
Boys,67.13,12,Ladarrius Evans,Waco University,64.46,117.93,65.77,172.37,356.07,Single-ply,SBD,M,
Boys,67.13,13,Jason Hernandez,Killeen Ellison,66.09,120.2,79.38,151.95,351.53,Single-ply,SBD,M,
Boys,67.13,14,Reginald Lewis,Waco,65.77,113.4,68.04,129.27,310.71,Single-ply,SBD,M,
Boys,67.13,15,Dominic Gotay,Temple,66.27,115.67,65.77,124.74,306.17,Single-ply,SBD,M,
Boys,74.84,1,Chandler Gastello,Copperas Cove,73.89,210.92,122.47,206.38,539.77,Single-ply,SBD,M,
Boys,74.84,2,Dayne Holden,Copperas Cove,73.21,192.78,122.47,215.46,530.7,Single-ply,SBD,M,
Boys,74.84,3,Re'Shaun Sanford,Killeen Harker Heights,73.84,204.12,117.93,204.12,526.17,Single-ply,SBD,M,
Boys,74.84,4,LaShaun James,Copperas Cove,71.85,183.7,124.74,190.51,498.95,Single-ply,SBD,M,
Boys,74.84,5,Josiah Harrison,Temple,69.4,172.37,104.33,181.44,458.13,Single-ply,SBD,M,
Boys,74.84,6,Deuabry Hood,Killeen Harker Heights,74.57,174.63,108.86,170.1,453.59,Single-ply,SBD,M,
Boys,74.84,7,Mason Mills #2,Temple,74.62,163.29,92.99,165.56,421.84,Single-ply,SBD,M,
Boys,74.84,8,Zachary Respress,Killeen Ellison,73.84,145.15,83.91,163.29,392.36,Single-ply,SBD,M,
Boys,74.84,9,Edward Dwyer,Waco Midway,70.85,131.54,79.38,145.15,356.07,Single-ply,SBD,M,
Boys,74.84,10,Christopher Martin,Temple,68.95,104.33,92.99,124.74,322.05,Single-ply,SBD,M,
Boys,74.84,11,Marcos Gamero,Waco University,71.08,90.72,29.48,97.52,217.72,Single-ply,SBD,M,
Boys,82.1,1,Morris Marshall,Killeen Harker Heights,81.06,210.92,127.01,278.96,616.89,Single-ply,SBD,M,
Boys,82.1,2,Joseph James,Killeen Ellison,79.74,201.85,122.47,199.58,523.9,Single-ply,SBD,M,
Boys,82.1,3,Jer'Vonnie Williams,Temple,81.19,213.19,115.67,192.78,521.63,Single-ply,SBD,M,
Boys,82.1,4,Aleczander Patterson,Copperas Cove,78.38,176.9,113.4,190.51,480.81,Single-ply,SBD,M,
Boys,82.1,5,Kevin Alafa,Belton,81.33,154.22,120.2,179.17,453.59,Single-ply,SBD,M,
Boys,82.1,6,Adrian Melvin,Waco Midway,80.47,170.1,104.33,170.1,444.52,Single-ply,SBD,M,
Boys,82.1,7,Andrew Bonner #3,Waco Midway,77.2,158.76,115.67,165.56,439.98,Single-ply,SBD,M,
Boys,82.1,8,Tyler Bond,Temple,77.97,124.74,81.65,154.22,360.61,Single-ply,SBD,M,
Boys,82.1,DQ,Oscar Barreto,Waco,77.02,108.86,79.38,,,Single-ply,SBD,M,
Boys,82.1,DQ,Cole Copas,Waco Midway,82.01,61.23,,,,Single-ply,SBD,M,
Boys,89.81,1,Tyrese Francis,Copperas Cove,82.37,249.48,151.95,217.72,619.15,Single-ply,SBD,M,
Boys,89.81,2,Aimeer Washington,Killeen Harker Heights,89.58,231.33,136.08,244.94,612.35,Single-ply,SBD,M,
Boys,89.81,3,Ivan Diaz,Waco,88.04,233.6,167.83,204.12,605.55,Single-ply,SBD,M,
Boys,89.81,4,Jonah Myers,Belton,88.95,226.8,140.61,217.72,585.13,Single-ply,SBD,M,
Boys,89.81,5,Kevin Pontious,Copperas Cove,86.55,183.7,151.95,204.12,539.77,Single-ply,SBD,M,
Boys,89.81,6,Zion Moore,Temple,87.41,199.58,124.74,190.51,514.83,Single-ply,SBD,M,
Boys,89.81,7,Adrian Scott,Temple,86.82,181.44,122.47,190.51,494.42,Single-ply,SBD,M,
Boys,89.81,8,Dominique Hill #2,Waco Midway,85.64,192.78,97.52,192.78,483.08,Single-ply,SBD,M,
Boys,89.81,9,Jesus Gonzalez,Copperas Cove,88.68,167.83,102.06,188.24,458.13,Single-ply,SBD,M,
Boys,89.81,10,Sebastian Cervantes,Waco University,88,165.56,83.91,147.42,396.89,Single-ply,SBD,M,
Boys,89.81,11,Thomas Warkentine,Waco Midway,84.91,138.35,72.57,147.42,358.34,Single-ply,SBD,M,
Boys,89.81,12,Mario Gama-Serrato,Waco University,83.64,90.72,54.43,113.4,258.55,Single-ply,SBD,M,
Boys,89.81,DQ,Amit Soliman,Killeen Ellison,88,204.12,,,,Single-ply,SBD,M,
Boys,99.79,1,Thomas Connolly,Killeen Harker Heights,96.98,254.01,165.56,217.72,637.3,Single-ply,SBD,M,
Boys,99.79,2,Aiden Stock,Belton,95.39,204.12,129.27,219.99,553.38,Single-ply,SBD,M,
Boys,99.79,3,Parker Evans,Waco Midway,94.53,226.8,124.74,190.51,542.04,Single-ply,SBD,M,
Boys,99.79,4,Ryder Holman,Belton,95.12,197.31,138.35,204.12,539.77,Single-ply,SBD,M,
Boys,99.79,5,Devon Taitano,Copperas Cove,97.11,199.58,122.47,197.31,519.36,Single-ply,SBD,M,
Boys,99.79,6,Steven Aderhold,Belton,96.03,204.12,117.93,185.97,508.02,Single-ply,SBD,M,
Boys,99.79,7,Aidan King,Belton,93.49,154.22,111.13,163.29,428.64,Single-ply,SBD,M,
Boys,99.79,8,Nolan Baden,Waco Midway,94.8,142.88,99.79,156.49,399.16,Single-ply,SBD,M,
Boys,99.79,9,Juan Olivarez,Waco University,94.48,133.81,83.91,151.95,369.68,Single-ply,SBD,M,
Boys,109.77,1,Cesar Martínez,Bryan,109.13,247.21,147.42,247.21,641.83,Single-ply,SBD,M,
Boys,109.77,2,Gabe Kalama,Belton,104.6,240.4,136.08,238.14,614.62,Single-ply,SBD,M,
Boys,109.77,3,Antonio Jones,Temple,105.46,233.6,151.95,224.53,610.08,Single-ply,SBD,M,
Boys,109.77,4,Tyrese Hale,Copperas Cove,108.86,226.8,151.95,199.58,578.33,Single-ply,SBD,M,
Boys,109.77,5,Frankquan Sauls,Temple,107.14,235.87,136.08,192.78,564.72,Single-ply,SBD,M,
Boys,109.77,6,Rion Childers,Copperas Cove,104.69,192.78,142.88,208.65,544.31,Single-ply,SBD,M,
Boys,109.77,7,Ty'odrick Wagner,Waco University,108,192.78,133.81,192.78,519.36,Single-ply,SBD,M,
Boys,109.77,8,Amari Cheeks,Killeen Harker Heights,109.32,172.37,108.86,217.72,498.95,Single-ply,SBD,M,
Boys,109.77,9,Boston Pate,Waco Midway,100.38,167.83,108.86,183.7,460.4,Single-ply,SBD,M,
Boys,109.77,10,Carson Pullin,Waco Midway,109.77,165.56,117.93,163.29,446.79,Single-ply,SBD,M,
Boys,109.77,11,Javon Bryant,Waco,107.55,149.69,106.59,158.76,415.04,Single-ply,SBD,M,
Boys,109.77,12,Eric Grooms,Waco University,109.41,122.47,88.45,149.69,360.61,Single-ply,SBD,M,
Boys,109.77,DQ,Micah Moore,Waco,105.1,197.31,,,,Single-ply,SBD,M,
Boys,124.74,1,JonTavion Workman,Bryan,121.74,263.08,176.9,263.08,703.07,Single-ply,SBD,M,
Boys,124.74,2,Austin Pennington,Bryan,124.51,260.82,145.15,240.4,646.37,Single-ply,SBD,M,
Boys,124.74,3,Christopher Garcia,Copperas Cove,113.9,240.4,163.29,240.4,644.1,Single-ply,SBD,M,
Boys,124.74,4,Kooper McCaig-Forbis,Waco Midway,124.65,249.48,129.27,204.12,582.87,Single-ply,SBD,M,
Boys,124.74,5,Zach Erickson,Belton,123.51,197.31,129.27,240.4,566.99,Single-ply,SBD,M,
Boys,124.74,6,Rashawn Conner,Waco,120.84,204.12,104.33,204.12,512.56,Single-ply,SBD,M,
Boys,124.74,7,Gabe Longoria,Waco Midway,116.17,192.78,113.4,199.58,505.76,Single-ply,SBD,M,
Boys,124.74,8,Marcus Scott,Temple,117.3,165.56,124.74,204.12,494.42,Single-ply,SBD,M,
Boys,124.74,9,DeAndre Smith,Waco,124.28,204.12,97.52,192.78,494.42,Single-ply,SBD,M,
Boys,124.74,10,Dexter Hewitt,Temple,113.44,199.58,92.99,192.78,485.34,Single-ply,SBD,M,
Boys,124.74,11,Allen Dominguez,Waco University,114.03,192.78,104.33,185.97,483.08,Single-ply,SBD,M,
Boys,124.74,12,Garret Morphis,Waco Midway,119.84,183.7,117.93,181.44,483.08,Single-ply,SBD,M,
Boys,124.74,13,Luke Grant,Waco,121.83,174.63,113.4,174.63,462.66,Single-ply,SBD,M,
Boys,124.74,14,Aaron Gomez,Killeen Harker Heights,113.99,165.56,136.08,158.76,460.4,Single-ply,SBD,M,
Boys,124.74,15,Taylor Guerro,Waco Midway,112.17,174.63,108.86,172.37,455.86,Single-ply,SBD,M,
Boys,124.74,16,Seth Martinez,Temple,122.88,188.24,104.33,163.29,455.86,Single-ply,SBD,M,
Boys,124.74,17,Jordan Hernandez,Waco University,124.1,170.1,124.74,151.95,446.79,Single-ply,SBD,M,
Boys,124.74,18,Michael Gibson,Waco Midway,117.12,174.63,108.86,158.76,442.25,Single-ply,SBD,M,
Boys,124.74,19,Simeon Tollerson,Temple,117.62,151.95,108.86,167.83,428.64,Single-ply,SBD,M,
Boys,124.74,20,Logan Ash,Temple,114.35,163.29,104.33,147.42,415.04,Single-ply,SBD,M,
Boys,124.74,21,Ayden Brown,Temple,124.65,226.8,129.27,,356.07,Single-ply,SB,M,
Boys,139.71,1,Paul Monrial,Waco University,128.73,226.8,163.29,219.99,610.08,Single-ply,SBD,M,
Boys,139.71,2,Agustin Silva,Temple,127.64,226.8,147.42,229.06,603.28,Single-ply,SBD,M,
Boys,139.71,3,Eindre Sauls,Temple,136.44,235.87,136.08,204.12,576.06,Single-ply,SBD,M,
Boys,139.71,4,Gerado Garcia,Waco,130.91,204.12,138.35,183.7,526.17,Single-ply,SBD,M,
Boys,139.71,5,Jaydon Chatman,Killeen Harker Heights,134.99,195.04,138.35,181.44,514.83,Single-ply,SBD,M,
Boys,139.71,DQ,Bryson Brown,Waco Midway,137.57,226.8,90.72,,,Single-ply,SBD,M,
Boys,139.71+,1,Lamarian Hatcher,Killeen Harker Heights,147.69,272.16,172.37,204.12,648.64,Single-ply,SBD,M,
Boys,139.71+,2,Ty'Eric Bernal,Waco University,146.28,204.12,104.33,170.1,478.54,Single-ply,SBD,M,
