Division,WeightClassKg,Place,Name,Team,BodyweightKg,Best3SquatKg,Best3BenchKg,Best3DeadliftKg,TotalKg,Equipment,Event,Sex,BirthDate
Boys,51.71,1,Ty Kirkbride,Denison,51.17,163.29,86.18,149.69,399.16,Single-ply,SBD,M,
Boys,51.71,2,Amari Crowder,Mansfield Timberview,51.26,158.76,81.65,158.76,399.16,Single-ply,SBD,M,
Boys,51.71,3,Kyson Lusane,Denison,50.71,145.15,90.72,136.08,371.95,Single-ply,SBD,M,
Boys,51.71,4,George Isanda,Keller Fossil Ridge,51.53,124.74,90.72,154.22,369.68,Single-ply,SBD,M,
Boys,51.71,5,Eric Sanchez,Everman,51.26,136.08,86.18,138.35,360.61,Single-ply,SBD,M,
Boys,51.71,6,Angel Hung,Everman,51.71,136.08,72.57,136.08,344.73,Single-ply,SBD,M,
Boys,51.71,7,Cason Brazell,Keller,51.26,136.08,58.97,136.08,331.12,Single-ply,SBD,M,
Boys,51.71,8,Kody Tanimoto,Keller Central,48.26,124.74,77.11,115.67,317.51,Single-ply,SBD,M,
Boys,51.71,9,John Wyatt,Fort Worth Chisholm Trail,51.17,117.93,65.77,120.2,303.91,Single-ply,SBD,M,
Boys,51.71,10,Benjamin Marin,Wichita Falls,48.26,113.4,58.97,117.93,290.3,Single-ply,SBD,M,
Boys,51.71,11,MD Jawwadullah,Frisco Liberty,50.71,90.72,40.82,113.4,244.94,Single-ply,SBD,M,
Boys,51.71,DQ,Hayden Norwich,Fort Worth Chisholm Trail,,,,,,Single-ply,SBD,M,
Boys,51.71,DQ,Leo Villafranca,Azle,51.71,,,,,Single-ply,SBD,M,
Boys,51.71,DQ,Kj Mitchell,Keller Fossil Ridge,51.71,,,,,Single-ply,SBD,M,
Boys,55.79,1,Aaron Bohannan,Frisco Lone Star,55.43,176.9,83.91,161.03,421.84,Single-ply,SBD,M,
Boys,55.79,2,Zach Rexin,Frisco Lebanon Trail,55.16,161.03,88.45,167.83,417.3,Single-ply,SBD,M,
Boys,55.79,3,DaeeQuan Johnson,Keller Fossil Ridge,55.25,161.03,86.18,154.22,401.43,Single-ply,SBD,M,
Boys,55.79,4,Jeremiah Banda,Justin Northwest,54.98,158.76,72.57,165.56,396.89,Single-ply,SBD,M,
Boys,55.79,5,Brayden Ragle,Weatherford,55.34,136.08,81.65,138.35,356.07,Single-ply,SBD,M,
Boys,55.79,6,Grant Gilbert,Prosper Rock Hill,55.79,124.74,68.04,140.61,333.39,Single-ply,SBD,M,
Boys,55.79,7,Shawn Jones #8,Prosper Rock Hill,55.43,124.74,74.84,127.01,326.59,Single-ply,SBD,M,
Boys,55.79,8,Dylan Smith #12,Princeton,55.34,111.13,70.31,142.88,324.32,Single-ply,SBD,M,
Boys,55.79,9,Aidan Tran,Crowley,53.52,113.4,65.77,136.08,315.25,Single-ply,SBD,M,
Boys,55.79,10,Nick Rodriguez #5,Keller Central,55.79,92.99,61.23,138.35,292.57,Single-ply,SBD,M,
Boys,55.79,DQ,Emeka Ubani,Frisco Memorial,55.43,142.88,,,,Single-ply,SBD,M,
Boys,55.79,DQ,Ivory Kelley,Wichita Falls,54.25,,,,,Single-ply,SBD,M,
Boys,59.87,1,Ryan Nash,Frisco Reedy,59.33,199.58,106.59,188.24,494.42,Single-ply,SBD,M,
Boys,59.87,2,James Duvall,Prosper,58.51,172.37,124.74,185.97,483.08,Single-ply,SBD,M,
Boys,59.87,3,Dj Williams,Everman,58.33,170.1,102.06,185.97,458.13,Single-ply,SBD,M,
Boys,59.87,4,Jose Jimenez #10,Everman,59.24,170.1,90.72,181.44,442.25,Single-ply,SBD,M,
Boys,59.87,5,Jesus Calderon,Saginaw,59.42,149.69,95.25,183.7,428.64,Single-ply,SBD,M,
Boys,59.87,6,Cameron Wilson,Weatherford,58.6,165.56,104.33,156.49,426.38,Single-ply,SBD,M,
Boys,59.87,7,Corey Hightower,Everman,58.51,181.44,74.84,158.76,415.04,Single-ply,SBD,M,
Boys,59.87,8,Andrew Trinh,Keller Fossil Ridge,59.87,161.03,83.91,161.03,405.97,Single-ply,SBD,M,
Boys,59.87,9,Gabe Roberts,Keller Central,59.33,156.49,61.23,165.56,383.29,Single-ply,SBD,M,
Boys,59.87,10,Denim Fields #1,Azle,59.69,140.61,79.38,158.76,378.75,Single-ply,SBD,M,
Boys,59.87,11,Ralen Allen,Everman,59.87,136.08,81.65,158.76,376.48,Single-ply,SBD,M,
Boys,59.87,12,Blake Rogers #3,Wichita Falls Rider,58.79,151.95,83.91,138.35,374.21,Single-ply,SBD,M,
Boys,59.87,13,Jaylee Chanthavee,Keller Fossil Ridge,58.88,136.08,70.31,167.83,374.21,Single-ply,SBD,M,
Boys,59.87,14,Chris Riggio,Keller Central,58.88,181.44,68.04,124.74,374.21,Single-ply,SBD,M,
Boys,59.87,15,Byron Kimani,Keller Fossil Ridge,57.88,142.88,77.11,145.15,365.14,Single-ply,SBD,M,
Boys,59.87,DQ,Blake Erlewein,Frisco Reedy,58.88,,,,,Single-ply,SBD,M,
Boys,67.13,1,Hunter Martin #2,Azle,64.86,204.12,111.13,197.31,512.56,Single-ply,SBD,M,
Boys,67.13,2,Djonny Mukuna,Saginaw,66.5,190.51,108.86,204.12,503.49,Single-ply,SBD,M,
Boys,67.13,3,Jayden Wahlquist,Keller Central,66.04,197.31,111.13,192.78,501.22,Single-ply,SBD,M,
Boys,67.13,4,Kameron Sinclair,White Settlement Brewer,63.59,204.12,97.52,192.78,494.42,Single-ply,SBD,M,
Boys,67.13,5,Daley Phillips,Lucas Lovejoy,66.5,183.7,102.06,199.58,485.34,Single-ply,SBD,M,
Boys,67.13,6,Braden Manners,Keller Central,66.5,190.51,108.86,181.44,480.81,Single-ply,SBD,M,
Boys,67.13,7,Blake Nelson,Weatherford,65.32,181.44,120.2,174.63,476.27,Single-ply,SBD,M,
Boys,67.13,8,William Watkins,Frisco Reedy,66.59,174.63,117.93,165.56,458.13,Single-ply,SBD,M,
Boys,67.13,9,Colten Wilson,Fort Worth Boswell,66.59,167.83,86.18,181.44,435.45,Single-ply,SBD,M,
Boys,67.13,10,Nate Hankins,Northwest Eaton,63.87,149.69,104.33,176.9,430.91,Single-ply,SBD,M,
Boys,67.13,11,Daniel Tran,Crowley,64.86,149.69,106.59,174.63,430.91,Single-ply,SBD,M,
Boys,67.13,DQ,Ryan Threat,Prosper Rock Hill,64.59,,,,,Single-ply,SBD,M,
Boys,74.84,1,Jeremiah Wilton,Weatherford,74.75,231.33,136.08,217.72,585.13,Single-ply,SBD,M,
Boys,74.84,2,Britton Despain,Little Elm,72.67,222.26,122.47,226.8,571.53,Single-ply,SBD,M,
Boys,74.84,3,Kevin Jarvis,Everman,73.39,231.33,120.2,208.65,560.19,Single-ply,SBD,M,
Boys,74.84,4,Caulan Jackson,Crowley,73.12,204.12,138.35,215.46,557.92,Single-ply,SBD,M,
Boys,74.84,5,Triston McDonald,Mansfield Timberview,73.03,215.46,120.2,217.72,553.38,Single-ply,SBD,M,
Boys,74.84,6,Benecio Swann,Keller Central,74.21,226.8,120.2,206.38,553.38,Single-ply,SBD,M,
Boys,74.84,7,Marco DeTomas,Prosper,71.94,229.06,124.74,190.51,544.31,Single-ply,SBD,M,
Boys,74.84,8,Jack Estill,Keller Central,72.67,204.12,145.15,190.51,539.77,Single-ply,SBD,M,
Boys,74.84,9,Corey Soliz,Lucas Lovejoy,73.48,179.17,113.4,224.53,517.1,Single-ply,SBD,M,
Boys,74.84,10,Blake Eames,Weatherford,72.03,201.85,115.67,197.31,514.83,Single-ply,SBD,M,
Boys,74.84,11,Dominic Bird,Mansfield Legacy,72.3,204.12,111.13,197.31,512.56,Single-ply,SBD,M,
Boys,74.84,12,Justin Huynh,Keller Central,72.85,192.78,115.67,181.44,489.88,Single-ply,SBD,M,
Boys,74.84,13,Caleb Forte,Frisco Liberty,74.12,183.7,120.2,183.7,487.61,Single-ply,SBD,M,
Boys,74.84,14,Marvin Reinoshek,Keller Fossil Ridge,70.49,176.9,111.13,195.04,483.08,Single-ply,SBD,M,
Boys,82.1,1,Carter Shell,Keller Timber Creek,80.74,240.4,151.95,204.12,596.47,Single-ply,SBD,M,
Boys,82.1,2,Alec Boyle,White Settlement Brewer,81.56,217.72,167.83,206.38,591.94,Single-ply,SBD,M,
Boys,82.1,3,Ibrahim Durodoye,Justin Northwest,78.93,204.12,142.88,204.12,551.11,Single-ply,SBD,M,
Boys,82.1,4,Marcellus Toombs,Prosper,81.28,195.04,136.08,204.12,535.24,Single-ply,SBD,M,
Boys,82.1,5,Seth Leflore,Northwest Eaton,81.83,190.51,124.74,219.99,535.24,Single-ply,SBD,M,
Boys,82.1,6,Ethan Lollar,Frisco Memorial,81.74,222.26,129.27,181.44,532.97,Single-ply,SBD,M,
Boys,82.1,7,Preston Scrivner,Justin Northwest,79.92,204.12,120.2,206.38,530.7,Single-ply,SBD,M,
Boys,82.1,DQ,Samuel Oh,Frisco Reedy,82.1,,,,,Single-ply,SBD,M,
Boys,82.1,DQ,Josh Compton,Keller Timber Creek,81.01,199.58,142.88,,,Single-ply,SBD,M,
Boys,82.1,DQ,Ethan Broomes,Weatherford,80.56,222.26,145.15,,,Single-ply,SBD,M,
Boys,82.1,DQ,Tyler Smith #1,Lucas Lovejoy,77.2,208.65,124.74,,,Single-ply,SBD,M,
Boys,82.1,DQ,Jeremiah Dorsey,North Crowley,75.75,,,,,Single-ply,SBD,M,
Boys,89.81,1,Adam Sawalha,Mansfield Lake Ridge,89.18,265.35,156.49,292.57,714.41,Single-ply,SBD,M,
Boys,89.81,2,Ethan Nguyen,Mansfield Lake Ridge,87.54,283.5,156.49,226.8,666.78,Single-ply,SBD,M,
Boys,89.81,3,Diego Diaz,Frisco Memorial,89.45,249.48,156.49,229.06,635.03,Single-ply,SBD,M,
Boys,89.81,4,Christian Medina,Weatherford,89.36,226.8,167.83,226.8,621.42,Single-ply,SBD,M,
Boys,89.81,5,Kaleth Pinto,Northwest Eaton,89.54,233.6,163.29,204.12,601.01,Single-ply,SBD,M,
Boys,89.81,6,Casy Adjei,Prosper Rock Hill,89.63,226.8,129.27,224.53,580.6,Single-ply,SBD,M,
Boys,89.81,7,Coleman Bledsoe,Wichita Falls Rider,84.19,235.87,136.08,206.38,578.33,Single-ply,SBD,M,
Boys,89.81,8,Luke Mankowski,Granbury,87.91,222.26,129.27,224.53,576.06,Single-ply,SBD,M,
Boys,89.81,9,Alex Chmelo,Azle,88.9,210.92,131.54,226.8,569.26,Single-ply,SBD,M,
Boys,89.81,10,Shone Mombo,Fort Worth Chisholm Trail,87.27,199.58,129.27,204.12,532.97,Single-ply,SBD,M,
Boys,89.81,DQ,Shawn Wara,Frisco Heritage,89.81,,,,,Single-ply,SBD,M,
Boys,89.81,DQ,Felipe Silva,Keller Central,84.91,201.85,,,,Single-ply,SBD,M,
Boys,99.79,1,Zach Essih,Mansfield Timberview,90.99,278.96,136.08,249.48,664.51,Single-ply,SBD,M,
Boys,99.79,2,Daniel Seals,Weatherford,92.9,242.67,167.83,240.4,650.91,Single-ply,SBD,M,
Boys,99.79,3,Garrett Spangler,Frisco Centennial,97.89,272.16,147.42,219.99,639.57,Single-ply,SBD,M,
Boys,99.79,4,Daniel Ajayi,Frisco Liberty,92.71,244.94,136.08,229.06,610.08,Single-ply,SBD,M,
Boys,99.79,5,Lane Malone,Weatherford,98.16,233.6,147.42,213.19,594.21,Single-ply,SBD,M,
Boys,99.79,6,Austin Korbe,Keller Central,98.25,254.01,138.35,199.58,591.94,Single-ply,SBD,M,
Boys,99.79,7,Aiden Reiter,Frisco Lebanon Trail,90.08,206.38,142.88,206.38,555.65,Single-ply,SBD,M,
Boys,99.79,8,Brock Hayward,Northwest Eaton,96.52,208.65,124.74,222.26,555.65,Single-ply,SBD,M,
Boys,99.79,9,Jaewon Lee,Frisco Wakeland,98.16,183.7,129.27,219.99,532.97,Single-ply,SBD,M,
Boys,99.79,DQ,Roman Knautz,Frisco Lebanon Trail,99.79,,,,,Single-ply,SBD,M,
Boys,99.79,DQ,Chase Stafford,Wichita Falls Rider,90.45,,,,,Single-ply,SBD,M,
Boys,99.79,DQ,Tyler Balsarick,Keller Central,91.53,240.4,151.95,,,Single-ply,SBD,M,
Boys,109.77,1,Riley Wrinkle,Weatherford,109.23,272.16,174.63,265.35,712.14,Single-ply,SBD,M,
Boys,109.77,2,Kolten Trevino,Granbury,108.23,267.62,163.29,217.72,648.64,Single-ply,SBD,M,
Boys,109.77,3,JT Sleeper,Keller Central,109.23,267.62,163.29,215.46,646.37,Single-ply,SBD,M,
Boys,109.77,4,Gabriel Marquez,Weatherford,108.23,242.67,167.83,224.53,635.03,Single-ply,SBD,M,
Boys,109.77,5,Karson Daniel,Weatherford,107.32,229.06,154.22,226.8,610.08,Single-ply,SBD,M,
Boys,109.77,6,Rylie Norton,Azle,102.33,254.01,145.15,208.65,607.81,Single-ply,SBD,M,
Boys,109.77,7,Breydon Blackwell,Fort Worth Boswell,105.14,235.87,142.88,215.46,594.21,Single-ply,SBD,M,
Boys,109.77,8,Parker Lutgen,Granbury,107.32,208.65,147.42,226.8,582.87,Single-ply,SBD,M,
Boys,109.77,9,Michael Bass,Granbury,101.6,217.72,149.69,201.85,569.26,Single-ply,SBD,M,
Boys,109.77,10,Chika Ugoh,Frisco Liberty,107.77,233.6,115.67,217.72,566.99,Single-ply,SBD,M,
Boys,109.77,11,Danny Simmons,Fort Worth Chisholm Trail,107.77,219.99,145.15,199.58,564.72,Single-ply,SBD,M,
Boys,109.77,12,Ansel Mbuh,Aledo,108.95,199.58,124.74,226.8,551.11,Single-ply,SBD,M,
Boys,124.74,1,Demondre Green,Mansfield Timberview,119.75,285.76,167.83,265.35,718.94,Single-ply,SBD,M,
Boys,124.74,2,Jayden Conner,Weatherford,113.76,308.44,176.9,231.33,716.68,Single-ply,SBD,M,
Boys,124.74,3,Adrian Anderson,Everman,121.2,303.91,179.17,215.46,698.53,Single-ply,SBD,M,
Boys,124.74,4,Nash Gagliano,Prosper,113.58,263.08,174.63,215.46,653.17,Single-ply,SBD,M,
Boys,124.74,5,Isreal Ramirez,Granbury,110.5,231.33,170.1,240.4,641.83,Single-ply,SBD,M,
Boys,124.74,6,Kacey Cauley,Mansfield Timberview,123.38,226.8,181.44,233.6,641.83,Single-ply,SBD,M,
Boys,124.74,7,Gary O'Bannon,Weatherford,116.85,235.87,163.29,226.8,625.96,Single-ply,SBD,M,
Boys,124.74,8,Maddox Epperson,Aledo,120.93,244.94,163.29,204.12,612.35,Single-ply,SBD,M,
Boys,124.74,9,Aaron Austin,North Crowley,115.94,231.33,142.88,226.8,601.01,Single-ply,SBD,M,
Boys,124.74,DQ,Jason Harris,Azle,121.47,,,,,Single-ply,SBD,M,
Boys,124.74,DQ,Logan Butler,Frisco Memorial,122.29,,,,,Single-ply,SBD,M,
Boys,124.74,DQ,Austin Reeves,Frisco,122.47,,,,,Single-ply,SBD,M,
Boys,139.71,1,Armani Cathey,Mansfield Timberview,127.64,294.84,161.03,222.26,678.12,Single-ply,SBD,M,
Boys,139.71,2,Caden Barnett,Justin Northwest,133.27,263.08,142.88,269.89,675.85,Single-ply,SBD,M,
Boys,139.71,3,Wennalis Thomas,Prosper,130.82,272.16,154.22,242.67,669.05,Single-ply,SBD,M,
Boys,139.71,4,Will Thompson,McKinney,133.81,238.14,176.9,238.14,653.17,Single-ply,SBD,M,
Boys,139.71,5,Kevin Allen,Everman,126.73,249.48,151.95,240.4,641.83,Single-ply,SBD,M,
Boys,139.71,6,Hunter Erb,Northwest Eaton,138.8,240.4,133.81,249.48,623.69,Single-ply,SBD,M,
Boys,139.71,7,Brady Uhlmann,Frisco Memorial,130,231.33,156.49,222.26,610.08,Single-ply,SBD,M,
Boys,139.71,8,Jahir Orocio,Granbury,136.26,238.14,142.88,204.12,585.13,Single-ply,SBD,M,
Boys,139.71,9,Grehson Coates-Garcia,Prosper Rock Hill,128.73,235.87,136.08,210.92,582.87,Single-ply,SBD,M,
Boys,139.71,10,Jt Linnear,Keller,131.9,235.87,124.74,213.19,573.79,Single-ply,SBD,M,
Boys,139.71,11,Kriz Diaz,Frisco Memorial,130.27,219.99,127.01,208.65,555.65,Single-ply,SBD,M,
Boys,139.71,DQ,Barnett Caden,Justin Northwest,133.36,,,,,Single-ply,SBD,M,
Boys,139.71+,1,Cole Hilliard,Azle,162.93,294.84,163.29,238.14,696.26,Single-ply,SBD,M,
Boys,139.71+,2,Heston Edwards,Northwest Eaton,142.88,226.8,142.88,235.87,605.55,Single-ply,SBD,M,
Boys,139.71+,3,Matt Newton,Prosper,146.6,226.8,142.88,226.8,596.47,Single-ply,SBD,M,
Boys,139.71+,4,Micah Walters,Justin Northwest,143.7,226.8,136.08,226.8,589.67,Single-ply,SBD,M,
Boys,139.71+,5,Colton Barber,Saginaw,143.61,197.31,142.88,188.24,528.44,Single-ply,SBD,M,
Boys,139.71+,6,Xavier King,Weatherford,144.42,210.92,99.79,195.04,505.76,Single-ply,SBD,M,
Boys,139.71+,7,Xzaviah Milton,Saginaw,145.33,201.85,117.93,161.03,480.81,Single-ply,SBD,M,
Boys,139.71+,8,Garrett Muhtadi,Aledo,147.96,188.24,106.59,170.1,464.93,Single-ply,SBD,M,
Boys,139.71+,DQ,Jalen Bray,North Crowley,140.61,,,,,Single-ply,SBD,M,
Boys,139.71+,DQ,Mekhi Robinson,Wichita Falls Rider,144.61,,,,,Single-ply,SBD,M,
