Division,WeightClassKg,Place,Name,Team,BodyweightKg,Best3SquatKg,Best3BenchKg,Best3DeadliftKg,TotalKg,Equipment,Event,Sex,BirthDate
Boys,51.71,1,Cruz Vera,Conroe,50.89,108.86,72.57,124.74,306.17,Single-ply,SBD,M,
Boys,51.71,2,Aramis Ibarra,Conroe Caney Creek,51.71,88.45,68.04,129.27,285.76,Single-ply,SBD,M,
Boys,51.71,3,Aaron Hernandez,Conroe Grand Oaks,51.71,99.79,61.23,115.67,276.69,Single-ply,SBD,M,
Boys,55.79,1,Owen Sims,Magnolia,55.43,142.88,97.52,142.88,383.29,Single-ply,SBD,M,
Boys,55.79,2,Aaron Lynch,Conroe Grand Oaks,54.98,97.52,61.23,111.13,269.89,Single-ply,SBD,M,
Boys,59.87,1,Caleb Abbott,Magnolia,59.47,179.17,113.4,183.7,476.27,Single-ply,SBD,M,
Boys,59.87,2,Adrian Trejo,Conroe,59.06,138.35,90.72,156.49,385.55,Single-ply,SBD,M,
Boys,59.87,3,Adahir Landeros,Conroe,57.15,115.67,74.84,131.54,322.05,Single-ply,SBD,M,
Boys,59.87,4,Daniel Burgess,Conroe Woodlands College Park,59.42,90.72,56.7,108.86,256.28,Single-ply,SBD,M,
Boys,67.13,1,Rogelio Barrera,Conroe,66.81,229.06,138.35,249.48,616.89,Single-ply,SBD,M,
Boys,67.13,2,Deonald Butler,Magnolia,66.77,183.7,111.13,204.12,498.95,Single-ply,SBD,M,
Boys,67.13,3,Andrew Veres,Conroe Woodlands College Park,63.59,183.7,108.86,174.63,467.2,Single-ply,SBD,M,
Boys,67.13,4,Joseph Tellez,Magnolia,65.95,176.9,113.4,176.9,467.2,Single-ply,SBD,M,
Boys,67.13,5,Hank Hewgley,Conroe The Woodlands,65,170.1,111.13,149.69,430.91,Single-ply,SBD,M,
Boys,67.13,6,Trey Jackson,Conroe Caney Creek,66.27,122.47,83.91,147.42,353.8,Single-ply,SBD,M,
Boys,67.13,7,Alex Espinoza,Conroe,67.13,115.67,83.91,147.42,347,Single-ply,SBD,M,
Boys,74.84,1,Daniel Gil,Conroe The Woodlands,67.81,215.46,142.88,242.67,601.01,Single-ply,SBD,M,
Boys,74.84,2,Jesse Rogers,Conroe Grand Oaks,74.39,195.04,111.13,192.78,498.95,Single-ply,SBD,M,
Boys,74.84,3,Tevian Jefferson,Conroe Oak Ridge,74.84,188.24,113.4,190.51,492.15,Single-ply,SBD,M,
Boys,74.84,4,Nate Provost,Conroe The Woodlands,69.22,188.24,95.25,195.04,478.54,Single-ply,SBD,M,
Boys,74.84,5,Owen Cunningham,Magnolia,72.89,181.44,106.59,188.24,476.27,Single-ply,SBD,M,
Boys,74.84,6,Drew Griffin,Conroe Grand Oaks,72.21,192.78,97.52,183.7,474,Single-ply,SBD,M,
Boys,74.84,7,Joseph Colotta,Conroe Oak Ridge,71.99,158.76,115.67,183.7,458.13,Single-ply,SBD,M,
Boys,74.84,8,Isaiah Vera,Conroe,69.94,165.56,120.2,170.1,455.86,Single-ply,SBD,M,
Boys,74.84,9,Gabe Zamora,Conroe Grand Oaks,74.39,188.24,92.99,172.37,453.59,Single-ply,SBD,M,
Boys,82.1,1,Aiden Peterson,Conroe The Woodlands,77.11,226.8,142.88,256.28,625.96,Single-ply,SBD,M,
Boys,82.1,2,Mike Carter,Magnolia,80.38,244.94,147.42,213.19,605.55,Single-ply,SBD,M,
Boys,82.1,3,Mauricio Kerguelen,Conroe The Woodlands,76.02,204.12,136.08,183.7,523.9,Single-ply,SBD,M,
Boys,82.1,4,Riley Stewart,Conroe,79.15,183.7,120.2,174.63,478.54,Single-ply,SBD,M,
Boys,82.1,5,Jeremy Soto,Conroe Caney Creek,76.75,188.24,97.52,179.17,464.93,Single-ply,SBD,M,
Boys,82.1,6,Jonathan Seibert,Conroe Caney Creek,79.2,154.22,97.52,158.76,410.5,Single-ply,SBD,M,
Boys,82.1,7,Joshua Kraus,Conroe Woodlands College Park,76.75,140.61,92.99,156.49,390.09,Single-ply,SBD,M,
Boys,82.1,DQ,Asaiah Hubbard,Conroe Grand Oaks,81.92,,,,,Single-ply,SBD,M,
Boys,89.81,1,Andrew Larkworthy,Conroe The Woodlands,88.5,215.46,158.76,231.33,605.55,Single-ply,SBD,M,
Boys,89.81,2,Christian Cook,Magnolia,87.72,210.92,167.83,213.19,591.94,Single-ply,SBD,M,
Boys,89.81,3,Brian Leonardo,Conroe Oak Ridge,85.96,226.8,147.42,190.51,564.72,Single-ply,SBD,M,
Boys,89.81,4,Zach Lunn,Conroe Grand Oaks,87.04,208.65,142.88,199.58,551.11,Single-ply,SBD,M,
Boys,89.81,5,Andrew Ortiz,Magnolia,88.36,208.65,138.35,204.12,551.11,Single-ply,SBD,M,
Boys,89.81,6,Ryan Smith,Conroe,87,197.31,129.27,195.04,521.63,Single-ply,SBD,M,
Boys,89.81,7,Zach Cleveland,Magnolia,85.96,188.24,140.61,183.7,512.56,Single-ply,SBD,M,
Boys,89.81,8,Connor Ritter,Conroe Woodlands College Park,87,176.9,136.08,151.95,464.93,Single-ply,SBD,M,
Boys,89.81,9,Dennis Jimenez,Conroe Caney Creek,85.28,149.69,106.59,161.03,417.3,Single-ply,SBD,M,
Boys,89.81,10,Landon Mayrant,New Waverly,89.36,136.08,88.45,138.35,362.87,Single-ply,SBD,M,
Boys,89.81,DQ,Timothy Garza,Conroe Caney Creek,89.72,165.56,,174.63,,Single-ply,SBD,M,
Boys,99.79,1,Myles Terry,Conroe Oak Ridge,98.34,242.67,165.56,249.48,657.71,Single-ply,SBD,M,
Boys,99.79,2,Alex Martin #2,Conroe The Woodlands,96.89,265.35,151.95,219.99,637.3,Single-ply,SBD,M,
Boys,99.79,3,Cayden Clayton,Conroe The Woodlands,95.16,229.06,136.08,219.99,585.13,Single-ply,SBD,M,
Boys,99.79,4,Francisco Tirado,Magnolia,99.25,219.99,147.42,195.04,562.45,Single-ply,SBD,M,
Boys,99.79,5,Connor Jones,Magnolia,93.35,190.51,131.54,222.26,544.31,Single-ply,SBD,M,
Boys,99.79,6,Gage Patschke,Magnolia,98.88,195.04,113.4,197.31,505.76,Single-ply,SBD,M,
Boys,99.79,7,Ethan Scott,Conroe The Woodlands,95.25,188.24,117.93,192.78,498.95,Single-ply,SBD,M,
Boys,99.79,8,Nate Klie,Conroe The Woodlands,98.29,192.78,115.67,190.51,498.95,Single-ply,SBD,M,
Boys,109.77,1,Payton Korolyk,Conroe Grand Oaks,108.5,272.16,165.56,265.35,703.07,Single-ply,SBD,M,
Boys,109.77,2,Jacob Pitzer,Conroe,108.77,247.21,156.49,233.6,637.3,Single-ply,SBD,M,
Boys,109.77,3,Perry Irchirl,Conroe Woodlands College Park,106.23,217.72,136.08,263.08,616.89,Single-ply,SBD,M,
Boys,109.77,4,Cameron Hall,Conroe Woodlands College Park,100.83,181.44,117.93,170.1,469.47,Single-ply,SBD,M,
Boys,109.77,5,Peyton Robinson,Conroe Woodlands College Park,105.6,129.27,106.59,138.35,374.21,Single-ply,SBD,M,
Boys,124.74,1,Jacob Harris,Conroe Oak Ridge,120.16,283.5,176.9,263.08,723.48,Single-ply,SBD,M,
Boys,124.74,2,William Yang,Conroe Grand Oaks,120.29,276.69,142.88,238.14,657.71,Single-ply,SBD,M,
Boys,124.74,3,Marque Johnson,Conroe,118.21,269.89,147.42,238.14,655.44,Single-ply,SBD,M,
Boys,124.74,4,Sebasitan Duarte,Conroe The Woodlands,112.63,272.16,158.76,215.46,646.37,Single-ply,SBD,M,
Boys,124.74,5,Cobe Williams,Conroe Woodlands College Park,122.7,219.99,165.56,210.92,596.47,Single-ply,SBD,M,
Boys,124.74,6,Aaron Pereyra,Conroe Grand Oaks,120.75,197.31,97.52,188.24,483.08,Single-ply,SBD,M,
Boys,124.74,7,Alex Fisher,Conroe Woodlands College Park,111.31,163.29,108.86,163.29,435.45,Single-ply,SBD,M,
Boys,124.74,8,Carson Berg,Conroe Woodlands College Park,118.52,174.63,106.59,154.22,435.45,Single-ply,SBD,M,
Boys,139.71,1,Aj Belser,Conroe Grand Oaks,134.31,260.82,140.61,235.87,637.3,Single-ply,SBD,M,
Boys,139.71,2,Cameron Del Rey,Conroe Oak Ridge,128.32,231.33,154.22,217.72,603.28,Single-ply,SBD,M,
Boys,139.71,3,Chance Jackson,Conroe Woodlands College Park,129.18,183.7,151.95,183.7,519.36,Single-ply,SBD,M,
Boys,139.71+,1,Diego Gomez,Conroe Grand Oaks,140.75,124.74,72.57,149.69,347,Single-ply,SBD,M,
