Place,Name,Division,Equipment,Event,BirthDate,BirthYear,Sex,BodyweightKg,WeightClassKg,Squat1Kg,Squat2Kg,Squat3Kg,Best3SquatKg,Bench1Kg,Bench2Kg,Bench3Kg,Best3BenchKg,Deadlift1Kg,Deadlift2Kg,Deadlift3Kg,Best3DeadliftKg,TotalKg
1,Océane Jacouton,Juniors,Raw,SBD,,2003,F,56.55,57,92.5,100,105,105,62.5,-67.5,67.5,67.5,110,117.5,125,125,297.5
1,Eloise Duval,Juniors,Raw,SBD,,2000,F,61.95,63,110,-117.5,117.5,117.5,57.5,-62.5,-62.5,57.5,145,150,-152.5,150,325
1,Emma Dancoisne,Seniors,Raw,SBD,,1997,F,73.55,76,107.5,-112.5,115,115,50,-55,-55,50,125,135,-145,135,300
1,Pierre Chabert,Sub-Juniors,Raw,SBD,,2005,M,64.15,66,110,-120,-125,110,70,75,-77.5,75,125,135,145,145,330
1,Enzo Stohr,Sub-Juniors,Raw,SBD,,2005,M,72.1,74,130,145,150,150,87.5,95,100,100,155,175,190,190,440
1,Mathis Karoudjian,Sub-Juniors,Raw,SBD,,2004,M,80.3,83,150,165,175,175,107.5,115,-117.5,115,190,210,217.5,217.5,507.5
1,Marceau Gillio,Sub-Juniors,Raw,SBD,,2004,M,90.1,93,130,135,145,145,75,80,85,85,150,-160,160,160,390
1,Clément De Regnauld,Juniors,Raw,SBD,,2002,M,91.75,93,190,-205,215,215,120,127.5,-135,127.5,230,-245,245,245,587.5
1,Florian Ortiz,Seniors,Raw,SBD,,1990,M,87.6,93,200,210,217.5,217.5,130,135,-137.5,135,275,-290,-290,275,627.5
