Division,WeightClassKg,Place,Name,Team,BodyweightKg,Best3SquatKg,Best3BenchKg,Best3DeadliftKg,TotalKg,Equipment,Event,Sex,BirthDate
Boys,55.79,1,Kyle Gore,Millsap,55.25,120.2,79.38,120.2,319.78,Single-ply,SBD,M,
Boys,55.79,2,Chance Dorsey,Santo,52.71,83.91,58.97,108.86,251.74,Single-ply,SBD,M,
Boys,67.13,1,Hut Thornton,Santo,66.5,165.56,90.72,181.44,437.72,Single-ply,SBD,M,
Boys,67.13,2,Griffin Cheslock,Brock,66.68,154.22,92.99,165.56,412.77,Single-ply,SBD,M,
Boys,67.13,3,Cole Griffith,Brock,67.13,147.42,81.65,156.49,385.55,Single-ply,SBD,M,
Boys,67.13,4,Emmanuel Reyna,Santo,64.68,113.4,72.57,154.22,340.19,Single-ply,SBD,M,
Boys,67.13,5,Noah Perricone,Millsap,65.86,124.74,72.57,124.74,322.05,Single-ply,SBD,M,
Boys,67.13,6,Rodolfo Vega,Santo,67.13,113.4,68.04,122.47,303.91,Single-ply,SBD,M,
Boys,67.13,7,Alexis Espinosa,Jacksboro,64.86,99.79,63.5,136.08,299.37,Single-ply,SBD,M,
Boys,67.13,8,Jaxson Mizeski,Millsap,65.14,90.72,52.16,97.52,240.4,Single-ply,SBD,M,
Boys,67.13,DQ,Thomas Albert,Santo,65.68,90.72,,117.93,,Single-ply,SBD,M,
Boys,74.84,1,Mikey Martinez,Jacksboro,68.95,185.97,111.13,181.44,478.54,Single-ply,SBD,M,
Boys,74.84,2,Logan Sides,Santo,73.94,158.76,90.72,174.63,424.11,Single-ply,SBD,M,
Boys,74.84,3,Gunner Smith,Archer City,73.84,142.88,108.86,170.1,421.84,Single-ply,SBD,M,
Boys,74.84,4,Reid Green,Millsap,69.4,136.08,79.38,129.27,344.73,Single-ply,SBD,M,
Boys,74.84,5,Andres Astello,Santo,69.4,120.2,54.43,124.74,299.37,Single-ply,SBD,M,
Boys,74.84,6,Jaxson Ward,Jacksboro,69.04,113.4,74.84,108.86,297.1,Single-ply,SBD,M,
Boys,82.1,1,CJ Navarro,Millsap,82.1,183.7,115.67,199.58,498.95,Single-ply,SBD,M,
Boys,82.1,2,Jacob Farquhar,Santo,79.56,181.44,97.52,181.44,460.4,Single-ply,SBD,M,
Boys,82.1,3,Michael Tallant,Santo,80.74,158.76,102.06,163.29,424.11,Single-ply,SBD,M,
Boys,82.1,4,Branden Firth,Santo,81.19,161.03,90.72,170.1,421.84,Single-ply,SBD,M,
Boys,82.1,5,Bryce Hunkapiller,Brock,79.02,140.61,83.91,142.88,367.41,Single-ply,SBD,M,
Boys,82.1,6,Abdiel Solis,Millsap,78.83,138.35,68.04,140.61,347,Single-ply,SBD,M,
Boys,82.1,7,Prayze Pierce,Archer City,78.29,120.2,79.38,136.08,335.66,Single-ply,SBD,M,
Boys,82.1,8,Torin Kiesendahl,Millsap,79.74,106.59,68.04,113.4,288.03,Single-ply,SBD,M,
Boys,89.81,1,Sam Henderson,Santo,83.28,192.78,122.47,192.78,508.02,Single-ply,SBD,M,
Boys,89.81,2,Brendon Mason,Archer City,87.18,127.01,72.57,158.76,358.34,Single-ply,SBD,M,
Boys,89.81,3,Garrett Hultman,Jacksboro,88.27,120.2,72.57,113.4,306.17,Single-ply,SBD,M,
Boys,99.79,1,Aldo Calvillo,Millsap,96.62,238.14,140.61,215.46,594.21,Single-ply,SBD,M,
Boys,99.79,2,Cade Harris,Brock,94.53,206.38,136.08,199.58,542.04,Single-ply,SBD,M,
Boys,99.79,3,Adam Mueller,Brock,99.79,215.46,117.93,183.7,517.1,Single-ply,SBD,M,
Boys,99.79,4,Ethan Brooks,Brock,97.16,181.44,115.67,172.37,469.47,Single-ply,SBD,M,
Boys,99.79,5,Lex Laursen,Santo,99.06,165.56,104.33,167.83,437.72,Single-ply,SBD,M,
Boys,99.79,6,Steven McKey,Millsap,92.17,172.37,99.79,161.03,433.18,Single-ply,SBD,M,
Boys,109.77,1,Zack Shivers,Brock,100.06,272.16,154.22,215.46,641.83,Single-ply,SBD,M,
Boys,109.77,2,Kadyn Mathews,Brock,101.15,208.65,154.22,213.19,576.06,Single-ply,SBD,M,
Boys,109.77,3,Trace Roger,Brock,108.23,204.12,113.4,192.78,510.29,Single-ply,SBD,M,
Boys,109.77,4,Brock Riker,Brock,102.42,190.51,102.06,181.44,474,Single-ply,SBD,M,
Boys,109.77,5,Dalton Golden,Millsap,106.87,174.63,95.25,174.63,444.52,Single-ply,SBD,M,
Boys,109.77,6,José Castro,Millsap,100.79,147.42,77.11,136.08,360.61,Single-ply,SBD,M,
Boys,124.74,1,Hunter Fay,Brock,114.31,183.7,124.74,185.97,494.42,Single-ply,SBD,M,
Boys,124.74,2,Hector Pacheco,Millsap,112.58,188.24,106.59,183.7,478.54,Single-ply,SBD,M,
Boys,124.74,3,Mason Glover,Millsap,111.77,181.44,81.65,167.83,430.91,Single-ply,SBD,M,
Boys,124.74,4,Tres Meyers,Jacksboro,110.31,181.44,90.72,156.49,428.64,Single-ply,SBD,M,
Boys,139.71,1,Brett Hamilton,Santo,131.27,181.44,106.59,181.44,469.47,Single-ply,SBD,M,
