﻿Ergebnisse Kniebeuge Mönchenfrei 08
Junioren                                   K.-gewicht   1     2     3     Relativ   Platz
N. Stoll                                   97,5 kg      270   285   300   277,5     1
Aktive
D. Schmalz                                 122 kg       290   /     /     249,69    1
V. Kayser                                  144 kg       250   270   290   242,44    2
S. Märtens                                 100,5 kg     200   210   220   191,73    3
S. Becker                                  74,5 kg      125   135   140   157,36    4
Masters I
R. Döhne                                   108 kg       250   260   /     244,09    1
R. Trage                                   102,5 kg     220   230   235   212,51    2
U. Muster                                  89 kg        130   135   140   141,42    3
Gesamtwertung Kniebeuge (Reshel-Tabelle)
Nando Stoll                                277,5        1
Danny Schmalz                              249,69       2
Ralf Döhne                                 244,49       3
Seite 1
