Division,WeightClassKg,Place,Name,Team,BodyweightKg,Best3SquatKg,Best3BenchKg,Best3DeadliftKg,TotalKg,Equipment,Event,Sex,BirthDate
Boys,51.71,1,Jonathan Mosley,Tatum,49.9,81.65,52.16,104.33,238.14,Single-ply,SBD,M,
Boys,59.87,1,Jayden Williams,Tatum,56.43,133.81,77.11,154.22,365.14,Single-ply,SBD,M,
Boys,67.13,1,Hunter Branson,Hallsville,66.41,181.44,117.93,174.63,474,Single-ply,SBD,M,
Boys,67.13,2,Brealon Fagan,Hallsville,66.95,181.44,99.79,190.51,471.74,Single-ply,SBD,M,
Boys,67.13,3,Samuel Shankles,Longview Spring Hill,62.96,163.29,95.25,163.29,421.84,Single-ply,SBD,M,
Boys,67.13,4,Aiden Cooper,Hallsville,67.13,145.15,92.99,158.76,396.89,Single-ply,SBD,M,
Boys,67.13,5,Ethan Miller,Longview Spring Hill,62.87,117.93,90.72,161.03,369.68,Single-ply,SBD,M,
Boys,67.13,6,Kevin Ramiez,Tatum,63.87,83.91,68.04,113.4,265.35,Single-ply,SBD,M,
Boys,74.84,1,Eric Allen,Center,71.12,174.63,115.67,208.65,498.95,Single-ply,SBD,M,
Boys,74.84,2,Brandt Weisinger,Longview Spring Hill,74.39,174.63,92.99,183.7,451.32,Single-ply,SBD,M,
Boys,74.84,3,Julius Hawkins,Longview Spring Hill,70.76,156.49,97.52,174.63,428.64,Single-ply,SBD,M,
Boys,82.1,1,Jackson Richardson,Tatum,78.74,172.37,79.38,204.12,455.86,Single-ply,SBD,M,
Boys,82.1,2,Dane Brown,Hallsville,81.74,170.1,86.18,199.58,455.86,Single-ply,SBD,M,
Boys,82.1,3,Jimmy Booth,Longview Spring Hill,77.93,165.56,81.65,167.83,415.04,Single-ply,SBD,M,
Boys,82.1,4,Clint Jones,Tatum,78.65,149.69,83.91,151.95,385.55,Single-ply,SBD,M,
Boys,82.1,5,Dakota Carrol,Center,76.48,136.08,74.84,161.03,371.95,Single-ply,SBD,M,
Boys,82.1,6,Xavier Moore,Tatum,79.2,142.88,68.04,154.22,365.14,Single-ply,SBD,M,
Boys,89.81,1,Hayden Branson,Hallsville,89.54,258.55,165.56,254.01,678.12,Single-ply,SBD,M,
Boys,89.81,2,Rylan Freeman,Tatum,85.09,208.65,120.2,199.58,528.44,Single-ply,SBD,M,
Boys,89.81,3,Cameron Williams,Hallsville,85.64,199.58,111.13,210.92,521.63,Single-ply,SBD,M,
Boys,89.81,4,Isaiah McDonald,Hallsville,85,170.1,108.86,185.97,464.93,Single-ply,SBD,M,
Boys,89.81,5,Gian Victoria,Longview Spring Hill,85.73,120.2,63.5,158.76,342.46,Single-ply,SBD,M,
Boys,89.81,DQ,Ron Davis,Center,84.01,131.54,,158.76,,Single-ply,SBD,M,
Boys,99.79,1,Waihett Emerson,Center,92.26,226.8,120.2,217.72,564.72,Single-ply,SBD,M,
Boys,99.79,2,Bayne Brinkman,Longview Spring Hill,94.71,197.31,122.47,217.72,537.51,Single-ply,SBD,M,
Boys,99.79,3,Brooks Hill,Longview Spring Hill,92.9,197.31,124.74,204.12,526.17,Single-ply,SBD,M,
Boys,99.79,4,Remington Talasek,Hallsville,92.26,195.04,115.67,206.38,517.1,Single-ply,SBD,M,
Boys,99.79,5,Kaden McFaul,Longview Spring Hill,93.17,190.51,102.06,190.51,483.08,Single-ply,SBD,M,
Boys,99.79,6,Talon Ferguson,Longview Spring Hill,98.97,167.83,95.25,158.76,421.84,Single-ply,SBD,M,
Boys,99.79,7,Kevin Dao,Hallsville,96.25,156.49,95.25,163.29,415.04,Single-ply,SBD,M,
Boys,99.79,8,Xavier Cook,Tatum,92.26,158.76,95.25,156.49,410.5,Single-ply,SBD,M,
Boys,99.79,9,Taylor Rutherford,Tatum,90.08,129.27,81.65,138.35,349.27,Single-ply,SBD,M,
Boys,99.79,10,Francisco Ceferino,Center,97.43,120.2,77.11,142.88,340.19,Single-ply,SBD,M,
Boys,109.77,1,Dillon Moralez,Hallsville,104.96,199.58,131.54,208.65,539.77,Single-ply,SBD,M,
Boys,109.77,2,Felipe Juarez,Hallsville,103.6,163.29,122.47,217.72,503.49,Single-ply,SBD,M,
Boys,109.77,3,Tristen McClellan,Center,103.33,174.63,113.4,174.63,462.66,Single-ply,SBD,M,
Boys,109.77,4,Kaden Ramo,Longview Spring Hill,102.78,165.56,92.99,183.7,442.25,Single-ply,SBD,M,
Boys,109.77,5,Ethan Whyte,Longview Spring Hill,102.51,181.44,92.99,165.56,439.98,Single-ply,SBD,M,
Boys,109.77,6,Matthew Prater,Longview Spring Hill,104.87,102.06,56.7,97.52,256.28,Single-ply,SBD,M,
Boys,124.74,1,Eric Lopez,Center,115.76,281.23,165.56,192.78,639.57,Single-ply,SBD,M,
Boys,124.74,2,Hughston White,Longview Spring Hill,113.49,199.58,102.06,188.24,489.88,Single-ply,SBD,M,
Boys,124.74,3,Michael Buckley,Longview Spring Hill,123.47,158.76,90.72,183.7,433.18,Single-ply,SBD,M,
Boys,124.74,DQ,Jake Seal,Hallsville,123.56,233.6,131.54,,,Single-ply,SBD,M,
Boys,139.71,DQ,Osvaldo Diaz,Center,130.63,215.46,,197.31,,Single-ply,SBD,M,
Boys,139.71+,1,Kameron Henry,Center,187.42,217.72,151.95,190.51,560.19,Single-ply,SBD,M,
Boys,,NS,Brair Riley,Center,,,,,,Single-ply,SBD,M,
