Division,WeightClassKg,Place,Name,Team,BodyweightKg,Best3SquatKg,Best3BenchKg,Best3DeadliftKg,TotalKg,Equipment,Event,Sex,BirthDate
Boys,55.79,1,Kirkland Cobb,White Oak,54.43,142.88,88.45,145.15,376.48,Single-ply,SBD,M,
Boys,59.87,1,Randall Phillips,Hawkins,57.61,102.06,54.43,136.08,292.57,Single-ply,SBD,M,
Boys,67.13,1,Dawson Hill,Pittsburg,60.78,124.74,61.23,124.74,310.71,Single-ply,SBD,M,
Boys,74.84,1,Garrison Conner,Diana New Diana,74.48,165.56,102.06,195.04,462.66,Single-ply,SBD,M,
Boys,74.84,2,Sam Lewis,Hawkins,68.86,151.95,106.59,156.49,415.04,Single-ply,SBD,M,
Boys,74.84,3,Don Mapps,Diana New Diana,70.31,136.08,79.38,136.08,351.53,Single-ply,SBD,M,
Boys,74.84,4,Brenden Elkins,Hawkins,72.57,117.93,79.38,147.42,344.73,Single-ply,SBD,M,
Boys,74.84,5,Austin Hineman,Diana New Diana,73.94,106.59,72.57,136.08,315.25,Single-ply,SBD,M,
Boys,74.84,6,Adam Caldwell,White Oak,70.31,102.06,61.23,127.01,290.3,Single-ply,SBD,M,
Boys,74.84,7,Logan Marsh,Pittsburg,74.84,102.06,52.16,117.93,272.16,Single-ply,SBD,M,
Boys,74.84,DQ,Omari Jones,Diana New Diana,73.94,158.76,,,,Single-ply,SBD,M,
Boys,82.1,1,Holden Hodges,White Oak,80.74,204.12,102.06,204.12,510.29,Single-ply,SBD,M,
Boys,82.1,2,Justice Clifton,Pittsburg,78.02,129.27,70.31,140.61,340.19,Single-ply,SBD,M,
Boys,82.1,3,Jacob Johnston,Diana New Diana,81.19,124.74,83.91,129.27,337.93,Single-ply,SBD,M,
Boys,82.1,4,Landon Huggins,Pittsburg,76.2,127.01,70.31,138.35,335.66,Single-ply,SBD,M,
Boys,82.1,5,Jaxon Despain,Hawkins,77.11,113.4,65.77,151.95,331.12,Single-ply,SBD,M,
Boys,82.1,6,Charles Harris,Pittsburg,78.47,124.74,52.16,136.08,312.98,Single-ply,SBD,M,
Boys,82.1,7,Adam Stotts,Hawkins,77.56,99.79,68.04,136.08,303.91,Single-ply,SBD,M,
Boys,89.81,1,Logan Shiflet,Diana New Diana,87.09,161.03,111.13,167.83,439.98,Single-ply,SBD,M,
Boys,89.81,2,Braylon Franklin,Diana New Diana,83.46,129.27,92.99,170.1,392.36,Single-ply,SBD,M,
Boys,89.81,3,Samuel Gomez,Diana New Diana,89.36,129.27,81.65,145.15,356.07,Single-ply,SBD,M,
Boys,89.81,4,Mason Calvery,Diana New Diana,88.45,117.93,88.45,142.88,349.27,Single-ply,SBD,M,
Boys,89.81,5,Braxton Geers,Diana New Diana,84.37,111.13,68.04,122.47,301.64,Single-ply,SBD,M,
Boys,89.81,DQ,Brayson Birdsong,Diana New Diana,88.45,115.67,92.99,,,Single-ply,SBD,M,
Boys,99.79,1,Ty Price,Pittsburg,94.8,210.92,127.01,199.58,537.51,Single-ply,SBD,M,
Boys,99.79,2,Coleman Tapia,Hawkins,95.25,192.78,142.88,192.78,528.44,Single-ply,SBD,M,
Boys,99.79,3,Caron Whitworth,Diana New Diana,98.88,210.92,102.06,188.24,501.22,Single-ply,SBD,M,
Boys,99.79,4,Tyson Howell,Diana New Diana,92.53,124.74,79.38,165.56,369.68,Single-ply,SBD,M,
Boys,99.79,5,Kollin Posey,Pittsburg,95.25,136.08,70.31,142.88,349.27,Single-ply,SBD,M,
Boys,99.79,6,Collin Wheat,White Oak,95.71,122.47,83.91,140.61,347,Single-ply,SBD,M,
Boys,99.79,7,Brycen Hill,Hawkins,93.44,120.2,83.91,136.08,340.19,Single-ply,SBD,M,
Boys,109.77,1,Jamyrion White,Pittsburg,105.23,174.63,108.86,158.76,442.25,Single-ply,SBD,M,
Boys,109.77,2,Grayson Howard,Diana New Diana,102.97,156.49,81.65,170.1,408.23,Single-ply,SBD,M,
Boys,109.77,3,Cameron Johnson,Hawkins,104.78,136.08,104.33,136.08,376.48,Single-ply,SBD,M,
Boys,109.77,4,Robert Aguilar,Diana New Diana,102.97,136.08,92.99,142.88,371.95,Single-ply,SBD,M,
Boys,109.77,5,Gage Davison,White Oak,101.06,138.35,72.57,140.61,351.53,Single-ply,SBD,M,
Boys,109.77,6,Isley Jackson,Hawkins,100.7,115.67,79.38,127.01,322.05,Single-ply,SBD,M,
Boys,124.74,1,Ariel Briceno,Pittsburg,119.29,226.8,102.06,170.1,498.95,Single-ply,SBD,M,
Boys,124.74,2,Race Rountree,Diana New Diana,117.93,147.42,99.79,163.29,410.5,Single-ply,SBD,M,
Boys,124.74,3,Garrett Christie,Diana New Diana,110.68,120.2,79.38,156.49,356.07,Single-ply,SBD,M,
Boys,139.71,1,John Hester,Hawkins,126.55,229.06,174.63,231.33,635.03,Single-ply,SBD,M,
Boys,139.71,2,Riley Maxwell,Diana New Diana,128.82,197.31,127.01,181.44,505.76,Single-ply,SBD,M,
Boys,139.71,3,Kadarius Roberson,Hawkins,126.1,188.24,117.93,179.17,485.34,Single-ply,SBD,M,
