Division,WeightClassKg,Place,Name,Team,BodyweightKg,Best3SquatKg,Best3BenchKg,Best3DeadliftKg,TotalKg,Equipment,Event,Sex,BirthDate
Boys,51.71,1,MD Jawwadullah,Frisco Liberty,50.71,124.74,61.23,156.49,342.46,Single-ply,SBD,M,
Boys,51.71,2,Knox Wilson,Van Alstyne,45.27,92.99,49.9,95.25,238.14,Single-ply,SBD,M,
Boys,59.87,1,Gio Torres,Van Alstyne,59.24,149.69,83.91,131.54,365.14,Single-ply,SBD,M,
Boys,59.87,2,Nathan Pacheco,Van Alstyne,56.88,122.47,,145.15,267.62,Single-ply,SD,M,
Boys,67.13,1,Taki Hokes,Frisco,64.32,129.27,83.91,163.29,376.48,Single-ply,SBD,M,
Boys,67.13,2,Gunnar Keenan,Van Alstyne,65.23,113.4,90.72,156.49,360.61,Single-ply,SBD,M,
Boys,67.13,3,Ameer Alnseirat,Frisco Liberty,66.13,113.4,65.77,127.01,306.17,Single-ply,SBD,M,
Boys,74.84,1,Willie Hilliard,Frisco,71.76,165.56,92.99,165.56,424.11,Single-ply,SBD,M,
Boys,74.84,2,Adam Wilson,Frisco,73.48,142.88,99.79,129.27,371.95,Single-ply,SBD,M,
Boys,74.84,3,Canaan Jones,Frisco,74.39,,,142.88,142.88,Single-ply,D,M,
Boys,74.84,3,Jonah Price,Van Alstyne,70.94,124.74,86.18,142.88,353.8,Single-ply,SBD,M,
Boys,74.84,4,Jay Poe,Frisco Liberty,69.13,124.74,81.65,129.27,335.66,Single-ply,SBD,M,
Boys,74.84,5,Noah Cindullah,Frisco,70.13,113.4,70.31,129.27,312.98,Single-ply,SBD,M,
Boys,74.84,DQ,Dakota Howard,Van Alstyne,74.12,,,,,Single-ply,SBD,M,
Boys,82.1,1,Caleb Forte,Frisco Liberty,77.11,226.8,136.08,222.26,585.13,Single-ply,SBD,M,
Boys,82.1,2,Foster Cataldie,Van Alstyne,76.2,199.58,102.06,174.63,476.27,Single-ply,SBD,M,
Boys,89.81,1,Dillon Davis,Frisco Liberty,87.09,170.1,108.86,174.63,453.59,Single-ply,SBD,M,
Boys,89.81,2,Cooper Smith,Van Alstyne,87.54,136.08,102.06,138.35,376.48,Single-ply,SBD,M,
Boys,89.81,3,Justin Ripberger,Frisco Liberty,86.55,138.35,81.65,147.42,367.41,Single-ply,SBD,M,
Boys,89.81,4,Jaden Mahan,Van Alstyne,83.91,124.74,102.06,,226.8,Single-ply,SB,M,
Boys,99.79,1,Robert Teta,Frisco Liberty,96.62,197.31,106.59,201.85,505.76,Single-ply,SBD,M,
Boys,99.79,2,Kyle Greve,Van Alstyne,92.71,183.7,104.33,183.7,471.74,Single-ply,SBD,M,
Boys,99.79,3,Malaki Turner,Frisco,98.79,142.88,111.13,158.76,412.77,Single-ply,SBD,M,
Boys,99.79,4,Nitin Vejju,Frisco Liberty,97.52,124.74,58.97,131.54,315.25,Single-ply,SBD,M,
Boys,109.77,1,Josh Johnson,Frisco,100.06,158.76,102.06,165.56,426.38,Single-ply,SBD,M,
Boys,109.77,2,Trent Roden,Frisco,100.52,142.88,70.31,151.95,365.14,Single-ply,SBD,M,
Boys,109.77,3,Stephen Wilson,Frisco,104.6,147.42,,158.76,306.17,Single-ply,SD,M,
Boys,124.74,1,Levi Copeland,Van Alstyne,111.58,188.24,108.86,158.76,455.86,Single-ply,SBD,M,
Boys,124.74,2,Nick Loya,Van Alstyne,114.31,199.58,,195.04,394.63,Single-ply,SD,M,
Boys,124.74,3,Jack Scala,Frisco,117.03,88.45,92.99,113.4,294.84,Single-ply,SBD,M,
Boys,,NS,Jordan Bryant,Frisco,,,,,,Single-ply,SBD,M,
Boys,,NS,Ryder Pratt,Frisco Liberty,,,,,,Single-ply,SBD,M,
Boys,,NS,Jadon Simmons,Frisco Liberty,,,,,,Single-ply,SBD,M,
