Division,WeightClassKg,Place,Name,Team,BodyweightKg,Best3SquatKg,Best3BenchKg,Best3DeadliftKg,TotalKg,Equipment,Event,Sex,BirthDate
Boys,51.71,1,Adam Mock,Sealy,51.66,102.06,61.23,90.72,254.01,Single-ply,SBD,M,
Boys,55.79,DQ,Drayton Mazac,Sealy,55.57,136.08,,,,Single-ply,SBD,M,
Boys,59.87,1,Juan Perez,Sealy,59.24,149.69,83.91,165.56,399.16,Single-ply,SBD,M,
Boys,59.87,2,Max Wickens,Sealy,57.56,124.74,74.84,122.47,322.05,Single-ply,SBD,M,
Boys,59.87,3,Adrian Cloud,Sealy,58.65,115.67,77.11,120.2,312.98,Single-ply,SBD,M,
Boys,59.87,4,Ethan Mendez,Waller,58.88,61.23,47.63,90.72,199.58,Single-ply,SBD,M,
Boys,67.13,1,Bradley Garbs,Sealy,65.95,158.76,95.25,183.7,437.72,Single-ply,SBD,M,
Boys,67.13,2,Ethan Richter,Sealy,63.91,154.22,102.06,156.49,412.77,Single-ply,SBD,M,
Boys,67.13,3,Curtis Sanders,Sealy,66.77,111.13,65.77,124.74,301.64,Single-ply,SBD,M,
Boys,74.84,1,Roberto Casas,Sealy,69.26,161.03,104.33,165.56,430.91,Single-ply,SBD,M,
Boys,74.84,2,Adam Vance,Waller,72.12,142.88,92.99,161.03,396.89,Single-ply,SBD,M,
Boys,82.1,1,Austin Bice,Waller,80.29,136.08,86.18,174.63,396.89,Single-ply,SBD,M,
Boys,82.1,2,Ryan Chim,Waller,77.97,133.81,79.38,138.35,351.53,Single-ply,SBD,M,
Boys,82.1,3,Victor Pacheco,Waller,78.52,115.67,86.18,129.27,331.12,Single-ply,SBD,M,
Boys,89.81,1,Joshua Harris,Waller,84.32,124.74,70.31,142.88,337.93,Single-ply,SBD,M,
Boys,99.79,1,Jairo Garcia,Waller,95.53,183.7,117.93,192.78,494.42,Single-ply,SBD,M,
Boys,99.79,2,Jose Arriaga,Sealy,97.89,179.17,104.33,183.7,467.2,Single-ply,SBD,M,
Boys,99.79,3,Eric Torres,Sealy,97.52,181.44,99.79,156.49,437.72,Single-ply,SBD,M,
Boys,99.79,4,Tashawn Justice,Waller,90.26,133.81,77.11,176.9,387.82,Single-ply,SBD,M,
Boys,99.79,5,Branson Bean,Waller,90.26,133.81,77.11,142.88,353.8,Single-ply,SBD,M,
Boys,99.79,6,El Grande Gunner,Waller,92.76,111.13,65.77,149.69,326.59,Single-ply,SBD,M,
Boys,109.77,1,Yahir Alvarez,Sealy,106.37,226.8,147.42,233.6,607.81,Single-ply,SBD,M,
Boys,109.77,2,Leighton Geiman,Waller,108.68,170.1,95.25,158.76,424.11,Single-ply,SBD,M,
Boys,109.77,3,Cj Woodson,Waller,105.05,151.95,72.57,142.88,367.41,Single-ply,SBD,M,
Boys,124.74,1,Jaiden Stevens,Waller,114.58,188.24,102.06,183.7,474,Single-ply,SBD,M,
Boys,124.74,2,Kyle Willingham,Sealy,115.44,167.83,113.4,170.1,451.32,Single-ply,SBD,M,
Boys,139.71,1,Daniel Barrera,Sealy,125.19,163.29,111.13,151.95,426.38,Single-ply,SBD,M,
Boys,,NS,Ethan Hart,Sealy,,,,,,Single-ply,SBD,M,
