Division,WeightClassKg,Place,Name,Team,BodyweightKg,Best3SquatKg,Best3BenchKg,Best3DeadliftKg,TotalKg,Equipment,Event,Sex,BirthDate
Boys,51.71,1,Jaidyn DeMarse,New Home,50.89,99.79,63.5,111.13,274.42,Single-ply,SBD,M,
Boys,55.79,1,Bronson Putman,Ropesville Ropes,55.16,131.54,58.97,133.81,324.32,Single-ply,SBD,M,
Boys,55.79,2,David Hester,Ropesville Ropes,53.43,92.99,45.36,99.79,238.14,Single-ply,SBD,M,
Boys,59.87,1,Ty Dutton,New Home,56.61,92.99,68.04,97.52,258.55,Single-ply,SBD,M,
Boys,67.13,1,Jaylon Luna,Ropesville Ropes,66.95,170.1,108.86,165.56,444.52,Single-ply,SBD,M,
Boys,67.13,2,Xavier Ramon,Morton,65.23,138.35,86.18,149.69,374.21,Single-ply,SBD,M,
Boys,67.13,3,Mike Sanchez,Ropesville Ropes,64.05,117.93,61.23,158.76,337.93,Single-ply,SBD,M,
Boys,67.13,4,Allen Flores,Sudan,65.95,117.93,61.23,131.54,310.71,Single-ply,SBD,M,
Boys,67.13,5,Bryson Nale,Ropesville Ropes,65.59,102.06,54.43,136.08,292.57,Single-ply,SBD,M,
Boys,67.13,6,Richard Hamby,Ropesville Ropes,66.59,92.99,52.16,127.01,272.16,Single-ply,SBD,M,
Boys,74.84,1,Christian Enriquez,Morton,68.86,158.76,90.72,192.78,442.25,Single-ply,SBD,M,
Boys,74.84,2,Cameron Garner,Ropesville Ropes,74.21,142.88,77.11,149.69,369.68,Single-ply,SBD,M,
Boys,74.84,3,Jaxon Forsythe,New Home,72.12,124.74,72.57,120.2,317.51,Single-ply,SBD,M,
Boys,74.84,DQ,Clayte Edwards,Ropesville Ropes,73.03,88.45,47.63,,,Single-ply,SBD,M,
Boys,82.1,1,Drake Wyatt,Ropesville Ropes,80.47,185.97,104.33,190.51,480.81,Single-ply,SBD,M,
Boys,82.1,2,Xzavier Torres,Ropesville Ropes,80.92,163.29,79.38,181.44,424.11,Single-ply,SBD,M,
Boys,82.1,3,Edwyn Rivera,Morton,76.93,154.22,83.91,170.1,408.23,Single-ply,SBD,M,
Boys,89.81,1,Jaden Conley,Sudan,89.54,185.97,106.59,219.99,512.56,Single-ply,SBD,M,
Boys,89.81,2,Tobi Bernal,Ropesville Ropes,84.37,185.97,104.33,204.12,494.42,Single-ply,SBD,M,
Boys,89.81,3,Cy Marshall,Morton,83.37,136.08,68.04,204.12,408.23,Single-ply,SBD,M,
Boys,99.79,1,Abel Vizcarra,Morton,99.06,170.1,104.33,181.44,455.86,Single-ply,SBD,M,
Boys,99.79,2,Sam McCaleb,Ropesville Ropes,98.97,86.18,61.23,115.67,263.08,Single-ply,SBD,M,
Boys,109.77,1,Reid McCaleb,Ropesville Ropes,108.68,136.08,63.5,149.69,349.27,Single-ply,SBD,M,
Boys,109.77,DQ,Evan Sullivan,Ropesville Ropes,103.87,151.95,,,,Single-ply,SBD,M,
Boys,124.74,1,Jon Conley,Sudan,116.75,183.7,92.99,151.95,428.64,Single-ply,SBD,M,
Boys,,NS,Ky Collins,Ropesville Ropes,,,,,,Single-ply,SBD,M,
Boys,,NS,Enrique Gonzales,Sudan,,,61.23,149.69,,Single-ply,SBD,M,
Boys,,NS,Jeremiah Castillo,Sudan,,,,,,Single-ply,SBD,M,
