Division,WeightClassKg,Place,Name,Team,BodyweightKg,Best3SquatKg,Best3BenchKg,Best3DeadliftKg,TotalKg,Equipment,Event,Sex,BirthDate
Boys,51.71,1,Colby Murphey,Ponder,49.62,113.4,65.77,113.4,292.57,Single-ply,SBD,M,
Boys,51.71,2,Nicky Diaz,Nocona,51.71,92.99,61.23,92.99,247.21,Single-ply,SBD,M,
Boys,55.79,1,Colton Covington,Bowie,55.34,117.93,81.65,136.08,335.66,Single-ply,SBD,M,
Boys,55.79,2,Colton Prestridge,Paradise,52.53,122.47,65.77,129.27,317.51,Single-ply,SBD,M,
Boys,55.79,3,Tyler Slimp,Alvord,54.88,102.06,63.5,120.2,285.76,Single-ply,SBD,M,
Boys,55.79,4,Jaden Dobyns,Alvord,52.16,102.06,56.7,115.67,274.42,Single-ply,SBD,M,
Boys,59.87,1,Wyatt Abbott,Alvord,56.61,161.03,92.99,188.24,442.25,Single-ply,SBD,M,
Boys,59.87,2,Damian Estrada,Paradise,59.87,149.69,90.72,142.88,383.29,Single-ply,SBD,M,
Boys,59.87,3,Miguel Olivares,Nocona,58.51,129.27,90.72,156.49,376.48,Single-ply,SBD,M,
Boys,59.87,4,Claetyn More,Ponder,59.42,124.74,65.77,124.74,315.25,Single-ply,SBD,M,
Boys,59.87,5,Cooper Waldrip,Nocona,59.78,102.06,72.57,136.08,310.71,Single-ply,SBD,M,
Boys,59.87,6,Damien Lopez,Chico,59.42,111.13,68.04,127.01,306.17,Single-ply,SBD,M,
Boys,59.87,DQ,Dorian Ellis,Nocona,57.61,,,,,Single-ply,SBD,M,
Boys,67.13,1,Tucker Abbott,Alvord,61.51,181.44,111.13,217.72,510.29,Single-ply,SBD,M,
Boys,67.13,2,Mason Hodges,Ponder,65.32,170.1,97.52,165.56,433.18,Single-ply,SBD,M,
Boys,67.13,3,Xavier Ochoa,Alvord,66.77,142.88,108.86,161.03,412.77,Single-ply,SBD,M,
Boys,67.13,4,Lane Medlock,Boyd,63.41,149.69,83.91,170.1,403.7,Single-ply,SBD,M,
Boys,67.13,5,Jason Vaughn,Bowie,62.78,120.2,90.72,142.88,353.8,Single-ply,SBD,M,
Boys,67.13,6,Darren Loper,Paradise,67.13,111.13,77.11,142.88,331.12,Single-ply,SBD,M,
Boys,67.13,DQ,Arturo Parra,Chico,67.13,,,,,Single-ply,SBD,M,
Boys,74.84,1,Chase Compton,Alvord,68.49,183.7,113.4,170.1,467.2,Single-ply,SBD,M,
Boys,74.84,2,Isaac Vara,Alvord,74.84,170.1,108.86,147.42,426.38,Single-ply,SBD,M,
Boys,74.84,3,Trevor Hopson,Bowie,69.22,147.42,102.06,161.03,410.5,Single-ply,SBD,M,
Boys,74.84,4,Charles Marks,Ponder,73.12,142.88,90.72,147.42,381.02,Single-ply,SBD,M,
Boys,74.84,5,Jaxson Johnston,Bowie,71.67,142.88,90.72,142.88,376.48,Single-ply,SBD,M,
Boys,74.84,6,Chase Eustace,Boyd,67.77,131.54,86.18,136.08,353.8,Single-ply,SBD,M,
Boys,74.84,7,Kayden Pinneke,Chico,71.76,,83.91,113.4,197.31,Single-ply,BD,M,
Boys,74.84,DQ,Christian Holden,Paradise,74.84,,,,,Single-ply,SBD,M,
Boys,82.1,1,Rayce Pennartz,Alvord,77.02,215.46,136.08,204.12,555.65,Single-ply,SBD,M,
Boys,82.1,2,Caden Smith,Ponder,79.92,204.12,129.27,215.46,548.85,Single-ply,SBD,M,
Boys,82.1,3,Tad Tamplen,Ponder,79.02,219.99,102.06,195.04,517.1,Single-ply,SBD,M,
Boys,82.1,4,Michael Nelson,Boyd,79.74,190.51,111.13,208.65,510.29,Single-ply,SBD,M,
Boys,82.1,5,Landon Wilson,Nocona,78.47,158.76,131.54,195.04,485.34,Single-ply,SBD,M,
Boys,82.1,6,Zane Cassidy,Ponder,76.38,183.7,99.79,165.56,449.06,Single-ply,SBD,M,
Boys,82.1,7,Johnny Stone,Nocona,81.01,172.37,92.99,183.7,449.06,Single-ply,SBD,M,
Boys,82.1,8,Marrick Harvey,Paradise,80.47,167.83,129.27,147.42,444.52,Single-ply,SBD,M,
Boys,82.1,9,Jace Wilder,Boyd,77.38,136.08,106.59,145.15,387.82,Single-ply,SBD,M,
Boys,82.1,10,Nash Lowrance,Alvord,82.1,131.54,72.57,163.29,367.41,Single-ply,SBD,M,
Boys,82.1,11,Braden Thoms,Paradise,75.39,129.27,97.52,120.2,347,Single-ply,SBD,M,
Boys,82.1,12,Issac Fulamana,Nocona,78.93,113.4,,124.74,238.14,Single-ply,SD,M,
Boys,89.81,1,Callan Furgerson,Boyd,83.28,170.1,113.4,190.51,474,Single-ply,SBD,M,
Boys,89.81,2,Johnny Arenas,Bowie,84.73,188.24,120.2,158.76,467.2,Single-ply,SBD,M,
Boys,89.81,3,Tucker Thompson,Ponder,84.82,154.22,106.59,165.56,426.38,Single-ply,SBD,M,
Boys,89.81,4,Jesse Nelson,Boyd,84.73,156.49,106.59,161.03,424.11,Single-ply,SBD,M,
Boys,89.81,5,Blaine Warner,Paradise,84.28,145.15,97.52,154.22,396.89,Single-ply,SBD,M,
Boys,89.81,6,Matthew Page,Nocona,89.63,142.88,79.38,142.88,365.14,Single-ply,SBD,M,
Boys,99.79,1,Colby Price,Bowie,90.72,206.38,124.74,174.63,505.76,Single-ply,SBD,M,
Boys,99.79,2,Jessie Rodriguez,Boyd,95.62,195.04,113.4,172.37,480.81,Single-ply,SBD,M,
Boys,99.79,3,Alessandro Rico,Nocona,92.53,165.56,106.59,174.63,446.79,Single-ply,SBD,M,
Boys,99.79,4,Mikah Winters,Boyd,91.72,145.15,102.06,181.44,428.64,Single-ply,SBD,M,
Boys,109.77,1,Jakson Hofbauer,Bowie,107.59,238.14,142.88,204.12,585.13,Single-ply,SBD,M,
Boys,109.77,2,Joe Green,Ponder,109.23,204.12,124.74,192.78,521.63,Single-ply,SBD,M,
Boys,109.77,3,Josh Tucker,Paradise,101.97,190.51,122.47,197.31,510.29,Single-ply,SBD,M,
Boys,109.77,4,James Frye,Alvord,100.33,172.37,92.99,158.76,424.11,Single-ply,SBD,M,
Boys,109.77,5,Fabian Ortiz,Paradise,102.6,122.47,97.52,149.69,369.68,Single-ply,SBD,M,
Boys,109.77,6,Jakob Reed,Bowie,102.97,102.06,127.01,102.06,331.12,Single-ply,SBD,M,
Boys,109.77,7,Bryan DeLeon,Ponder,103.6,226.8,,,226.8,Single-ply,S,M,
Boys,124.74,1,Bryan Arellano,Bowie,113.94,281.23,158.76,199.58,639.57,Single-ply,SBD,M,
Boys,124.74,2,Hayden Sands,Alvord,113.04,233.6,138.35,192.78,564.72,Single-ply,SBD,M,
Boys,124.74,3,Gabe Arencibia,Bowie,114.4,192.78,124.74,204.12,521.63,Single-ply,SBD,M,
Boys,124.74,4,Thomas Carmona,Ponder,115.48,192.78,108.86,183.7,485.34,Single-ply,SBD,M,
Boys,139.71,1,Jacobi McGregor,Bowie,126.92,176.9,102.06,136.08,415.04,Single-ply,SBD,M,
Boys,139.71,DQ,Ihra Montoya,Ponder,133.99,,,,,Single-ply,SBD,M,
Boys,139.71,DQ,Coleton Price,Bowie,130.27,294.84,151.95,,,Single-ply,SBD,M,
