Division,WeightClassKg,Place,Name,Team,BodyweightKg,Best3SquatKg,Best3BenchKg,Best3DeadliftKg,TotalKg,Equipment,Event,Sex,BirthDate
Boys,51.71,1,Adam Perez,De Leon,50.03,88.45,56.7,106.59,251.74,Single-ply,SBD,M,
Boys,51.71,DQ,Chris Diaz,Bangs,51.69,,,120.2,,Single-ply,SBD,M,
Boys,55.79,1,Raiden Spruill,Hico,53.21,90.72,49.9,102.06,242.67,Single-ply,SBD,M,
Boys,59.87,1,Mario Pena,De Leon,58.74,158.76,92.99,163.29,415.04,Single-ply,SBD,M,
Boys,59.87,2,Cameron Patton,Dublin,59.45,122.47,102.06,145.15,369.68,Single-ply,SBD,M,
Boys,59.87,3,Jayden Crouch,Hico,58.2,124.74,74.84,136.08,335.66,Single-ply,SBD,M,
Boys,59.87,4,Alvaro Sanchez,De Leon,58.06,131.54,72.57,127.01,331.12,Single-ply,SBD,M,
Boys,59.87,5,Adam Spharler,Dublin,58.74,111.13,74.84,138.35,324.32,Single-ply,SBD,M,
Boys,59.87,6,Jayden Gerstenberger,Bangs,58.74,115.67,83.91,108.86,308.44,Single-ply,SBD,M,
Boys,59.87,7,Buck Powell,Hico,59.74,108.86,61.23,111.13,281.23,Single-ply,SBD,M,
Boys,59.87,8,Lander Callison,De Leon,56.36,106.59,61.23,106.59,274.42,Single-ply,SBD,M,
Boys,59.87,9,Howard Klutts,Bangs,58.74,92.99,61.23,115.67,269.89,Single-ply,SBD,M,
Boys,67.13,1,Alonzo Moreno,Dublin,65.38,167.83,74.84,158.76,401.43,Single-ply,SBD,M,
Boys,67.13,2,James Cecil,Hico,64.32,142.88,95.25,151.95,390.09,Single-ply,SBD,M,
Boys,67.13,3,Price Mullin,Hico,67.13,145.15,83.91,158.76,387.82,Single-ply,SBD,M,
Boys,67.13,4,Triston Flinn,Hico,66.86,138.35,88.45,151.95,378.75,Single-ply,SBD,M,
Boys,67.13,5,Jason Rainbolt,Hamilton,60.52,115.67,70.31,147.42,333.39,Single-ply,SBD,M,
Boys,67.13,DQ,Devean Greaves,Bangs,60.65,,83.91,120.2,,Single-ply,SBD,M,
Boys,74.84,1,Ian Cortez,Bangs,73.92,222.26,140.61,226.8,589.67,Single-ply,SBD,M,
Boys,74.84,2,Elijah Gonzalez,Dublin,68.42,174.63,88.45,167.83,430.91,Single-ply,SBD,M,
Boys,74.84,3,Lane Spencer,De Leon,73.92,154.22,92.99,158.76,405.97,Single-ply,SBD,M,
Boys,74.84,4,Izaac Wood,Hamilton,69.97,147.42,90.72,147.42,385.55,Single-ply,SBD,M,
Boys,74.84,5,Dakota Higgins,Rising Star,67.78,138.35,79.38,149.69,367.41,Single-ply,SBD,M,
Boys,74.84,6,Michael Guinn,Hico,74.39,127.01,77.11,154.22,358.34,Single-ply,SBD,M,
Boys,74.84,7,Kaysen Bunkley,Hico,68.49,147.42,77.11,117.93,342.46,Single-ply,SBD,M,
Boys,74.84,8,Kasey Lewis,De Leon,69.58,127.01,70.31,145.15,342.46,Single-ply,SBD,M,
Boys,74.84,9,Hunter Crowell,Bangs,72.62,102.06,74.84,95.25,272.16,Single-ply,SBD,M,
Boys,74.84,DQ,Ben Bruce,Hamilton,68.42,158.76,,,,Single-ply,SBD,M,
Boys,74.84,DQ,Jesse Chandler,Hico,74.57,120.2,,165.56,,Single-ply,SBD,M,
Boys,82.1,1,Luis Ordoñez,Dublin,76.84,192.78,136.08,195.04,523.9,Single-ply,SBD,M,
Boys,82.1,2,Alex Thiele,Hamilton,75.3,170.1,92.99,190.51,453.59,Single-ply,SBD,M,
Boys,82.1,3,Miguel Gonzales,Hamilton,81.09,165.56,86.18,156.49,408.23,Single-ply,SBD,M,
Boys,82.1,4,Connor Bostick,De Leon,79.29,158.76,74.84,151.95,385.55,Single-ply,SBD,M,
Boys,82.1,5,Jovani Cervantes,Dublin,74.9,154.22,65.77,163.29,383.29,Single-ply,SBD,M,
Boys,82.1,6,Louis Garcia,De Leon,79.24,111.13,102.06,136.08,349.27,Single-ply,SBD,M,
Boys,82.1,7,Brayden Cook,Rising Star,76.35,124.74,86.18,136.08,347,Single-ply,SBD,M,
Boys,82.1,8,Max Getner,Hico,80.47,102.06,63.5,115.67,281.23,Single-ply,SBD,M,
Boys,82.1,DQ,Chaz Morganstean,De Leon,81.17,127.01,,145.15,,Single-ply,SBD,M,
Boys,89.81,1,Bernie Ortega,Dublin,89.58,210.92,140.61,226.8,578.33,Single-ply,SBD,M,
Boys,89.81,2,Darby Craig,Hamilton,88.7,142.88,95.25,183.7,421.84,Single-ply,SBD,M,
Boys,89.81,3,Jonas Powell,Bangs,88.78,133.81,106.59,142.88,383.29,Single-ply,SBD,M,
Boys,89.81,4,Jaydyn Gonzales,Dublin,88.54,117.93,86.18,133.81,337.93,Single-ply,SBD,M,
Boys,99.79,1,Brooks Clippinger,Early,96.95,235.87,145.15,226.8,607.81,Single-ply,SBD,M,
Boys,99.79,2,Richie Morales,Hico,95.53,151.95,102.06,149.69,403.7,Single-ply,SBD,M,
Boys,99.79,3,Logan Ratliff,Rising Star,96.95,120.2,54.43,127.01,301.64,Single-ply,SBD,M,
Boys,109.77,1,Michael Stanley,Dublin,103.37,235.87,172.37,226.8,635.03,Single-ply,SBD,M,
Boys,109.77,2,Ron Ramirez,Hamilton,104.51,206.38,113.4,183.7,503.49,Single-ply,SBD,M,
Boys,109.77,3,Carson Marquess,Hamilton,105.46,192.78,102.06,197.31,492.15,Single-ply,SBD,M,
Boys,109.77,4,Rylie Garcia,Bangs,105.46,208.65,102.06,158.76,469.47,Single-ply,SBD,M,
Boys,109.77,5,Wes Griffin,Hamilton,107.76,174.63,127.01,163.29,464.93,Single-ply,SBD,M,
Boys,109.77,6,Adrian Ruiz,Hico,108.32,170.1,115.67,151.95,437.72,Single-ply,SBD,M,
Boys,109.77,7,Keegan Sherrill,Early,100,172.37,113.4,149.69,435.45,Single-ply,SBD,M,
Boys,109.77,8,Tyson Owen,Hamilton,109.07,163.29,111.13,158.76,433.18,Single-ply,SBD,M,
Boys,109.77,9,Logan Sherrard,De Leon,109.74,124.74,86.18,149.69,360.61,Single-ply,SBD,M,
Boys,109.77,10,Aiden Tepetate,De Leon,106.31,131.54,74.84,145.15,351.53,Single-ply,SBD,M,
Boys,124.74,1,Jose Najera,Hamilton,115.01,249.48,161.03,217.72,628.23,Single-ply,SBD,M,
Boys,124.74,2,Ruben Silva,De Leon,118.71,208.65,136.08,185.97,530.7,Single-ply,SBD,M,
Boys,124.74,3,Ben Wilson,Hico,124.33,204.12,102.06,174.63,480.81,Single-ply,SBD,M,
Boys,124.74,4,Brody Newton,Bangs,122.27,158.76,106.59,174.63,439.98,Single-ply,SBD,M,
Boys,124.74,5,Nic Adams,Hamilton,115.26,172.37,90.72,170.1,433.18,Single-ply,SBD,M,
Boys,139.71,1,Joe Leal,De Leon,127.14,208.65,131.54,215.46,555.65,Single-ply,SBD,M,
Boys,139.71,2,Noah Pin,Bangs,135.33,231.33,113.4,204.12,548.85,Single-ply,SBD,M,
