Place,Name,Sex,BirthDate,Age,Country,Equipment,Division,BodyweightKg,WeightClassKg,Squat1Kg,Squat2Kg,Squat3Kg,Best3SquatKg,Bench1Kg,Bench2Kg,Bench3Kg,Best3BenchKg,Deadlift1Kg,Deadlift2Kg,Deadlift3Kg,Best3DeadliftKg,TotalKg,Event,Team
DQ,Elsy Suany Julissa Xol Ico,F,2002-04-20,,Guatemala,Raw,Juniors,46.5,47,61.23,65.77,70.31,70.31,-34.02,,,,-70.31,,,,,SBD,Alta Verapaz
1,Eva Maria Calderin Barrios,F,1999-08-30,,Guatemala,Raw,Juniors,51.5,52,124.74,133.81,,133.81,56.7,61.23,63.5,63.5,147.42,151.95,156.5,156.5,353.8,SBD,Guatemala
2,Leilany Alejandra González Campo,F,2001-09-18,,Guatemala,Raw,Juniors,49.2,52,102.06,104.33,106.6,106.6,47.63,58.97,61.23,61.23,102.06,106.6,115.67,115.67,283.5,SBD,Escuintla
3,Ursula Floridalma Gomez Jesus,F,2001-05-29,,Guatemala,Raw,Juniors,47.6,52,52.16,,,52.16,29.48,,,29.48,61.23,70.31,77.11,77.11,158.76,SBD,Huehuetenango
DQ,Heidy Karina Hernández Estrada,F,2002-09-11,,Guatemala,Raw,Juniors,48.1,52,-47.63,-54.43,,,24.95,34.02,,34.02,56.7,61.23,,61.23,,SBD,Jalapa
1,Melany Estefani Caal Caal,F,2000-03-27,,Guatemala,Raw,Juniors,62.9,63,88.45,,,88.45,43.1,,,43.1,74.84,,,74.84,206.38,SBD,Alta Verapaz
1,Milvia Aracely Chajón Car,F,1998-08-30,,Guatemala,Raw,Juniors,83,84,83.91,93,102.06,102.06,34.02,38.56,40.82,40.82,-88.45,97.52,-106.59,97.52,240.4,SBD,Chimaltenango
1,Claudia Vanessa Campo Lara,F,1992-06-14,,Guatemala,Raw,Open,55.6,57,124.74,129.27,133.81,133.81,61.23,-70.31,74.84,74.84,124.74,142.88,147.42,147.42,356.07,SBD,Escuintla
1,Roza Amelia González Girón,F,1981-05-15,,Guatemala,Raw,Masters 1,60.5,63,115.67,120.2,124.74,124.74,47.63,52.16,61.23,61.23,102.06,120.2,133.81,133.81,319.78,SBD,Escuintla
1,Mersy Eunice Soto Escobar,F,1996-11-13,,Guatemala,Raw,Open,44.5,47,45.36,61.23,68.04,68.04,-20.41,22.68,24.95,24.95,61.23,70.31,72.57,72.57,165.56,SBD,San Marcos
2,Darolyn Ana Lisceth Cardona Morales,F,2004-04-05,,Guatemala,Raw,Open,43.9,47,43.1,,,43.1,20.41,-22.68,,20.41,43.1,52.16,,52.16,115.67,SBD,Huehuetenango
DQ,Elsy Suany Julissa Xol Ico,F,2002-04-20,,Guatemala,Raw,Open,46.5,47,61.23,65.77,70.31,70.31,-34.02,,,,-70.31,,,,,SBD,Alta Verapaz
1,Eva Maria Calderin Barrios,F,1999-08-30,,Guatemala,Raw,Open,51.5,52,124.74,133.81,,133.81,56.7,61.23,63.5,63.5,147.42,151.95,156.5,156.5,353.8,SBD,Guatemala
2,Leilany Alejandra González Campo,F,2001-09-18,,Guatemala,Raw,Open,49.2,52,102.06,104.33,106.6,106.6,47.63,58.97,61.23,61.23,102.06,106.6,115.67,115.67,283.5,SBD,Escuintla
3,Ursula Floridalma Gomez Jesus,F,2001-05-29,,Guatemala,Raw,Open,47.6,52,52.16,,,52.16,29.48,,,29.48,61.23,70.31,77.11,77.11,158.76,SBD,Huehuetenango
4,Victoria Carmelita Vásquez Pérez,F,2004-01-04,,Guatemala,Raw,Open,48.3,52,43.1,,,43.1,20.41,,,20.41,52.16,,,52.16,115.67,SBD,Huehuetenango
DQ,Heidy Karina Hernández Estrada,F,2002-09-11,,Guatemala,Raw,Open,48.1,52,-47.63,-54.43,,,24.95,34.02,,34.02,56.7,61.23,,61.23,,SBD,Jalapa
1,Claudia Vanessa Campo Lara,F,1992-06-14,,Guatemala,Raw,Open,55.6,57,124.74,129.27,133.81,133.81,61.23,-70.31,74.84,74.84,124.74,142.88,147.42,147.42,356.07,SBD,Escuintla
2,Merlin Anayansy Tepaz Tomás,F,1992-06-14,,Guatemala,Raw,Open,55.4,57,93,102.06,-111.13,102.06,43.1,47.63,49.9,49.9,93,102.06,106.6,106.6,258.55,SBD,Chimaltenango
1,Roza Amelia González Girón,F,1981-05-15,,Guatemala,Raw,Open,60.5,63,115.67,120.2,124.74,124.74,47.63,52.16,61.23,61.23,102.06,120.2,133.81,133.81,319.78,SBD,Escuintla
2,Melany Estefani Caal Caal,F,2000-03-27,,Guatemala,Raw,Open,62.9,63,88.45,,,88.45,43.1,,,43.1,74.84,,,74.84,206.38,SBD,Alta Verapaz
3,Jennifer Dallana Martinez Garcia,F,2003-09-28,,Guatemala,Raw,Open,58.4,63,38.56,,,38.56,34.02,,,34.02,61.23,,,61.23,133.81,SBD,Huehuetenango
1,Laura Mariela Vásquez Cortez,F,1995-06-23,,Guatemala,Raw,Open,65.2,69,-97.52,102.06,,102.06,61.23,,,61.23,124.74,133.81,,133.81,297.1,SBD,Huehuetenango
2,Sharon Cristina M Recinos Martinez,F,2004-02-14,,Guatemala,Raw,Open,63.8,69,52.16,,,52.16,24.95,,,24.95,61.23,70.31,74.84,74.84,151.95,SBD,Huehuetenango
1,Ericka Liliana Dávila Cárcamo,F,1996-03-14,,Guatemala,Raw,Open,75.35,76,167.83,170.1,174.63,174.63,93,95.25,97.52,97.52,174.63,179.17,183.7,183.7,455.86,SBD,Guatemala
2,Ana María Arroyo Acuta de Itzol,F,1982-07-26,,Guatemala,Raw,Open,75,76,124.74,-133.81,-142.88,124.74,70.31,74.84,-77.11,74.84,111.13,133.81,142.88,142.88,342.46,SBD,Chimaltenango
1,Ethiel Zapeta Hernández,F,1992-01-16,,Guatemala,Raw,Open,82.9,84,142.88,151.95,-161.03,151.95,61.23,65.77,70.31,70.31,133.81,142.88,151.95,151.95,374.21,SBD,Chimaltenango
2,Milvia Aracely Chajón Car,F,1998-08-30,,Guatemala,Raw,Open,83,84,83.91,93,102.06,102.06,34.02,38.56,40.82,40.82,-88.45,97.52,-106.59,97.52,240.4,SBD,Chimaltenango
3,Sindy Victoria Ajsibinac Ajú,F,1991-09-01,,Guatemala,Raw,Open,84,84,93,,,93,45.36,,,45.36,93,,,93,231.33,SBD,Solola
DQ,Sara Galilea Quib Quib,F,2006-02-03,,Guatemala,Raw,Open,77.8,84,142.88,,,142.88,74.84,,,74.84,-142.88,,,,,SBD,Alta Verapaz
1,Cristy Alejandrina Cano Flores,F,2003-01-24,,Guatemala,Raw,Open,84.3,84+,-83.91,93,102.06,102.06,43.1,,,43.1,-92.99,102.06,,102.06,247.21,SBD,Huehuetenango
1,Ilvy Eunice Cardona Morales,F,2007-09-08,,Guatemala,Raw,Sub-Juniors,42.4,43,43.1,,,43.1,20.41,22.68,,22.68,43.1,47.63,,47.63,113.4,SBD,Huehuetenango
DQ,Lilian Marleny Gertrudis Chub Caal,F,2003-12-14,,Guatemala,Raw,Sub-Juniors,41.2,43,-52.16,,,,-34.02,,,,-65.77,,,,,SBD,Alta Verapaz
1,Darolyn Ana Lisceth Cardona Morales,F,2004-04-05,,Guatemala,Raw,Sub-Juniors,43.9,47,43.1,,,43.1,20.41,-22.68,,20.41,43.1,52.16,,52.16,115.67,SBD,Huehuetenango
1,Victoria Carmelita Vásquez Pérez,F,2004-01-04,,Guatemala,Raw,Sub-Juniors,48.3,52,43.1,,,43.1,20.41,,,20.41,52.16,,,52.16,115.67,SBD,Huehuetenango
1,Jennifer Dallana Martinez Garcia,F,2003-09-28,,Guatemala,Raw,Sub-Juniors,58.4,63,38.56,,,38.56,34.02,,,34.02,61.23,,,61.23,133.81,SBD,Huehuetenango
1,Sharon Cristina M Recinos Martinez,F,2004-02-14,,Guatemala,Raw,Sub-Juniors,63.8,69,52.16,,,52.16,24.95,,,24.95,61.23,70.31,74.84,74.84,151.95,SBD,Huehuetenango
DQ,Sara Galilea Quib Quib,F,2006-02-03,,Guatemala,Raw,Sub-Juniors,77.8,84,142.88,,,142.88,74.84,,,74.84,-142.88,,,,,SBD,Alta Verapaz
1,Cristy Alejandrina Cano Flores,F,2003-01-24,,Guatemala,Raw,Sub-Juniors,84.3,84+,-83.91,93,102.06,102.06,43.1,,,43.1,-92.99,102.06,,102.06,247.21,SBD,Huehuetenango
1,Emerson Vicente Tipaz Taquiej,M,2001-02-15,,Guatemala,Raw,Juniors,52.53,53,120.2,129.27,138.35,138.35,70.31,74.84,83.91,83.91,151.95,156.5,165.56,165.56,387.82,SBD,Quiche
1,Axel Rafael Díaz Veliz,M,2002-04-22,,Guatemala,Raw,Juniors,58.15,59,102.06,111.13,115.67,115.67,70.31,79.38,83.91,83.91,138.35,142.88,147.42,147.42,347,SBD,Guatemala
2,Nelson Alberto Aveiro Sebastian,M,2001-04-15,,Guatemala,Raw,Juniors,57,59,83.91,93,97.52,97.52,61.23,63.5,65.77,65.77,102.06,124.74,142.88,142.88,306.17,SBD,Huehuetenango
DQ,Michael Oliverio Chen Ico,M,1998-12-10,,Guatemala,Raw,Juniors,57.6,59,-151.95,,,,-83.91,,,,174.63,,,174.63,,SBD,Alta Verapaz
DQ,Nicolás Fernando de León Brito,M,1999-06-01,,Guatemala,Raw,Juniors,58.06,59,-142.88,-151.95,-165.56,,83.91,93,-97.52,93,165.56,174.63,183.7,183.7,,SBD,Quiche
DQ,Pedro Juan Sosof Quiacain,M,1999-10-17,,Guatemala,Raw,Juniors,58.1,59,102.06,,,102.06,-83.91,,,,142.88,,,142.88,,SBD,Solola
1,Brus Eduardo Sazo Rosalez,M,2002-03-16,,Guatemala,Raw,Juniors,64.3,66,142.88,151.95,156.5,156.5,93,102.06,106.6,106.6,174.63,183.7,188.24,188.24,451.32,SBD,Escuintla
2,Luis Estuardo Lima Pérez,M,2000-09-15,,Guatemala,Raw,Juniors,65,66,165.56,,,165.56,83.91,93,97.52,97.52,165.56,174.63,185.97,185.97,449.06,SBD,Jalapa
3,Francisco Alexander López Reynoso,M,2001-03-08,,Guatemala,Raw,Juniors,65.41,66,129.27,138.35,142.88,142.88,74.84,83.91,93,93,156.5,-165.56,174.63,174.63,410.5,SBD,Quiche
4,Daniel de Jesús Díaz Guerra,M,2002-02-11,,Guatemala,Raw,Juniors,65.4,66,127.01,142.88,,142.88,83.91,88.45,,88.45,158.76,170.1,,170.1,401.43,SBD,Guatemala
5,Brayan Ramiro Escobedo,M,2001-09-03,,Guatemala,Raw,Juniors,64.1,66,102.06,,,102.06,70.31,74.84,79.38,79.38,124.74,,,124.74,306.17,SBD,Huehuetenango
1,Oscar Orlando Jeronimo Gramajo,M,2003-11-05,,Guatemala,Raw,Juniors,72.3,74,183.7,197.31,206.38,206.38,102.06,115.67,-122.47,115.67,183.7,188.24,192.78,192.78,514.83,SBD,Guatemala
DQ,Marlon Gerardo Cu de Paz,M,2002-10-22,,Guatemala,Raw,Juniors,66,66,-165.56,,,,-111.13,,,,-192.78,,,,,SBD,Alta Verapaz
DQ,Jeisson Alejandro Gómez Moratalla,M,2001-06-07,,Guatemala,Raw,Juniors,69.8,74,-165.56,,,,-92.99,102.06,,102.06,165.56,174.63,,174.63,,SBD,Jalapa
DQ,Jose Maria Juarez,M,2002-08-19,,Guatemala,Raw,Juniors,73,74,-165.56,-165.56,-192.78,,-102.06,106.6,-111.13,106.6,142.88,165.56,183.7,183.7,,SBD,Sacatepequez
1,Ermes Estuardo Muñoz Muñoz,M,1998-04-03,,Guatemala,Raw,Juniors,80.9,83,165.56,174.63,-183.7,174.63,115.67,124.74,127.01,127.01,183.7,201.85,206.38,206.38,508.02,SBD,Chimaltenango
2,Julio Alfredo Fernández Rodríguez,M,1999-05-02,,Guatemala,Raw,Juniors,78.95,83,183.7,201.85,206.38,206.38,102.06,113.4,-120.2,113.4,183.7,,,183.7,503.5,SBD,Guatemala
3,Juan Carlos Rodríguez,M,2002-10-10,,Guatemala,Raw,Juniors,77.9,83,102.06,,,102.06,61.23,93,,93,142.88,,,142.88,337.93,SBD,Huehuetenango
1,Diego Estuardo Servellon Guerrero,M,2001-08-04,,Guatemala,Raw,Juniors,84.6,93,-165.56,174.63,-183.7,174.63,102.06,111.13,,111.13,192.78,-199.58,-201.85,192.78,478.54,SBD,Sacatepequez
2,Duglas Eduardo Padilla Castillo,M,2001-03-31,,Guatemala,Raw,Juniors,83.6,93,115.67,-124.74,129.27,129.27,70.31,79.38,,79.38,142.88,151.95,161.03,161.03,369.68,SBD,Chimaltenango
1,Robin Lizandro Geronimo Marquez,M,1999-10-22,,Guatemala,Raw,Juniors,101.3,105,-142.88,151.95,-156.49,151.95,83.91,93,-97.52,93,165.56,174.63,-183.7,174.63,419.57,SBD,Sacatepequez
2,Miguel Eduardo Gomez Lopez,M,1990-12-26,,Guatemala,Raw,Open,103,105,124.74,142.88,,142.88,83.91,93,102.06,102.06,142.88,170.1,-174.63,170.1,415.04,SBD,Huehuetenango
1,Raúl Adonai Padilla Castillo,M,2002-07-22,,Guatemala,Raw,Juniors,120,120,115.67,133.81,138.35,138.35,74.84,-79.38,,74.84,142.88,165.56,-170.1,165.56,378.75,SBD,Chimaltenango
DQ,Víctor García Vicente,M,1977-01-22,,Guatemala,Raw,Masters 1,67.41,74,133.81,142.88,161.03,161.03,-92.99,-102.06,-106.59,,151.95,165.56,-170.1,165.56,,SBD,Quiche
1,Angel Mario Nij Tezén,M,1974-04-10,,Guatemala,Raw,Masters 1,81.6,83,183.7,206.38,208.65,208.65,133.81,138.35,140.61,140.61,206.38,215.46,217.72,217.72,567,SBD,Guatemala
2,Domingo Quiacaín Baram,M,1975-07-03,,Guatemala,Raw,Masters 1,82.9,83,142.88,,,142.88,93,,,93,142.88,,,142.88,378.75,SBD,Solola
1,Nery Alberto Velásquez Perez,M,1974-11-24,,Guatemala,Raw,Masters 1,90.9,93,183.7,192.78,-197.31,192.78,111.13,120.2,-124.74,120.2,215.46,,,215.46,528.44,SBD,Guatemala
2,Carlos Enrique Itzol Axpuac,M,1978-06-05,,Guatemala,Raw,Masters 1,91.5,93,124.74,133.81,142.88,142.88,-102.06,106.6,-108.86,106.6,142.88,156.5,-161.03,156.5,405.97,SBD,Chimaltenango
1,Carlos Marin Cardona Mazariegos,M,1978-06-14,,Guatemala,Raw,Masters 1,108.55,120,106.6,,,106.6,102.06,,,102.06,142.88,,,142.88,351.53,SBD,Huehuetenango
DQ,Jose Maria Gonzalez Baram,M,1962-12-22,,Guatemala,Raw,Masters 2,73.4,74,102.06,,,102.06,83.91,,,83.91,-142.88,,,,,SBD,Solola
1,Juan Ezequiel Hernández Chajón,M,1963-04-10,,Guatemala,Raw,Masters 2,77.2,83,142.88,151.95,-156.49,151.95,102.06,111.13,,111.13,142.88,156.5,170.1,170.1,433.18,SBD,Chimaltenango
2,Walter Francisco Hernández Arreaga,M,1970-10-05,,Guatemala,Raw,Masters 2,82.9,83,102.06,113.4,-122.47,113.4,93,102.06,-113.4,102.06,124.74,142.88,151.95,151.95,367.41,SBD,San Marcos
1,Julio Manuel Garcia,M,1956-07-20,,Guatemala,Raw,Masters 3,58.3,59,43.1,52.16,56.7,56.7,43.1,52.16,61.23,61.23,61.23,70.31,102.06,102.06,220,SBD,Huehuetenango
1,Emerson Vicente Tipaz Taquiej,M,2001-02-15,,Guatemala,Raw,Open,52.53,59,120.2,129.27,138.35,138.35,70.31,74.84,83.91,83.91,151.95,156.5,165.56,165.56,387.82,SBD,Quiche
1,José Luis Miguel García Satz,M,1984-09-16,,Guatemala,Raw,Open,56,59,142.88,151.95,161.03,161.03,102.06,106.6,111.13,111.13,142.88,156.5,,156.5,428.64,SBD,Chimaltenango
2,Axel Rafael Díaz Veliz,M,2002-04-22,,Guatemala,Raw,Open,58.15,59,102.06,111.13,115.67,115.67,70.31,79.38,83.91,83.91,138.35,142.88,147.42,147.42,347,SBD,Guatemala
3,Nelson Alberto Aveiro Sebastian,M,2001-04-15,,Guatemala,Raw,Open,57,59,83.91,93,97.52,97.52,61.23,63.5,65.77,65.77,102.06,124.74,142.88,142.88,306.17,SBD,Huehuetenango
4,Justin Zacarias Velasquez Lopez,M,2005-03-04,,Guatemala,Raw,Open,58.85,59,83.91,-92.99,,83.91,61.23,65.77,70.31,70.31,104.33,106.6,113.4,113.4,267.62,SBD,Guatemala
5,Julio Manuel Garcia,M,1956-07-20,,Guatemala,Raw,Open,58.3,59,43.1,52.16,56.7,56.7,43.1,52.16,61.23,61.23,61.23,70.31,102.06,102.06,220,SBD,Huehuetenango
6,Eddy Josué Vásquez Alvarado,M,2007-01-23,,Guatemala,Raw,Open,58.2,59,52.16,-61.23,,52.16,38.56,40.82,,40.82,61.23,74.84,,74.84,167.83,SBD,Huehuetenango
DQ,Michael Oliverio Chen Ico,M,1998-12-10,,Guatemala,Raw,Open,57.6,59,-151.95,,,,-83.91,,,,174.63,,,174.63,,SBD,Alta Verapaz
DQ,Nicolás Fernando de León Brito,M,1999-06-01,,Guatemala,Raw,Open,58.06,59,-142.88,-151.95,-165.56,,83.91,93,-97.52,93,165.56,174.63,183.7,183.7,,SBD,Quiche
DQ,Pedro Juan Sosof Quiacain,M,1999-10-17,,Guatemala,Raw,Open,58.1,59,102.06,,,102.06,-83.91,,,,142.88,,,142.88,,SBD,Solola
1,Dennis Gustavo Búrbano García,M,1990-10-07,,Guatemala,Raw,Open,64.8,66,181.44,192.78,-204.12,192.78,124.74,133.81,142.88,142.88,206.38,215.46,,215.46,551.11,SBD,Chimaltenango
2,Brus Eduardo Sazo Rosalez,M,2002-03-16,,Guatemala,Raw,Open,64.3,66,142.88,151.95,156.5,156.5,93,102.06,106.6,106.6,174.63,183.7,188.24,188.24,451.32,SBD,Escuintla
3,Luis Estuardo Lima Pérez,M,2000-09-15,,Guatemala,Raw,Open,65,66,165.56,,,165.56,83.91,93,97.52,97.52,165.56,174.63,185.97,185.97,449.06,SBD,Jalapa
4,Vinicio Josue De Léon,M,1993-05-24,,Guatemala,Raw,Open,64.35,66,142.88,151.95,156.5,156.5,-88.45,93,97.52,97.52,174.63,183.7,188.24,188.24,442.25,SBD,Guatemala
5,Francisco Alexander López Reynoso,M,2001-03-08,,Guatemala,Raw,Open,65.41,66,129.27,138.35,142.88,142.88,74.84,83.91,93,93,156.5,-165.56,174.63,174.63,410.5,SBD,Quiche
6,Daniel de Jesús Díaz Guerra,M,2002-02-11,,Guatemala,Raw,Open,65.4,66,127.01,142.88,,142.88,83.91,88.45,,88.45,158.76,170.1,,170.1,401.43,SBD,Guatemala
7,Jose Alejandro Fernández Rodríguez,M,2004-08-15,,Guatemala,Raw,Open,62.45,66,102.06,,,102.06,52.16,61.23,68.04,68.04,124.74,142.88,147.42,147.42,317.51,SBD,Guatemala
8,Brayan Ramiro Escobedo,M,2001-09-03,,Guatemala,Raw,Open,64.1,66,102.06,,,102.06,70.31,74.84,79.38,79.38,124.74,,,124.74,306.17,SBD,Huehuetenango
9,Manuel Cruz Cruz,M,2006-09-26,,Guatemala,Raw,Open,65.5,66,93,,,93,52.16,,,52.16,102.06,,,102.06,247.21,SBD,Solola
10,José Dario Juan Diego,M,2003-01-16,,Guatemala,Raw,Open,62.6,66,61.23,83.91,,83.91,43.1,47.63,,47.63,83.91,-102.06,,83.91,215.46,SBD,Huehuetenango
DQ,Selvin Humberto Tello Cu,M,1998-07-03,,Guatemala,Raw,Open,65.3,66,-151.95,,,,-92.99,,,,-165.56,,,,,SBD,Alta Verapaz
1,Jorge Manuel Mérida Zaldaña,M,1994-02-06,,Guatemala,Raw,Open,73.8,74,142.88,165.56,-174.63,165.56,142.88,156.5,-165.56,156.5,183.7,197.31,,197.31,519.36,SBD,Chimaltenango
2,Oscar Orlando Jeronimo Gramajo,M,2003-11-05,,Guatemala,Raw,Open,72.3,74,183.7,197.31,206.38,206.38,102.06,115.67,-122.47,115.67,183.7,188.24,192.78,192.78,514.83,SBD,Guatemala
3,Wilmar Alier Vallecios Castro,M,1988-09-06,,Guatemala,Raw,Open,72.85,74,165.56,174.63,183.7,183.7,113.4,120.2,124.74,124.74,183.7,192.78,197.31,197.31,505.76,SBD,Guatemala
4,Leswyn Emiliano Arrecis Morales,M,2003-03-02,,Guatemala,Raw,Open,69.5,74,74.84,93,,93,52.16,56.7,,56.7,124.74,142.88,,142.88,292.57,SBD,Chimaltenango
DQ,Marlon Gerardo Cu de Paz,M,2002-10-22,,Guatemala,Raw,Open,66,66,-165.56,,,,-111.13,,,,-192.78,,,,,SBD,Alta Verapaz
DQ,Víctor García Vicente,M,1977-01-22,,Guatemala,Raw,Open,67.41,74,133.81,142.88,161.03,161.03,-92.99,-102.06,-106.59,,151.95,165.56,-170.1,165.56,,SBD,Quiche
DQ,Jeisson Alejandro Gómez Moratalla,M,2001-06-07,,Guatemala,Raw,Open,69.8,74,-165.56,,,,-92.99,102.06,,102.06,165.56,174.63,,174.63,,SBD,Jalapa
DQ,Jose Maria Juarez,M,2002-08-19,,Guatemala,Raw,Open,73,74,-165.56,-165.56,-192.78,,-102.06,106.6,-111.13,106.6,142.88,165.56,183.7,183.7,,SBD,Sacatepequez
DQ,Jose Maria Gonzalez Baram,M,1962-12-22,,Guatemala,Raw,Open,73.4,74,102.06,,,102.06,83.91,,,83.91,-142.88,,,,,SBD,Solola
1,Michel Jorge Vásquez González,M,1987-06-04,,Guatemala,Raw,Open,82.5,83,206.38,215.46,,215.46,151.95,161.03,167.83,167.83,224.53,238.14,242.67,242.67,625.96,SBD,Chimaltenango
2,Angel Mario Nij Tezén,M,1974-04-10,,Guatemala,Raw,Open,81.6,83,183.7,206.38,208.65,208.65,133.81,138.35,140.61,140.61,206.38,215.46,217.72,217.72,567,SBD,Guatemala
3,Ermes Estuardo Muñoz Muñoz,M,1998-04-03,,Guatemala,Raw,Open,80.9,83,165.56,174.63,-183.7,174.63,115.67,124.74,127.01,127.01,183.7,201.85,206.38,206.38,508.02,SBD,Chimaltenango
4,Wilder José López Ventura,M,2003-08-28,,Guatemala,Raw,Open,81.9,83,165.56,183.7,192.78,192.78,93,102.06,-106.59,102.06,183.7,206.38,210.92,210.92,505.76,SBD,Chimaltenango
5,Julio Alfredo Fernández Rodríguez,M,1999-05-02,,Guatemala,Raw,Open,78.95,83,183.7,201.85,206.38,206.38,102.06,113.4,-120.2,113.4,183.7,,,183.7,503.5,SBD,Guatemala
6,Juan Ezequiel Hernández Chajón,M,1963-04-10,,Guatemala,Raw,Open,77.2,83,142.88,151.95,-156.49,151.95,102.06,111.13,,111.13,142.88,156.5,170.1,170.1,433.18,SBD,Chimaltenango
7,Domingo Quiacaín Baram,M,1975-07-03,,Guatemala,Raw,Open,82.9,83,142.88,,,142.88,93,,,93,142.88,,,142.88,378.75,SBD,Solola
8,Walter Francisco Hernández Arreaga,M,1970-10-05,,Guatemala,Raw,Open,82.9,83,102.06,113.4,-122.47,113.4,93,102.06,-113.4,102.06,124.74,142.88,151.95,151.95,367.41,SBD,San Marcos
9,Juan Carlos Rodríguez,M,2002-10-10,,Guatemala,Raw,Open,77.9,83,102.06,,,102.06,61.23,93,,93,142.88,,,142.88,337.93,SBD,Huehuetenango
DQ,José Luis Pérez Rodríguez,M,2003-03-01,,Guatemala,Raw,Open,81.2,83,-188.24,,,,102.06,-111.13,,102.06,183.7,192.78,,192.78,,SBD,Jalapa
1,William Leonel Ramírez Ramos,M,1994-11-08,,Guatemala,Raw,Open,92.7,93,206.38,238.14,-247.21,238.14,142.88,161.03,,161.03,224.53,256.28,265.35,265.35,664.51,SBD,Chimaltenango
2,Nery Alberto Velásquez Perez,M,1974-11-24,,Guatemala,Raw,Open,90.9,93,183.7,192.78,-197.31,192.78,111.13,120.2,-124.74,120.2,215.46,,,215.46,528.44,SBD,Guatemala
3,Diego Estuardo Servellon Guerrero,M,2001-08-04,,Guatemala,Raw,Open,84.6,93,-165.56,174.63,-183.7,174.63,102.06,111.13,,111.13,192.78,-199.58,-201.85,192.78,478.54,SBD,Sacatepequez
4,Carlos Enrique Itzol Axpuac,M,1978-06-05,,Guatemala,Raw,Open,91.5,93,124.74,133.81,142.88,142.88,-102.06,106.6,-108.86,106.6,142.88,156.5,-161.03,156.5,405.97,SBD,Chimaltenango
5,Eduardo Javier Noches Trejo,M,2004-04-05,,Guatemala,Raw,Open,92.95,93,111.13,120.2,124.74,124.74,70.31,79.38,-83.91,79.38,151.95,170.1,174.63,174.63,378.75,SBD,Guatemala
6,Duglas Eduardo Padilla Castillo,M,2001-03-31,,Guatemala,Raw,Open,83.6,93,115.67,-124.74,129.27,129.27,70.31,79.38,,79.38,142.88,151.95,161.03,161.03,369.68,SBD,Chimaltenango
1,Edwin Adolfo Velásquez Pinto,M,1984-05-26,,Guatemala,Raw,Open,104.7,105,224.53,247.21,256.28,256.28,161.03,165.56,167.83,167.83,224.53,247.21,256.28,256.28,680.4,SBD,Chimaltenango
2,Obrayan Omar Lopez Barrera,M,1996-11-07,,Guatemala,Raw,Open,96.3,105,165.56,-183.7,-185.97,165.56,127.01,129.27,133.81,133.81,197.31,201.85,215.46,215.46,514.83,SBD,Guatemala
3,Robin Lizandro Geronimo Marquez,M,1999-10-22,,Guatemala,Raw,Open,101.3,105,-142.88,151.95,-156.49,151.95,83.91,93,-97.52,93,165.56,174.63,-183.7,174.63,419.57,SBD,Sacatepequez
4,Miguel Eduardo Gomez Lopez,M,1990-12-26,,Guatemala,Raw,Open,103,105,124.74,142.88,,142.88,83.91,93,102.06,102.06,142.88,170.1,-174.63,170.1,415.04,SBD,Huehuetenango
1,Arivi Chang Hernández,M,1983-08-09,,Guatemala,Raw,Open,115.35,120,-219.99,224.53,247.21,247.21,142.88,158.76,161.03,161.03,215.46,226.8,229.06,229.06,637.3,SBD,Guatemala
2,Raúl Adonai Padilla Castillo,M,2002-07-22,,Guatemala,Raw,Open,120,120,115.67,133.81,138.35,138.35,74.84,-79.38,,74.84,142.88,165.56,-170.1,165.56,378.75,SBD,Chimaltenango
3,Carlos Marin Cardona Mazariegos,M,1978-06-14,,Guatemala,Raw,Open,108.55,120,106.6,,,106.6,102.06,,,102.06,142.88,,,142.88,351.53,SBD,Huehuetenango
4,Carlos Estuardo Castillo Rivas,M,1986-10-18,,Guatemala,Raw,Open,106.5,120,102.06,,,102.06,74.84,,,74.84,61.23,,,61.23,238.14,SBD,Huehuetenango
1,Allan Alberto Santandrea Alburez,M,1985-07-03,,Guatemala,Raw,Open,140.95,120+,226.8,247.21,265.35,265.35,165.56,183.7,197.31,197.31,183.7,206.38,-224.53,206.38,669.05,SBD,Guatemala
1,José Gabriel Chacón Estrada,M,2004-07-10,,Guatemala,Raw,Sub-Juniors,48.4,53,43.1,52.16,70.31,70.31,34.02,38.56,,38.56,74.84,83.91,93,93,201.85,SBD,Chimaltenango
1,Justin Zacarias Velasquez Lopez,M,2005-03-04,,Guatemala,Raw,Sub-Juniors,58.85,59,83.91,-92.99,,83.91,61.23,65.77,70.31,70.31,104.33,106.6,113.4,113.4,267.62,SBD,Guatemala
2,Eddy Josué Vásquez Alvarado,M,2007-01-23,,Guatemala,Raw,Sub-Juniors,58.2,59,52.16,-61.23,,52.16,38.56,40.82,,40.82,61.23,74.84,,74.84,167.83,SBD,Huehuetenango
1,Jose Alejandro Fernández Rodríguez,M,2004-08-15,,Guatemala,Raw,Sub-Juniors,62.45,66,102.06,,,102.06,52.16,61.23,68.04,68.04,124.74,142.88,147.42,147.42,317.51,SBD,Guatemala
2,Manuel Cruz Cruz,M,2006-09-26,,Guatemala,Raw,Sub-Juniors,65.5,66,93,,,93,52.16,,,52.16,102.06,,,102.06,247.21,SBD,Solola
3,José Dario Juan Diego,M,2003-01-16,,Guatemala,Raw,Sub-Juniors,62.6,66,61.23,83.91,,83.91,43.1,47.63,,47.63,83.91,-102.06,,83.91,215.46,SBD,Huehuetenango
1,Leswyn Emiliano Arrecis Morales,M,2003-03-02,,Guatemala,Raw,Sub-Juniors,69.5,74,74.84,93,,93,52.16,56.7,,56.7,124.74,142.88,,142.88,292.57,SBD,Chimaltenango
1,Wilder José López Ventura,M,2003-08-28,,Guatemala,Raw,Sub-Juniors,81.9,83,165.56,183.7,192.78,192.78,93,102.06,-106.59,102.06,183.7,206.38,210.92,210.92,505.76,SBD,Chimaltenango
DQ,José Luis Pérez Rodríguez,M,2003-03-01,,Guatemala,Raw,Sub-Juniors,81.2,83,-188.24,,,,102.06,-111.13,,102.06,183.7,192.78,,192.78,,SBD,Jalapa
1,Eduardo Javier Noches Trejo,M,2004-04-05,,Guatemala,Raw,Sub-Juniors,92.95,93,111.13,120.2,124.74,124.74,70.31,79.38,-83.91,79.38,151.95,170.1,174.63,174.63,378.75,SBD,Guatemala
