Division,WeightClassKg,Place,Name,Team,BodyweightKg,Best3SquatKg,Best3BenchKg,Best3DeadliftKg,TotalKg,Equipment,Event,Sex,BirthDate
Boys,51.71,1,Joel Gainzar,Pilot Point,50.62,111.13,63.5,117.93,292.57,Single-ply,SBD,M,
Boys,51.71,2,Lucas Woolem,Tom Bean,50.8,102.06,61.23,81.65,244.94,Single-ply,SBD,M,
Boys,51.71,3,Aiden Galaviz,Valley View,51.71,79.38,49.9,104.33,233.6,Single-ply,SBD,M,
Boys,59.87,1,Justin Baque,Tom Bean,58.24,149.69,72.57,158.76,381.02,Single-ply,SBD,M,
Boys,59.87,2,Preston Moore,Melissa,57.88,124.74,79.38,136.08,340.19,Single-ply,SBD,M,
Boys,67.13,1,Trevor Martin,Pilot Point,62.51,163.29,95.25,167.83,426.38,Single-ply,SBD,M,
Boys,67.13,2,Caleb Garcia,Mesquite Horn,66.41,163.29,79.38,165.56,408.23,Single-ply,SBD,M,
Boys,67.13,3,Wyatt Exner,Valley View,62.78,151.95,74.84,176.9,403.7,Single-ply,SBD,M,
Boys,67.13,4,Brandon Halliburton,Anna,64.77,145.15,77.11,149.69,371.95,Single-ply,SBD,M,
Boys,67.13,5,Blake Jones,Pottsboro,64.14,124.74,95.25,142.88,362.87,Single-ply,SBD,M,
Boys,67.13,6,Jordan Shute,Anna,66.86,142.88,79.38,136.08,358.34,Single-ply,SBD,M,
Boys,67.13,DQ,Will Hernandez,Melissa,64.14,156.49,,,,Single-ply,SBD,M,
Boys,74.84,1,Josh Nicholas,Melissa,73.94,192.78,102.06,195.04,489.88,Single-ply,SBD,M,
Boys,74.84,2,Myles Williams,Melissa,67.4,176.9,115.67,188.24,480.81,Single-ply,SBD,M,
Boys,74.84,3,Cale Martin,Pilot Point,73.75,170.1,111.13,183.7,464.93,Single-ply,SBD,M,
Boys,74.84,4,Cole Riley,Melissa,69.49,161.03,86.18,147.42,394.63,Single-ply,SBD,M,
Boys,74.84,5,Jackson Bell,Watauga Harvest Christian Academy,68.31,138.35,72.57,176.9,387.82,Single-ply,SBD,M,
Boys,74.84,6,Alex Conley,Pottsboro,73.21,124.74,83.91,165.56,374.21,Single-ply,SBD,M,
Boys,74.84,7,Gage Moore,Tom Bean,71.03,142.88,79.38,142.88,365.14,Single-ply,SBD,M,
Boys,74.84,8,Braden Miles,Valley View,73.3,90.72,70.31,161.03,322.05,Single-ply,SBD,M,
Boys,74.84,DQ,Peyton Knight,Melissa,73.94,265.35,,,,Single-ply,SBD,M,
Boys,74.84,DQ,Angel Cardoso-Vargas,Mesquite Horn,73.66,142.88,,,,Single-ply,SBD,M,
Boys,82.1,1,Jayson Cave,Melissa,81.19,217.72,138.35,219.99,576.06,Single-ply,SBD,M,
Boys,82.1,2,Robert Hudson,Mesquite Horn,80.74,201.85,124.74,192.78,519.36,Single-ply,SBD,M,
Boys,82.1,3,Cash Cawthon,Valley View,80.29,142.88,61.23,165.56,369.68,Single-ply,SBD,M,
Boys,82.1,4,Ryan Wood,Watauga Harvest Christian Academy,80.56,117.93,58.97,136.08,312.98,Single-ply,SBD,M,
Boys,82.1,DQ,Tarrick Borner,Mesquite Horn,77.47,151.95,,,,Single-ply,SBD,M,
Boys,89.81,1,Billy Barrea,Anna,88.63,229.06,111.13,206.38,546.58,Single-ply,SBD,M,
Boys,89.81,2,Alex Giron,Pilot Point,87.18,204.12,102.06,170.1,476.27,Single-ply,SBD,M,
Boys,89.81,3,Creighton Gattis,Pottsboro,88.72,165.56,88.45,158.76,412.77,Single-ply,SBD,M,
Boys,89.81,DQ,Roman Garbrandt,Howe,88.9,115.67,70.31,,,Single-ply,SBD,M,
Boys,99.79,1,Clayton West,Anna,94.17,238.14,124.74,183.7,546.58,Single-ply,SBD,M,
Boys,99.79,2,Izak Lenart,Lucas Lovejoy,95.44,183.7,120.2,206.38,510.29,Single-ply,SBD,M,
Boys,99.79,3,Luke Demel,Melissa,94.17,192.78,124.74,188.24,505.76,Single-ply,SBD,M,
Boys,99.79,4,Hector Rincon,Anna,98.97,170.1,111.13,183.7,464.93,Single-ply,SBD,M,
Boys,99.79,5,Cody Kirk,Pottsboro,97.98,158.76,111.13,149.69,419.57,Single-ply,SBD,M,
Boys,99.79,6,Aidan Cornett,Pottsboro,91.99,120.2,56.7,117.93,294.84,Single-ply,SBD,M,
Boys,99.79,DQ,Peyton Barthold,Valley View,96.52,190.51,90.72,,,Single-ply,SBD,M,
Boys,99.79,DQ,Zachary Reese,Howe,98.88,140.61,61.23,,,Single-ply,SBD,M,
Boys,99.79,DQ,Charles Vera,Howe,94.44,208.65,,,,Single-ply,SBD,M,
Boys,99.79,DQ,Michael Weimer,Howe,93.08,,,,,Single-ply,SBD,M,
Boys,109.77,1,JR Box,Anna,104.51,226.8,142.88,249.48,619.15,Single-ply,SBD,M,
Boys,109.77,2,Lance Riley,Melissa,100.43,217.72,129.27,201.85,548.85,Single-ply,SBD,M,
Boys,109.77,3,Wyatt Isbell,Valley View,101.79,204.12,104.33,213.19,521.63,Single-ply,SBD,M,
Boys,109.77,4,Dario Cervantes,Valley View,100.43,199.58,102.06,204.12,505.76,Single-ply,SBD,M,
Boys,109.77,5,Mahlon Walker,Howe,103.24,161.03,106.59,156.49,424.11,Single-ply,SBD,M,
Boys,109.77,6,Jacob Leija,Flower Mound Coram Deo Academy,109.23,106.59,102.06,183.7,392.36,Single-ply,SBD,M,
Boys,109.77,DQ,Quinton Cox,Pilot Point,102.24,206.38,115.67,183.7,,Single-ply,SBD,M,
Boys,124.74,1,Seth Pintor,Melissa,117.12,226.8,158.76,181.44,566.99,Single-ply,SBD,M,
Boys,124.74,2,Jake Brown,Melissa,117.3,197.31,133.81,181.44,512.56,Single-ply,SBD,M,
Boys,139.71,1,Owen Hollenbeck,Melissa,132.09,219.99,149.69,199.58,569.26,Single-ply,SBD,M,
Boys,139.71,2,Carson Sarrett,Melissa,138.8,215.46,151.95,174.63,542.04,Single-ply,SBD,M,
Boys,139.71,3,Angel Raygoza,Tom Bean,131.27,183.7,120.2,158.76,462.66,Single-ply,SBD,M,
Boys,139.71+,1,Brandon Ward,Melissa,141.79,340.19,151.95,226.8,718.94,Single-ply,SBD,M,
Boys,139.71+,2,William Fleming,Howe,140.34,249.48,124.74,199.58,573.79,Single-ply,SBD,M,
Boys,139.71+,3,Manny Segundo,Pilot Point,159.12,199.58,108.86,197.31,505.76,Single-ply,SBD,M,
Boys,139.71+,4,Carson Culp,Pottsboro,151.14,195.04,113.4,170.1,478.54,Single-ply,SBD,M,
Boys,139.71+,5,Ronan Colburn,Pilot Point,141.79,108.86,90.72,113.4,312.98,Single-ply,SBD,M,
