<?xml version="1.0" encoding="utf-8"?>
<!-- Generator: Adobe Illustrator 16.0.0, SVG Export Plug-In . SVG Version: 6.00 Build 0)  -->
<!DOCTYPE svg PUBLIC "-//W3C//DTD SVG 1.1//EN" "http://www.w3.org/Graphics/SVG/1.1/DTD/svg11.dtd">
<svg version="1.1" xmlns="http://www.w3.org/2000/svg" xmlns:xlink="http://www.w3.org/1999/xlink" x="0px" y="0px" width="24px"
	 height="24px" viewBox="0 0 24 24" enable-background="new 0 0 24 24" xml:space="preserve">
<g id="Layout">
</g>
<g id="icons">
	<g>
		<polygon fill="#008FD3" points="21.071,24 18.118,24 10.805,18.844 17.696,13.689 11.086,8.766 14.555,3.563 11.04,0 13.478,0 
			16.759,3.328 13.43,8.391 20.509,13.689 13.711,18.799 		"/>
		<polygon fill="#666666" points="5.367,18.844 10.524,24 8.087,24 2.929,18.844 8.18,13.594 4.852,8.578 8.32,3.375 6.633,0 
			8.556,0 10.289,3.516 6.915,8.578 10.384,13.828 		"/>
	</g>
</g>
</svg>
