<?xml version="1.0" encoding="utf-8"?>
<!-- Generator: Adobe Illustrator 16.0.3, SVG Export Plug-In . SVG Version: 6.00 Build 0)  -->
<!DOCTYPE svg PUBLIC "-//W3C//DTD SVG 1.1//EN" "http://www.w3.org/Graphics/SVG/1.1/DTD/svg11.dtd">
<svg version="1.1" id="Layer_1" xmlns="http://www.w3.org/2000/svg" xmlns:xlink="http://www.w3.org/1999/xlink" x="0px" y="0px"
	 width="48px" height="48px" viewBox="0 0 48 48" enable-background="new 0 0 48 48" xml:space="preserve">
<rect y="38.971" fill="#666666" width="11.977" height="8.982"/>
<rect x="18.059" y="29.989" fill="#666666" width="11.883" height="17.964"/>
<rect x="35.93" y="35.977" fill="#666666" width="12.07" height="11.977"/>
<rect y="29.989" fill="#008FD3" width="11.977" height="5.987"/>
<rect x="35.93" y="21.006" fill="#008FD3" width="11.977" height="8.983"/>
<rect y="18.012" fill="#4FB81C" width="11.977" height="8.982"/>
<rect x="17.964" y="12.023" fill="#008FD3" width="11.978" height="14.971"/>
<rect x="35.93" y="3.042" fill="#4FB81C" width="11.977" height="14.97"/>
<rect x="17.964" y="0.047" fill="#4FB81C" width="11.978" height="8.982"/>
</svg>
