<?xml version="1.0" encoding="utf-8"?>
<!-- Generator: Adobe Illustrator 16.0.3, SVG Export Plug-In . SVG Version: 6.00 Build 0)  -->
<!DOCTYPE svg PUBLIC "-//W3C//DTD SVG 1.1//EN" "http://www.w3.org/Graphics/SVG/1.1/DTD/svg11.dtd">
<svg version="1.1" id="Layer_1" xmlns="http://www.w3.org/2000/svg" xmlns:xlink="http://www.w3.org/1999/xlink" x="0px" y="0px"
	 width="48px" height="48px" viewBox="0 0 48 48" enable-background="new 0 0 48 48" xml:space="preserve">
<g id="_x3C_Group_x3E__colored_48_19_">
	<rect y="40" fill="#4FB81C" width="12" height="8"/>
	<rect x="12" y="20" fill="#666666" width="12" height="20"/>
	<rect x="24" y="12" fill="#008FD3" width="12" height="8"/>
	<rect x="36" fill="#4FB81C" width="12" height="12"/>
</g>
</svg>
