<?xml version="1.0" encoding="utf-8"?>
<!-- Generator: Adobe Illustrator 16.0.0, SVG Export Plug-In . SVG Version: 6.00 Build 0)  -->
<!DOCTYPE svg PUBLIC "-//W3C//DTD SVG 1.1//EN" "http://www.w3.org/Graphics/SVG/1.1/DTD/svg11.dtd">
<svg version="1.1" xmlns="http://www.w3.org/2000/svg" xmlns:xlink="http://www.w3.org/1999/xlink" x="0px" y="0px" width="24px"
	 height="24px" viewBox="0 0 24 24" enable-background="new 0 0 24 24" xml:space="preserve">
<g id="Layout">
</g>
<g id="icons">
	<g id="_x3C_Group_x3E__colored_48_1_">
		<rect fill="#4FB81C" width="4" height="6"/>
		<rect x="4" y="6" fill="#666666" width="10" height="6"/>
		<rect x="14" y="12" fill="#008FD3" width="4" height="6"/>
		<rect x="18" y="18" fill="#4FB81C" width="6" height="6"/>
	</g>
</g>
</svg>
