digraph digitalInput
{
    graph [rankdir = "LR"]

    node [shape=rectangle,style=filled] 
    
    digitalInput
    
    node [shape=oval,fillcolor=yellow]
    digitalInput -> SELEZIONACOLORERGB
    digitalInput -> SPETTROCOLORERGB
    digitalInput -> CONTAPEZZIIR
    digitalInput -> AVVISOAPERTURAPORTA
    digitalInput -> RILEVATOREURTIAUTO
    digitalInput -> TESTOINMORSE
    digitalInput -> ENCODERROTATIVOSEMPLICE
    digitalInput -> MATRICELEDBASE
    digitalInput -> ESERCIZIO18
    digitalInput -> ESERCIZIO20
    digitalInput -> ESERCIZIO24
    digitalInput -> ESERCIZIO25
    digitalInput -> ESERCIZIO26
    digitalInput -> ESERCIZIO27
    digitalInput -> ESERCIZIO29
    digitalInput -> ESERCIZIO37
    digitalInput -> ESERCIZIO38
    digitalInput -> ESERCIZIO39
    digitalInput -> ESERCIZIO42
    digitalInput -> ESERCIZIO44
    digitalInput -> ESERCIZIO46
    digitalInput -> PIDCONVENTOLA
    digitalInput -> GESTIONEIMPOSTAZIONIAVVIO
    digitalInput -> BITBANGING
}
