digraph pullUpDown
{
    graph [rankdir = "LR"]

    node [shape=rectangle,style=filled] 
    
    pullUpDown
    
    node [shape=oval,fillcolor=yellow]
    pullUpDown -> MATRICELEDBASE
    pullUpDown -> ESERCIZIO18
    pullUpDown -> PIDCONVENTOLA
}
