digraph DIMMERLEDRGB
{
    graph [rankdir = "BT"]

    node [shape=rectangle,style=filled,fillcolor=green] 
    nodeTop [label="\etichettanodoesercizio{DIMMERLEDRGB}"]
    
    node [shape=oval,fillcolor=yellow]
    nodeA [label="\etichettanodoprerequisito{ohmLaw}"]
    nodeB [label="\etichettanodoprerequisito{analogInput}"]
    nodeC [label="\etichettanodoprerequisito{digitalOutput}"]

    nodeTop -> nodeA
    nodeTop -> nodeB
    nodeTop -> nodeC

}
