digraph ESERCIZIO44
{
    graph [rankdir = "BT"]

    node [shape=rectangle,style=filled,fillcolor=green] 
    nodeTop [label="\etichettanodoesercizio{ESERCIZIO44}"]
    
    node [shape=oval,fillcolor=yellow]
    nodeA [label="\etichettanodoprerequisito{digitalInput}"]
    nodeB [label="\etichettanodoprerequisito{digitalOutput}"]
    nodeC [label="\etichettanodoprerequisito{debouncing}"]
    nodeD [label="\etichettanodoprerequisito{interrupt}"]
    nodeE [label="\etichettanodoprerequisito{softwareserial}"]
    nodeF [label="\etichettanodoprerequisito{spi}"]

    nodeTop -> nodeA
    nodeTop -> nodeB
    nodeTop -> nodeC
    nodeTop -> nodeD
    nodeTop -> nodeE
    nodeTop -> nodeF

}
