digraph ESERCIZIO14
{
    graph [rankdir = "BT"]

    node [shape=rectangle,style=filled,fillcolor=green] 
    nodeTop [label="\etichettanodoesercizio{ESERCIZIO14}"]
    
    node [shape=oval,fillcolor=yellow]
    nodeA [label="\etichettanodoprerequisito{digitalInput}"]
    nodeB [label="\etichettanodoprerequisito{digitalOutput}"]
    nodeC [label="\etichettanodoprerequisito{debouncing}"]
    nodeD [label="\etichettanodoprerequisito{multipsu}"]
    nodeE [label="\etichettanodoprerequisito{psudimensioning}"]

    nodeTop -> nodeA
    nodeTop -> nodeB
    nodeTop -> nodeC
    nodeTop -> nodeD
    nodeTop -> nodeE

}
