digraph ESERCIZIO32
{
    graph [rankdir = "BT"]

    node [shape=rectangle,style=filled,fillcolor=green] 
    nodeTop [label="\etichettanodoesercizio{ESERCIZIO32}"]
    
    node [shape=oval,fillcolor=yellow]
    nodeA [label="\etichettanodoprerequisito{diode}"]
    nodeB [label="\etichettanodoprerequisito{digitalOutput}"]

    nodeTop -> nodeA
    nodeTop -> nodeB

}
