digraph CLOSEDLOOP
{
    graph [rankdir = "BT"]

    node [shape=rectangle,style=filled,fillcolor=green] 
    nodeTop [label="\etichettanodoesercizio{CLOSEDLOOP}"]
    
    node [shape=oval,fillcolor=yellow]
    nodeA [label="\etichettanodoprerequisito{ohmlaw}"]
    nodeB [label="\etichettanodoprerequisito{analogInput}"]
    nodeC [label="\etichettanodoprerequisito{pwm}"]
    nodeD [label="\etichettanodoprerequisito{transistorswitch}"]
    nodeE [label="\etichettanodoprerequisito{multipsu}"]

    nodeTop -> nodeA
    nodeTop -> nodeB
    nodeTop -> nodeC
    nodeTop -> nodeD
    nodeTop -> nodeE

}
