digraph analogInput
{
    graph [rankdir = "LR"]

    node [shape=rectangle,style=filled] 
    
    analogInput
    
    node [shape=oval,fillcolor=yellow]
    analogInput -> DIMMERLEDRGB
    analogInput -> SPETTROCOLORERGB
    analogInput -> INTERRUTTORECREPUSCOLARE
    analogInput -> SENSORERUMORE
    analogInput -> VUMETER
    analogInput -> MATRICELEDBASE
    analogInput -> ESERCIZIO19
    analogInput -> ESERCIZIO22
    analogInput -> ESERCIZIO23
    analogInput -> ESERCIZIO30
    analogInput -> ESERCIZIO31
    analogInput -> DIMMERCONMOSFET
    analogInput -> ESERCIZIO36
    analogInput -> ESERCIZIO40
    analogInput -> TIMERACONDENSATORE
    analogInput -> ESERCIZIO42
    analogInput -> MILLIAMPEROMETRO
    analogInput -> MULTIOHMMETRO
    analogInput -> ESERCIZIO46
    analogInput -> CLOSEDLOOP
}
