digraph interrupt
{
    graph [rankdir = "LR"]

    node [shape=rectangle,style=filled] 
    
    interrupt
    
    node [shape=oval,fillcolor=yellow]
    interrupt -> CONTAPEZZIIR
    interrupt -> MATRICELEDBASE
    interrupt -> ESERCIZIO18
    interrupt -> ESERCIZIO38
    interrupt -> ESERCIZIO44
    interrupt -> ESERCIZIO46
    interrupt -> PIDCONVENTOLA
    interrupt -> BITBANGING
}
