digraph ESERCIZIO29
{
    graph [rankdir = "BT"]

    node [shape=rectangle,style=filled,fillcolor=green] 
    nodeTop [label="\etichettanodoesercizio{ESERCIZIO29}"]
    
    node [shape=oval,fillcolor=yellow]
    nodeA [label="\etichettanodoprerequisito{digitalInput}"]
    nodeB [label="\etichettanodoprerequisito{digitalOutput}"]
    nodeC [label="\etichettanodoprerequisito{i2c}"]
    nodeD [label="\etichettanodoprerequisito{debouncing}"]

    nodeTop -> nodeA
    nodeTop -> nodeB
    nodeTop -> nodeC
    nodeTop -> nodeD

}
