digraph ESERCIZIO26
{
    graph [rankdir = "BT"]

    node [shape=rectangle,style=filled,fillcolor=green] 
    nodeTop [label="\etichettanodoesercizio{ESERCIZIO26}"]
    
    node [shape=oval,fillcolor=yellow]
    nodeA [label="\etichettanodoprerequisito{digitalInput}"]
    nodeB [label="\etichettanodoprerequisito{digitalOutput}"]
    nodeC [label="\etichettanodoprerequisito{debouncing}"]

    nodeTop -> nodeA
    nodeTop -> nodeB
    nodeTop -> nodeC

}
