digraph ESERCIZIO30
{
    graph [rankdir = "BT"]

    node [shape=rectangle,style=filled,fillcolor=green] 
    nodeTop [label="\etichettanodoesercizio{ESERCIZIO30}"]
    
    node [shape=oval,fillcolor=yellow]
    nodeA [label="\etichettanodoprerequisito{ohmlaw}"]
    nodeB [label="\etichettanodoprerequisito{analogInput}"]

    nodeTop -> nodeA
    nodeTop -> nodeB

}
