digraph CONTAPEZZIIR
{
    graph [rankdir = "BT"]

    node [shape=rectangle,style=filled,fillcolor=green] 
    nodeTop [label="\etichettanodoesercizio{CONTAPEZZIIR}"]
    
    node [shape=oval,fillcolor=yellow]
    nodeA [label="\etichettanodoprerequisito{diode}"]
    nodeB [label="\etichettanodoprerequisito{digitalInput}"]
    nodeC [label="\etichettanodoprerequisito{digitalOutput}"]
    nodeD [label="\etichettanodoprerequisito{interrupt}"]

    nodeTop -> nodeA
    nodeTop -> nodeB
    nodeTop -> nodeC
    nodeTop -> nodeD

}
