digraph ESERCIZIO40
{
    graph [rankdir = "BT"]

    node [shape=rectangle,style=filled,fillcolor=green] 
    nodeTop [label="\etichettanodoesercizio{ESERCIZIO40}"]
    
    node [shape=oval,fillcolor=yellow]
    nodeA [label="\etichettanodoprerequisito{Prerequisiti: ohmlaw}"]
    nodeB [label="\etichettanodoprerequisito{analogInput}"]
    nodeC [label="\etichettanodoprerequisito{digitalOutput}"]

    nodeTop -> nodeA
    nodeTop -> nodeB
    nodeTop -> nodeC

}
