digraph ESERCIZIO49
{
    graph [rankdir = "BT"]

    node [shape=rectangle,style=filled,fillcolor=green] 
    nodeTop [label="\etichettanodoesercizio{ESERCIZIO49}"]
    
    node [shape=oval,fillcolor=yellow]
    nodeA [label="\etichettanodoprerequisito{digitalInput}"]
    nodeB [label="\etichettanodoprerequisito{eeprom}"]

    nodeTop -> nodeA
    nodeTop -> nodeB

}
