{
  "name": "kineses-source-connector",
  "config": {
    "connector.class": "org.apache.camel.kafkaconnector.awskinesissource.CamelAwskinesissourceSourceConnector",
    "tasks.max": 1,
    "key.converter": "org.apache.kafka.connect.storage.StringConverter",
    "value.converter": "org.apache.kafka.connect.storage.StringConverter",
    "errors.retry.timeout": -1,
    "errors.retry.delay.max.ms": 300000,
    "errors.tolerance": "none",
    "errors.log.enable": true,
    "errors.log.include.messages": true,
    "topics": "kineses-stream",

    "camel.kamelet.aws-kinesis-source.region": "eu-west-1",
    "camel.kamelet.aws-kinesis-source.delay": 10000,
    "camel.kamelet.aws-kinesis-source.useDefaultCredentialsProvider": true,
    "camel.kamelet.aws-kinesis-source.stream": "ew1-integration-datawarehouse-replay",

    "transforms": "KinesisRecordDataTransforms",
    "transforms.KinesisRecordDataTransforms.type": "KinesisRecordDataTransforms"
  }
}
