# Blender v2.80 (sub 75) OBJ File: 'arrow.blend'
# www.blender.org
mtllib arrow2.mtl
o wood/metal_Plane
v -0.064355 -0.004625 -0.923370
v -0.014355 0.045375 -0.923370
v 0.035645 -0.004625 -0.923370
v -0.014355 -0.054625 -0.923370
v -0.064355 -0.004625 1.030219
v -0.058601 0.001129 1.030219
v -0.020647 0.039083 1.030219
v -0.014355 0.045375 1.030219
v -0.009140 0.040160 1.030219
v 0.030628 0.000392 1.030219
v 0.035645 -0.004625 1.030219
v -0.014355 -0.054625 1.030219
v -0.019372 -0.049608 1.030219
v -0.059140 -0.009840 1.030219
v 0.029353 -0.010917 1.030219
v -0.008601 -0.048871 1.030219
v 0.046419 -0.004625 -0.916319
v -0.014355 -0.130099 -0.866191
v -0.014355 -0.004625 -1.228565
v -0.014355 0.120849 -0.866191
v -0.075129 -0.004625 -0.916319
v -0.058601 0.001129 1.260219
v -0.020647 0.039083 1.260219
v 0.029353 -0.010917 1.260219
v -0.008601 -0.048871 1.260219
v -0.019372 -0.049608 1.260219
v -0.059140 -0.009840 1.260219
v -0.009140 0.040160 1.260219
v 0.030628 0.000392 1.260219
v -0.064355 -0.004625 1.310219
v -0.064355 -0.004625 1.260219
v -0.014355 -0.054625 1.260219
v -0.014355 -0.054625 1.310219
v -0.014355 0.045375 1.310219
v -0.014355 0.045375 1.260219
v 0.035645 -0.004625 1.310219
v 0.035645 -0.004625 1.260219
vt 0.527848 0.425786
vt 0.527848 0.394932
vt 0.595440 0.394932
vt 0.595440 0.425786
vt 0.278263 0.135156
vt 0.286024 0.135166
vt 0.337215 0.135233
vt 0.345702 0.135244
vt 0.345702 0.986910
vt 0.278263 0.986822
vt 0.153470 0.135244
vt 0.160504 0.135235
vt 0.214142 0.135165
vt 0.220909 0.135156
vt 0.220909 0.986822
vt 0.153470 0.986910
vt 0.028677 0.135244
vt 0.035444 0.135235
vt 0.089082 0.135165
vt 0.096116 0.135156
vt 0.096116 0.986822
vt 0.028677 0.986910
vt 0.403056 0.135156
vt 0.411543 0.135167
vt 0.462734 0.135234
vt 0.470495 0.135244
vt 0.470495 0.986910
vt 0.403056 0.986822
vt 0.697303 0.240510
vt 0.809403 0.204011
vt 0.809403 0.368752
vt 0.809403 0.013090
vt 0.809403 0.177831
vt 0.697303 0.141332
vt 0.527848 0.049589
vt 0.639949 0.013090
vt 0.639949 0.177831
vt 0.639949 0.204011
vt 0.639949 0.368752
vt 0.527848 0.332253
vt 0.866757 0.073923
vt 0.876025 0.071874
vt 0.939874 0.081999
vt 0.971323 0.111638
vt 0.866757 0.013090
vt 0.898206 0.042729
vt 0.962055 0.052854
vt 0.971323 0.050805
vt 0.286024 0.034898
vt 0.337215 0.034964
vt 0.411543 0.034899
vt 0.462734 0.034965
vt 0.035444 0.034966
vt 0.089082 0.034897
vt 0.160504 0.034966
vt 0.214141 0.034896
vt 0.096116 0.013090
vt 0.096116 0.034888
vt 0.028677 0.034975
vt 0.028677 0.013178
vt 0.278263 0.034888
vt 0.278263 0.013090
vt 0.345702 0.013178
vt 0.345702 0.034975
vt 0.153470 0.034975
vt 0.153470 0.013178
vt 0.220909 0.013090
vt 0.220909 0.034888
vt 0.470495 0.013178
vt 0.470495 0.034975
vt 0.403056 0.034888
vt 0.403056 0.013090
vt 0.697303 0.394932
vt 0.764895 0.394932
vt 0.764895 0.425786
vt 0.697303 0.425786
vn 0.0000 0.0000 -1.0000
vn -0.7071 0.7071 0.0000
vn 0.7071 0.7071 0.0000
vn -0.7071 -0.7071 -0.0000
vn 0.7071 -0.7071 -0.0000
vn 0.8594 -0.4831 -0.1673
vn 0.8594 0.4831 -0.1673
vn -0.8594 0.4831 -0.1673
vn -0.8594 -0.4831 -0.1673
vn -0.5051 0.5164 0.6915
vn -0.5051 -0.5164 0.6915
vn 0.5051 0.5164 0.6915
vn 0.5051 -0.5164 0.6915
vn 0.0000 0.0000 1.0000
usemtl Material.002
s 1
f 1/1/1 2/2/1 3/3/1 4/4/1
f 5/5/2 6/6/2 7/7/2 8/8/2 2/9/2 1/10/2
f 8/11/3 9/12/3 10/13/3 11/14/3 3/15/3 2/16/3
f 12/17/4 13/18/4 14/19/4 5/20/4 1/21/4 4/22/4
f 11/23/5 15/24/5 16/25/5 12/26/5 4/27/5 3/28/5
f 17/29/6 18/30/6 19/31/6
f 19/32/7 20/33/7 17/34/7
f 21/35/8 20/36/8 19/37/8
f 19/38/9 18/39/9 21/40/9
f 17/41/10 3/42/10 4/43/10 18/44/10
f 20/45/11 2/46/11 3/42/11 17/41/11
f 18/44/12 4/43/12 1/47/12 21/48/12
f 21/48/13 1/47/13 2/46/13 20/45/13
f 22/49/2 23/50/2 7/7/2 6/6/2
f 24/51/5 25/52/5 16/25/5 15/24/5
f 26/53/4 27/54/4 14/19/4 13/18/4
f 28/55/3 29/56/3 10/13/3 9/12/3
f 30/57/4 31/58/4 27/54/4 26/53/4 32/59/4 33/60/4
f 31/61/2 30/62/2 34/63/2 35/64/2 23/50/2 22/49/2
f 35/65/3 34/66/3 36/67/3 37/68/3 29/56/3 28/55/3
f 33/69/5 32/70/5 25/52/5 24/51/5 37/71/5 36/72/5
f 33/73/14 36/74/14 34/75/14 30/76/14
o feathers_Plane.001
v -0.017506 0.050092 1.041531
v -0.017506 0.131875 1.146762
v -0.012291 0.044877 1.041531
v -0.023798 0.043800 1.041531
v -0.017506 0.131875 1.376762
v -0.017506 0.050092 1.271531
v -0.012291 0.044877 1.271531
v -0.023798 0.043800 1.271531
v -0.017506 -0.131691 1.146762
v -0.022523 -0.044891 1.041531
v -0.017506 -0.049908 1.041531
v -0.017506 -0.049908 1.271531
v -0.022523 -0.044891 1.271531
v -0.017506 -0.131691 1.376762
v -0.011752 -0.044154 1.041531
v -0.011752 -0.044154 1.271531
v -0.149289 0.000092 1.146762
v -0.067506 0.000092 1.041531
v -0.062291 -0.005123 1.041531
v -0.061752 0.005846 1.041531
v -0.062291 -0.005123 1.271531
v -0.149289 0.000092 1.376762
v -0.067506 0.000092 1.271531
v -0.061752 0.005846 1.271531
v 0.032494 0.000092 1.041531
v 0.114277 0.000092 1.146762
v 0.026202 -0.006200 1.041531
v 0.027477 0.005109 1.041531
v 0.114277 0.000092 1.376762
v 0.032494 0.000092 1.271531
v 0.026202 -0.006200 1.271531
v 0.027477 0.005109 1.271531
vt 0.868228 0.462048
vt 0.767241 0.328922
vt 0.874649 0.462048
vt 0.145852 0.328922
vt 0.044867 0.462048
vt 0.037045 0.462048
vt 0.954563 0.037952
vt 0.955141 0.171079
vt 0.948738 0.171079
vt 0.962955 0.171079
vt 0.767241 0.037952
vt 0.874649 0.171079
vt 0.037045 0.171079
vt 0.145852 0.037952
vt 0.962021 0.380345
vt 0.948738 0.247793
vt 0.954888 0.247418
vt 0.117359 0.791075
vt 0.122125 0.787048
vt 0.122125 0.959607
vt 0.962021 0.246984
vt 0.037045 0.711148
vt 0.037045 0.537953
vt 0.042543 0.542641
vt 0.693152 0.037952
vt 0.693152 0.328921
vt 0.585040 0.462047
vt 0.585040 0.171078
vt 0.221603 0.828921
vt 0.221603 0.537952
vt 0.328742 0.671078
vt 0.328742 0.962048
vt 0.510219 0.828921
vt 0.409233 0.962047
vt 0.402831 0.962047
vt 0.874649 0.538394
vt 0.867509 0.671321
vt 0.867509 0.537953
vt 0.402831 0.671078
vt 0.510219 0.537952
vt 0.793420 0.537953
vt 0.793420 0.671079
vt 0.786999 0.537968
vt 0.116632 0.542636
vt 0.122125 0.537953
vt 0.122125 0.711143
vt 0.402831 0.037952
vt 0.510950 0.171078
vt 0.510950 0.462047
vt 0.402831 0.328921
vt 0.227756 0.037952
vt 0.328742 0.171078
vt 0.219942 0.037953
vt 0.793177 0.880110
vt 0.786999 0.880096
vt 0.793177 0.746984
vt 0.956544 0.589661
vt 0.948738 0.456773
vt 0.956544 0.456250
vt 0.037045 0.955585
vt 0.041797 0.787053
vt 0.041797 0.959600
vt 0.328741 0.462047
vt 0.219941 0.328922
vt 0.585040 0.671078
vt 0.692197 0.537952
vt 0.692197 0.828921
vt 0.585040 0.962047
vn 0.6197 0.6197 -0.4816
vn -0.6197 0.6197 -0.4816
vn -0.6197 -0.6197 0.4816
vn 0.6197 -0.6197 0.4816
vn 0.9982 0.0598 0.0000
vn -0.9975 0.0713 0.0000
vn -0.6197 -0.6197 -0.4816
vn 0.6197 0.6197 0.4816
vn 0.6197 -0.6197 -0.4816
vn -0.6197 0.6197 0.4816
vn 0.9978 -0.0656 -0.0000
vn -0.9983 -0.0577 -0.0000
vn -0.0598 -0.9982 -0.0000
vn -0.0656 0.9978 0.0000
vn 0.0713 -0.9975 -0.0000
vn 0.0577 0.9983 0.0000
usemtl Material.003
s 1
f 38/77/15 39/78/15 40/79/15
f 39/80/16 38/81/16 41/82/16
f 42/83/17 43/84/17 44/85/17
f 43/84/18 42/83/18 45/86/18
f 42/87/19 44/88/19 40/79/19 39/78/19
f 45/89/20 42/90/20 39/80/20 41/82/20
f 46/91/21 47/92/21 48/93/21
f 49/94/22 50/95/22 51/96/22
f 48/93/23 52/97/23 46/91/23
f 51/98/24 53/99/24 49/100/24
f 51/101/25 46/102/25 52/103/25 53/104/25
f 50/105/26 47/106/26 46/107/26 51/108/26
f 54/109/21 55/110/21 56/111/21
f 55/112/16 54/113/16 57/114/16
f 58/115/27 59/116/27 54/109/27 56/111/27
f 60/117/22 59/118/22 58/119/22
f 60/120/18 61/121/18 59/122/18
f 59/123/28 61/124/28 57/125/28 54/126/28
f 62/127/23 63/128/23 64/129/23
f 62/130/15 65/131/15 63/132/15
f 66/133/24 67/134/24 68/135/24
f 67/136/17 66/137/17 69/138/17
f 66/139/29 68/140/29 64/129/29 63/128/29
f 69/141/30 66/142/30 63/143/30 65/144/30
