# Blender MTL File: 'ground3.blend'
# Material Count: 142

newmtl Default_Tree2_0_0_0_3.000
Ns 0.000000
Ka 1.000000 1.000000 1.000000
Kd 0.694118 0.694118 0.694118
Ks 0.000000 0.000000 0.000000
Ke 0.0 0.0 0.0
Ni 1.450000
d 1.000000
illum 1
map_Kd b1peter.jpg

newmtl Default_Tree2_0_0_0_3.001
Ns 0.000000
Ka 1.000000 1.000000 1.000000
Kd 0.694118 0.694118 0.694118
Ks 0.000000 0.000000 0.000000
Ke 0.0 0.0 0.0
Ni 1.450000
d 1.000000
illum 1
map_Kd b1peter.jpg

newmtl Default_Tree2_0_0_0_3.002
Ns 0.000000
Ka 1.000000 1.000000 1.000000
Kd 0.694118 0.694118 0.694118
Ks 0.000000 0.000000 0.000000
Ke 0.0 0.0 0.0
Ni 1.450000
d 1.000000
illum 1
map_Kd b1peter.jpg

newmtl Default_Tree2_0_0_0_3.004
Ns 0.000000
Ka 1.000000 1.000000 1.000000
Kd 0.694118 0.694118 0.694118
Ks 0.000000 0.000000 0.000000
Ke 0.0 0.0 0.0
Ni 1.450000
d 1.000000
illum 1
map_Kd b1peter.jpg

newmtl Default_Tree2_0_0_0_3.005
Ns 0.000000
Ka 1.000000 1.000000 1.000000
Kd 0.694118 0.694118 0.694118
Ks 0.000000 0.000000 0.000000
Ke 0.0 0.0 0.0
Ni 1.450000
d 1.000000
illum 1
map_Kd b1peter.jpg

newmtl Default_Tree2_0_0_0_3.006
Ns 0.000000
Ka 1.000000 1.000000 1.000000
Kd 0.694118 0.694118 0.694118
Ks 0.000000 0.000000 0.000000
Ke 0.0 0.0 0.0
Ni 1.450000
d 1.000000
illum 1
map_Kd b1peter.jpg

newmtl Default_Tree2_0_0_0_3.007
Ns 0.000000
Ka 1.000000 1.000000 1.000000
Kd 0.694118 0.694118 0.694118
Ks 0.000000 0.000000 0.000000
Ke 0.0 0.0 0.0
Ni 1.450000
d 1.000000
illum 1
map_Kd b1peter.jpg

newmtl Default_Tree2_0_0_0_3.008
Ns 0.000000
Ka 1.000000 1.000000 1.000000
Kd 0.694118 0.694118 0.694118
Ks 0.000000 0.000000 0.000000
Ke 0.0 0.0 0.0
Ni 1.450000
d 1.000000
illum 1
map_Kd b1peter.jpg

newmtl Default_Tree2_0_0_0_3.009
Ns 0.000000
Ka 1.000000 1.000000 1.000000
Kd 0.694118 0.694118 0.694118
Ks 0.000000 0.000000 0.000000
Ke 0.0 0.0 0.0
Ni 1.450000
d 1.000000
illum 1
map_Kd b1peter.jpg

newmtl Default_Tree2_0_0_0_3.010
Ns 0.000000
Ka 1.000000 1.000000 1.000000
Kd 0.694118 0.694118 0.694118
Ks 0.000000 0.000000 0.000000
Ke 0.0 0.0 0.0
Ni 1.450000
d 1.000000
illum 1
map_Kd b1peter.jpg

newmtl Default_Tree2_0_0_0_3.011
Ns 0.000000
Ka 1.000000 1.000000 1.000000
Kd 0.694118 0.694118 0.694118
Ks 0.000000 0.000000 0.000000
Ke 0.0 0.0 0.0
Ni 1.450000
d 1.000000
illum 1
map_Kd b1peter.jpg

newmtl Default_Tree2_0_0_0_3.012
Ns 0.000000
Ka 1.000000 1.000000 1.000000
Kd 0.694118 0.694118 0.694118
Ks 0.000000 0.000000 0.000000
Ke 0.0 0.0 0.0
Ni 1.450000
d 1.000000
illum 1
map_Kd b1peter.jpg

newmtl Default_Tree2_0_0_0_3.013
Ns 0.000000
Ka 1.000000 1.000000 1.000000
Kd 0.694118 0.694118 0.694118
Ks 0.000000 0.000000 0.000000
Ke 0.0 0.0 0.0
Ni 1.450000
d 1.000000
illum 1
map_Kd b1peter.jpg

newmtl Default_Tree2_0_0_0_3.014
Ns 0.000000
Ka 1.000000 1.000000 1.000000
Kd 0.694118 0.694118 0.694118
Ks 0.000000 0.000000 0.000000
Ke 0.0 0.0 0.0
Ni 1.450000
d 1.000000
illum 1
map_Kd b1peter.jpg

newmtl Default_Tree2_0_0_0_3.015
Ns 0.000000
Ka 1.000000 1.000000 1.000000
Kd 0.694118 0.694118 0.694118
Ks 0.000000 0.000000 0.000000
Ke 0.0 0.0 0.0
Ni 1.450000
d 1.000000
illum 1
map_Kd b1peter.jpg

newmtl Default_Tree2_0_0_0_3.016
Ns 0.000000
Ka 1.000000 1.000000 1.000000
Kd 0.694118 0.694118 0.694118
Ks 0.000000 0.000000 0.000000
Ke 0.0 0.0 0.0
Ni 1.450000
d 1.000000
illum 1
map_Kd b1peter.jpg

newmtl Default_Tree2_0_0_0_3.017
Ns 0.000000
Ka 1.000000 1.000000 1.000000
Kd 0.694118 0.694118 0.694118
Ks 0.000000 0.000000 0.000000
Ke 0.0 0.0 0.0
Ni 1.450000
d 1.000000
illum 1
map_Kd b1peter.jpg

newmtl Default_Tree2_0_0_0_3.018
Ns 0.000000
Ka 1.000000 1.000000 1.000000
Kd 0.694118 0.694118 0.694118
Ks 0.000000 0.000000 0.000000
Ke 0.0 0.0 0.0
Ni 1.450000
d 1.000000
illum 1
map_Kd b1peter.jpg

newmtl Default_Tree2_0_0_0_3.019
Ns 0.000000
Ka 1.000000 1.000000 1.000000
Kd 0.694118 0.694118 0.694118
Ks 0.000000 0.000000 0.000000
Ke 0.0 0.0 0.0
Ni 1.450000
d 1.000000
illum 1
map_Kd b1peter.jpg

newmtl Default_Tree2_0_0_0_3.020
Ns 0.000000
Ka 1.000000 1.000000 1.000000
Kd 0.694118 0.694118 0.694118
Ks 0.000000 0.000000 0.000000
Ke 0.0 0.0 0.0
Ni 1.450000
d 1.000000
illum 1
map_Kd b1peter.jpg

newmtl Default_Tree2_0_0_0_3.021
Ns 0.000000
Ka 1.000000 1.000000 1.000000
Kd 0.694118 0.694118 0.694118
Ks 0.000000 0.000000 0.000000
Ke 0.0 0.0 0.0
Ni 1.450000
d 1.000000
illum 1
map_Kd b1peter.jpg

newmtl MAT_2.001
Ns 96.078443
Ka 1.000000 1.000000 1.000000
Kd 0.640000 0.640000 0.640000
Ks 0.500000 0.500000 0.500000
Ke 0.0 0.0 0.0
Ni 1.000000
d 1.000000
illum 2
map_Kd GrassBlades002_COL_1K.png

newmtl Material.001
Ns 225.000000
Ka 1.000000 1.000000 1.000000
Kd 0.800000 0.800000 0.800000
Ks 0.500000 0.500000 0.500000
Ke 0.0 0.0 0.0
Ni 1.450000
d 1.000000
illum 2
map_Kd Ground23_col.jpg

newmtl Material.002
Ns 96.078443
Ka 1.000000 1.000000 1.000000
Kd 0.640000 0.640000 0.640000
Ks 0.500000 0.500000 0.500000
Ke 0.0 0.0 0.0
Ni 1.000000
d 1.000000
illum 2
map_Kd b1peter.jpg

newmtl Material.003
Ns 96.078443
Ka 1.000000 1.000000 1.000000
Kd 0.640000 0.640000 0.640000
Ks 0.500000 0.500000 0.500000
Ke 0.0 0.0 0.0
Ni 1.000000
d 1.000000
illum 2
map_Kd Branches0018_1_S.png

newmtl Material.008
Ns 96.078443
Ka 1.000000 1.000000 1.000000
Kd 0.640000 0.640000 0.640000
Ks 0.500000 0.500000 0.500000
Ke 0.0 0.0 0.0
Ni 1.000000
d 1.000000
illum 2
map_Kd b1peter.jpg

newmtl Material.009
Ns 96.078443
Ka 1.000000 1.000000 1.000000
Kd 0.640000 0.640000 0.640000
Ks 0.500000 0.500000 0.500000
Ke 0.0 0.0 0.0
Ni 1.000000
d 1.000000
illum 2
map_Kd Branches0018_1_S.png

newmtl Material.010
Ns 96.078443
Ka 1.000000 1.000000 1.000000
Kd 0.640000 0.640000 0.640000
Ks 0.500000 0.500000 0.500000
Ke 0.0 0.0 0.0
Ni 1.000000
d 1.000000
illum 2
map_Kd b1peter.jpg

newmtl Material.011
Ns 96.078443
Ka 1.000000 1.000000 1.000000
Kd 0.640000 0.640000 0.640000
Ks 0.500000 0.500000 0.500000
Ke 0.0 0.0 0.0
Ni 1.000000
d 1.000000
illum 2
map_Kd Branches0018_1_S.png

newmtl Material.012
Ns 96.078443
Ka 1.000000 1.000000 1.000000
Kd 0.640000 0.640000 0.640000
Ks 0.500000 0.500000 0.500000
Ke 0.0 0.0 0.0
Ni 1.000000
d 1.000000
illum 2
map_Kd b1peter.jpg

newmtl Material.013
Ns 96.078443
Ka 1.000000 1.000000 1.000000
Kd 0.640000 0.640000 0.640000
Ks 0.500000 0.500000 0.500000
Ke 0.0 0.0 0.0
Ni 1.000000
d 1.000000
illum 2
map_Kd Branches0018_1_S.png

newmtl Material.014
Ns 96.078443
Ka 1.000000 1.000000 1.000000
Kd 0.640000 0.640000 0.640000
Ks 0.500000 0.500000 0.500000
Ke 0.0 0.0 0.0
Ni 1.000000
d 1.000000
illum 2
map_Kd Branches0018_1_S.png

newmtl Material.015
Ns 96.078443
Ka 1.000000 1.000000 1.000000
Kd 0.640000 0.640000 0.640000
Ks 0.500000 0.500000 0.500000
Ke 0.0 0.0 0.0
Ni 1.000000
d 1.000000
illum 2
map_Kd b1peter.jpg

newmtl Material.016
Ns 96.078443
Ka 1.000000 1.000000 1.000000
Kd 0.640000 0.640000 0.640000
Ks 0.500000 0.500000 0.500000
Ke 0.0 0.0 0.0
Ni 1.000000
d 1.000000
illum 2
map_Kd b1peter.jpg

newmtl Material.017
Ns 96.078443
Ka 1.000000 1.000000 1.000000
Kd 0.640000 0.640000 0.640000
Ks 0.500000 0.500000 0.500000
Ke 0.0 0.0 0.0
Ni 1.000000
d 1.000000
illum 2
map_Kd Branches0018_1_S.png

newmtl Material.018
Ns 96.078443
Ka 1.000000 1.000000 1.000000
Kd 0.640000 0.640000 0.640000
Ks 0.500000 0.500000 0.500000
Ke 0.0 0.0 0.0
Ni 1.000000
d 1.000000
illum 2
map_Kd b1peter.jpg

newmtl Material.019
Ns 96.078443
Ka 1.000000 1.000000 1.000000
Kd 0.640000 0.640000 0.640000
Ks 0.500000 0.500000 0.500000
Ke 0.0 0.0 0.0
Ni 1.000000
d 1.000000
illum 2
map_Kd Branches0018_1_S.png

newmtl blad1_0_4.000
Ns 0.000000
Ka 1.000000 1.000000 1.000000
Kd 0.000000 0.000000 0.000000
Ks 0.000000 0.000000 0.000000
Ke 0.0 0.0 0.0
Ni 1.450000
d 0.000000
illum 1
map_Kd acer2a.png

newmtl blad1_0_4.001
Ns 0.000000
Ka 1.000000 1.000000 1.000000
Kd 0.000000 0.000000 0.000000
Ks 0.000000 0.000000 0.000000
Ke 0.0 0.0 0.0
Ni 1.450000
d 0.000000
illum 1
map_Kd acer2a.png

newmtl blad1_0_4.002
Ns 0.000000
Ka 1.000000 1.000000 1.000000
Kd 0.000000 0.000000 0.000000
Ks 0.000000 0.000000 0.000000
Ke 0.0 0.0 0.0
Ni 1.450000
d 0.000000
illum 1
map_Kd acer2a.png

newmtl blad1_0_4.004
Ns 0.000000
Ka 1.000000 1.000000 1.000000
Kd 0.000000 0.000000 0.000000
Ks 0.000000 0.000000 0.000000
Ke 0.0 0.0 0.0
Ni 1.450000
d 0.000000
illum 1
map_Kd acer2a.png

newmtl blad1_0_4.005
Ns 0.000000
Ka 1.000000 1.000000 1.000000
Kd 0.000000 0.000000 0.000000
Ks 0.000000 0.000000 0.000000
Ke 0.0 0.0 0.0
Ni 1.450000
d 0.000000
illum 1
map_Kd acer2a.png

newmtl blad1_0_4.006
Ns 0.000000
Ka 1.000000 1.000000 1.000000
Kd 0.000000 0.000000 0.000000
Ks 0.000000 0.000000 0.000000
Ke 0.0 0.0 0.0
Ni 1.450000
d 0.000000
illum 1
map_Kd acer2a.png

newmtl blad1_0_4.007
Ns 0.000000
Ka 1.000000 1.000000 1.000000
Kd 0.000000 0.000000 0.000000
Ks 0.000000 0.000000 0.000000
Ke 0.0 0.0 0.0
Ni 1.450000
d 0.000000
illum 1
map_Kd acer2a.png

newmtl blad1_0_4.008
Ns 0.000000
Ka 1.000000 1.000000 1.000000
Kd 0.000000 0.000000 0.000000
Ks 0.000000 0.000000 0.000000
Ke 0.0 0.0 0.0
Ni 1.450000
d 0.000000
illum 1
map_Kd acer2a.png

newmtl blad1_0_4.009
Ns 0.000000
Ka 1.000000 1.000000 1.000000
Kd 0.000000 0.000000 0.000000
Ks 0.000000 0.000000 0.000000
Ke 0.0 0.0 0.0
Ni 1.450000
d 0.000000
illum 1
map_Kd acer2a.png

newmtl blad1_0_4.010
Ns 0.000000
Ka 1.000000 1.000000 1.000000
Kd 0.000000 0.000000 0.000000
Ks 0.000000 0.000000 0.000000
Ke 0.0 0.0 0.0
Ni 1.450000
d 0.000000
illum 1
map_Kd acer2a.png

newmtl blad1_0_4.011
Ns 0.000000
Ka 1.000000 1.000000 1.000000
Kd 0.000000 0.000000 0.000000
Ks 0.000000 0.000000 0.000000
Ke 0.0 0.0 0.0
Ni 1.450000
d 0.000000
illum 1
map_Kd acer2a.png

newmtl blad1_0_4.012
Ns 0.000000
Ka 1.000000 1.000000 1.000000
Kd 0.000000 0.000000 0.000000
Ks 0.000000 0.000000 0.000000
Ke 0.0 0.0 0.0
Ni 1.450000
d 0.000000
illum 1
map_Kd acer2a.png

newmtl blad1_0_4.013
Ns 0.000000
Ka 1.000000 1.000000 1.000000
Kd 0.000000 0.000000 0.000000
Ks 0.000000 0.000000 0.000000
Ke 0.0 0.0 0.0
Ni 1.450000
d 0.000000
illum 1
map_Kd acer2a.png

newmtl blad1_0_4.014
Ns 0.000000
Ka 1.000000 1.000000 1.000000
Kd 0.000000 0.000000 0.000000
Ks 0.000000 0.000000 0.000000
Ke 0.0 0.0 0.0
Ni 1.450000
d 0.000000
illum 1
map_Kd acer2a.png

newmtl blad1_0_4.015
Ns 0.000000
Ka 1.000000 1.000000 1.000000
Kd 0.000000 0.000000 0.000000
Ks 0.000000 0.000000 0.000000
Ke 0.0 0.0 0.0
Ni 1.450000
d 0.000000
illum 1
map_Kd acer2a.png

newmtl blad1_0_4.016
Ns 0.000000
Ka 1.000000 1.000000 1.000000
Kd 0.000000 0.000000 0.000000
Ks 0.000000 0.000000 0.000000
Ke 0.0 0.0 0.0
Ni 1.450000
d 0.000000
illum 1
map_Kd acer2a.png

newmtl blad1_0_4.017
Ns 0.000000
Ka 1.000000 1.000000 1.000000
Kd 0.000000 0.000000 0.000000
Ks 0.000000 0.000000 0.000000
Ke 0.0 0.0 0.0
Ni 1.450000
d 0.000000
illum 1
map_Kd acer2a.png

newmtl blad1_0_4.018
Ns 0.000000
Ka 1.000000 1.000000 1.000000
Kd 0.000000 0.000000 0.000000
Ks 0.000000 0.000000 0.000000
Ke 0.0 0.0 0.0
Ni 1.450000
d 0.000000
illum 1
map_Kd acer2a.png

newmtl blad1_0_4.019
Ns 0.000000
Ka 1.000000 1.000000 1.000000
Kd 0.000000 0.000000 0.000000
Ks 0.000000 0.000000 0.000000
Ke 0.0 0.0 0.0
Ni 1.450000
d 0.000000
illum 1
map_Kd acer2a.png

newmtl blad1_0_4.020
Ns 0.000000
Ka 1.000000 1.000000 1.000000
Kd 0.000000 0.000000 0.000000
Ks 0.000000 0.000000 0.000000
Ke 0.0 0.0 0.0
Ni 1.450000
d 0.000000
illum 1
map_Kd acer2a.png

newmtl blad1_0_4.021
Ns 0.000000
Ka 1.000000 1.000000 1.000000
Kd 0.000000 0.000000 0.000000
Ks 0.000000 0.000000 0.000000
Ke 0.0 0.0 0.0
Ni 1.450000
d 0.000000
illum 1
map_Kd acer2a.png

newmtl blad2_0_1.000
Ns 0.000000
Ka 1.000000 1.000000 1.000000
Kd 0.000000 0.000000 0.000000
Ks 0.000000 0.000000 0.000000
Ke 0.0 0.0 0.0
Ni 1.450000
d 0.000000
illum 1
map_Kd acer2a.png

newmtl blad2_0_1.001
Ns 0.000000
Ka 1.000000 1.000000 1.000000
Kd 0.000000 0.000000 0.000000
Ks 0.000000 0.000000 0.000000
Ke 0.0 0.0 0.0
Ni 1.450000
d 0.000000
illum 1
map_Kd acer2a.png

newmtl blad2_0_1.002
Ns 0.000000
Ka 1.000000 1.000000 1.000000
Kd 0.000000 0.000000 0.000000
Ks 0.000000 0.000000 0.000000
Ke 0.0 0.0 0.0
Ni 1.450000
d 0.000000
illum 1
map_Kd acer2a.png

newmtl blad2_0_1.004
Ns 0.000000
Ka 1.000000 1.000000 1.000000
Kd 0.000000 0.000000 0.000000
Ks 0.000000 0.000000 0.000000
Ke 0.0 0.0 0.0
Ni 1.450000
d 0.000000
illum 1
map_Kd acer2a.png

newmtl blad2_0_1.005
Ns 0.000000
Ka 1.000000 1.000000 1.000000
Kd 0.000000 0.000000 0.000000
Ks 0.000000 0.000000 0.000000
Ke 0.0 0.0 0.0
Ni 1.450000
d 0.000000
illum 1
map_Kd acer2a.png

newmtl blad2_0_1.006
Ns 0.000000
Ka 1.000000 1.000000 1.000000
Kd 0.000000 0.000000 0.000000
Ks 0.000000 0.000000 0.000000
Ke 0.0 0.0 0.0
Ni 1.450000
d 0.000000
illum 1
map_Kd acer2a.png

newmtl blad2_0_1.007
Ns 0.000000
Ka 1.000000 1.000000 1.000000
Kd 0.000000 0.000000 0.000000
Ks 0.000000 0.000000 0.000000
Ke 0.0 0.0 0.0
Ni 1.450000
d 0.000000
illum 1
map_Kd acer2a.png

newmtl blad2_0_1.008
Ns 0.000000
Ka 1.000000 1.000000 1.000000
Kd 0.000000 0.000000 0.000000
Ks 0.000000 0.000000 0.000000
Ke 0.0 0.0 0.0
Ni 1.450000
d 0.000000
illum 1
map_Kd acer2a.png

newmtl blad2_0_1.009
Ns 0.000000
Ka 1.000000 1.000000 1.000000
Kd 0.000000 0.000000 0.000000
Ks 0.000000 0.000000 0.000000
Ke 0.0 0.0 0.0
Ni 1.450000
d 0.000000
illum 1
map_Kd acer2a.png

newmtl blad2_0_1.010
Ns 0.000000
Ka 1.000000 1.000000 1.000000
Kd 0.000000 0.000000 0.000000
Ks 0.000000 0.000000 0.000000
Ke 0.0 0.0 0.0
Ni 1.450000
d 0.000000
illum 1
map_Kd acer2a.png

newmtl blad2_0_1.011
Ns 0.000000
Ka 1.000000 1.000000 1.000000
Kd 0.000000 0.000000 0.000000
Ks 0.000000 0.000000 0.000000
Ke 0.0 0.0 0.0
Ni 1.450000
d 0.000000
illum 1
map_Kd acer2a.png

newmtl blad2_0_1.012
Ns 0.000000
Ka 1.000000 1.000000 1.000000
Kd 0.000000 0.000000 0.000000
Ks 0.000000 0.000000 0.000000
Ke 0.0 0.0 0.0
Ni 1.450000
d 0.000000
illum 1
map_Kd acer2a.png

newmtl blad2_0_1.013
Ns 0.000000
Ka 1.000000 1.000000 1.000000
Kd 0.000000 0.000000 0.000000
Ks 0.000000 0.000000 0.000000
Ke 0.0 0.0 0.0
Ni 1.450000
d 0.000000
illum 1
map_Kd acer2a.png

newmtl blad2_0_1.014
Ns 0.000000
Ka 1.000000 1.000000 1.000000
Kd 0.000000 0.000000 0.000000
Ks 0.000000 0.000000 0.000000
Ke 0.0 0.0 0.0
Ni 1.450000
d 0.000000
illum 1
map_Kd acer2a.png

newmtl blad2_0_1.015
Ns 0.000000
Ka 1.000000 1.000000 1.000000
Kd 0.000000 0.000000 0.000000
Ks 0.000000 0.000000 0.000000
Ke 0.0 0.0 0.0
Ni 1.450000
d 0.000000
illum 1
map_Kd acer2a.png

newmtl blad2_0_1.016
Ns 0.000000
Ka 1.000000 1.000000 1.000000
Kd 0.000000 0.000000 0.000000
Ks 0.000000 0.000000 0.000000
Ke 0.0 0.0 0.0
Ni 1.450000
d 0.000000
illum 1
map_Kd acer2a.png

newmtl blad2_0_1.017
Ns 0.000000
Ka 1.000000 1.000000 1.000000
Kd 0.000000 0.000000 0.000000
Ks 0.000000 0.000000 0.000000
Ke 0.0 0.0 0.0
Ni 1.450000
d 0.000000
illum 1
map_Kd acer2a.png

newmtl blad2_0_1.018
Ns 0.000000
Ka 1.000000 1.000000 1.000000
Kd 0.000000 0.000000 0.000000
Ks 0.000000 0.000000 0.000000
Ke 0.0 0.0 0.0
Ni 1.450000
d 0.000000
illum 1
map_Kd acer2a.png

newmtl blad2_0_1.019
Ns 0.000000
Ka 1.000000 1.000000 1.000000
Kd 0.000000 0.000000 0.000000
Ks 0.000000 0.000000 0.000000
Ke 0.0 0.0 0.0
Ni 1.450000
d 0.000000
illum 1
map_Kd acer2a.png

newmtl blad2_0_1.020
Ns 0.000000
Ka 1.000000 1.000000 1.000000
Kd 0.000000 0.000000 0.000000
Ks 0.000000 0.000000 0.000000
Ke 0.0 0.0 0.0
Ni 1.450000
d 0.000000
illum 1
map_Kd acer2a.png

newmtl blad2_0_1.021
Ns 0.000000
Ka 1.000000 1.000000 1.000000
Kd 0.000000 0.000000 0.000000
Ks 0.000000 0.000000 0.000000
Ke 0.0 0.0 0.0
Ni 1.450000
d 0.000000
illum 1
map_Kd acer2a.png

newmtl blad3_0_2.000
Ns 0.000000
Ka 1.000000 1.000000 1.000000
Kd 0.000000 0.000000 0.000000
Ks 0.000000 0.000000 0.000000
Ke 0.0 0.0 0.0
Ni 1.450000
d 0.000000
illum 1
map_Kd acer2a.png

newmtl blad3_0_2.001
Ns 0.000000
Ka 1.000000 1.000000 1.000000
Kd 0.000000 0.000000 0.000000
Ks 0.000000 0.000000 0.000000
Ke 0.0 0.0 0.0
Ni 1.450000
d 0.000000
illum 1
map_Kd acer2a.png

newmtl blad3_0_2.002
Ns 0.000000
Ka 1.000000 1.000000 1.000000
Kd 0.000000 0.000000 0.000000
Ks 0.000000 0.000000 0.000000
Ke 0.0 0.0 0.0
Ni 1.450000
d 0.000000
illum 1
map_Kd acer2a.png

newmtl blad3_0_2.004
Ns 0.000000
Ka 1.000000 1.000000 1.000000
Kd 0.000000 0.000000 0.000000
Ks 0.000000 0.000000 0.000000
Ke 0.0 0.0 0.0
Ni 1.450000
d 0.000000
illum 1
map_Kd acer2a.png

newmtl blad3_0_2.005
Ns 0.000000
Ka 1.000000 1.000000 1.000000
Kd 0.000000 0.000000 0.000000
Ks 0.000000 0.000000 0.000000
Ke 0.0 0.0 0.0
Ni 1.450000
d 0.000000
illum 1
map_Kd acer2a.png

newmtl blad3_0_2.006
Ns 0.000000
Ka 1.000000 1.000000 1.000000
Kd 0.000000 0.000000 0.000000
Ks 0.000000 0.000000 0.000000
Ke 0.0 0.0 0.0
Ni 1.450000
d 0.000000
illum 1
map_Kd acer2a.png

newmtl blad3_0_2.007
Ns 0.000000
Ka 1.000000 1.000000 1.000000
Kd 0.000000 0.000000 0.000000
Ks 0.000000 0.000000 0.000000
Ke 0.0 0.0 0.0
Ni 1.450000
d 0.000000
illum 1
map_Kd acer2a.png

newmtl blad3_0_2.008
Ns 0.000000
Ka 1.000000 1.000000 1.000000
Kd 0.000000 0.000000 0.000000
Ks 0.000000 0.000000 0.000000
Ke 0.0 0.0 0.0
Ni 1.450000
d 0.000000
illum 1
map_Kd acer2a.png

newmtl blad3_0_2.009
Ns 0.000000
Ka 1.000000 1.000000 1.000000
Kd 0.000000 0.000000 0.000000
Ks 0.000000 0.000000 0.000000
Ke 0.0 0.0 0.0
Ni 1.450000
d 0.000000
illum 1
map_Kd acer2a.png

newmtl blad3_0_2.010
Ns 0.000000
Ka 1.000000 1.000000 1.000000
Kd 0.000000 0.000000 0.000000
Ks 0.000000 0.000000 0.000000
Ke 0.0 0.0 0.0
Ni 1.450000
d 0.000000
illum 1
map_Kd acer2a.png

newmtl blad3_0_2.011
Ns 0.000000
Ka 1.000000 1.000000 1.000000
Kd 0.000000 0.000000 0.000000
Ks 0.000000 0.000000 0.000000
Ke 0.0 0.0 0.0
Ni 1.450000
d 0.000000
illum 1
map_Kd acer2a.png

newmtl blad3_0_2.012
Ns 0.000000
Ka 1.000000 1.000000 1.000000
Kd 0.000000 0.000000 0.000000
Ks 0.000000 0.000000 0.000000
Ke 0.0 0.0 0.0
Ni 1.450000
d 0.000000
illum 1
map_Kd acer2a.png

newmtl blad3_0_2.013
Ns 0.000000
Ka 1.000000 1.000000 1.000000
Kd 0.000000 0.000000 0.000000
Ks 0.000000 0.000000 0.000000
Ke 0.0 0.0 0.0
Ni 1.450000
d 0.000000
illum 1
map_Kd acer2a.png

newmtl blad3_0_2.014
Ns 0.000000
Ka 1.000000 1.000000 1.000000
Kd 0.000000 0.000000 0.000000
Ks 0.000000 0.000000 0.000000
Ke 0.0 0.0 0.0
Ni 1.450000
d 0.000000
illum 1
map_Kd acer2a.png

newmtl blad3_0_2.015
Ns 0.000000
Ka 1.000000 1.000000 1.000000
Kd 0.000000 0.000000 0.000000
Ks 0.000000 0.000000 0.000000
Ke 0.0 0.0 0.0
Ni 1.450000
d 0.000000
illum 1
map_Kd acer2a.png

newmtl blad3_0_2.016
Ns 0.000000
Ka 1.000000 1.000000 1.000000
Kd 0.000000 0.000000 0.000000
Ks 0.000000 0.000000 0.000000
Ke 0.0 0.0 0.0
Ni 1.450000
d 0.000000
illum 1
map_Kd acer2a.png

newmtl blad3_0_2.017
Ns 0.000000
Ka 1.000000 1.000000 1.000000
Kd 0.000000 0.000000 0.000000
Ks 0.000000 0.000000 0.000000
Ke 0.0 0.0 0.0
Ni 1.450000
d 0.000000
illum 1
map_Kd acer2a.png

newmtl blad3_0_2.018
Ns 0.000000
Ka 1.000000 1.000000 1.000000
Kd 0.000000 0.000000 0.000000
Ks 0.000000 0.000000 0.000000
Ke 0.0 0.0 0.0
Ni 1.450000
d 0.000000
illum 1
map_Kd acer2a.png

newmtl blad3_0_2.019
Ns 0.000000
Ka 1.000000 1.000000 1.000000
Kd 0.000000 0.000000 0.000000
Ks 0.000000 0.000000 0.000000
Ke 0.0 0.0 0.0
Ni 1.450000
d 0.000000
illum 1
map_Kd acer2a.png

newmtl blad3_0_2.020
Ns 0.000000
Ka 1.000000 1.000000 1.000000
Kd 0.000000 0.000000 0.000000
Ks 0.000000 0.000000 0.000000
Ke 0.0 0.0 0.0
Ni 1.450000
d 0.000000
illum 1
map_Kd acer2a.png

newmtl blad3_0_2.021
Ns 0.000000
Ka 1.000000 1.000000 1.000000
Kd 0.000000 0.000000 0.000000
Ks 0.000000 0.000000 0.000000
Ke 0.0 0.0 0.0
Ni 1.450000
d 0.000000
illum 1
map_Kd acer2a.png

newmtl blad4_0_5.000
Ns 0.000000
Ka 1.000000 1.000000 1.000000
Kd 0.000000 0.000000 0.000000
Ks 0.000000 0.000000 0.000000
Ke 0.0 0.0 0.0
Ni 1.450000
d 0.000000
illum 1
map_Kd acer2a.png

newmtl blad4_0_5.001
Ns 0.000000
Ka 1.000000 1.000000 1.000000
Kd 0.000000 0.000000 0.000000
Ks 0.000000 0.000000 0.000000
Ke 0.0 0.0 0.0
Ni 1.450000
d 0.000000
illum 1
map_Kd acer2a.png

newmtl blad4_0_5.002
Ns 0.000000
Ka 1.000000 1.000000 1.000000
Kd 0.000000 0.000000 0.000000
Ks 0.000000 0.000000 0.000000
Ke 0.0 0.0 0.0
Ni 1.450000
d 0.000000
illum 1
map_Kd acer2a.png

newmtl blad4_0_5.004
Ns 0.000000
Ka 1.000000 1.000000 1.000000
Kd 0.000000 0.000000 0.000000
Ks 0.000000 0.000000 0.000000
Ke 0.0 0.0 0.0
Ni 1.450000
d 0.000000
illum 1
map_Kd acer2a.png

newmtl blad4_0_5.005
Ns 0.000000
Ka 1.000000 1.000000 1.000000
Kd 0.000000 0.000000 0.000000
Ks 0.000000 0.000000 0.000000
Ke 0.0 0.0 0.0
Ni 1.450000
d 0.000000
illum 1
map_Kd acer2a.png

newmtl blad4_0_5.006
Ns 0.000000
Ka 1.000000 1.000000 1.000000
Kd 0.000000 0.000000 0.000000
Ks 0.000000 0.000000 0.000000
Ke 0.0 0.0 0.0
Ni 1.450000
d 0.000000
illum 1
map_Kd acer2a.png

newmtl blad4_0_5.007
Ns 0.000000
Ka 1.000000 1.000000 1.000000
Kd 0.000000 0.000000 0.000000
Ks 0.000000 0.000000 0.000000
Ke 0.0 0.0 0.0
Ni 1.450000
d 0.000000
illum 1
map_Kd acer2a.png

newmtl blad4_0_5.008
Ns 0.000000
Ka 1.000000 1.000000 1.000000
Kd 0.000000 0.000000 0.000000
Ks 0.000000 0.000000 0.000000
Ke 0.0 0.0 0.0
Ni 1.450000
d 0.000000
illum 1
map_Kd acer2a.png

newmtl blad4_0_5.009
Ns 0.000000
Ka 1.000000 1.000000 1.000000
Kd 0.000000 0.000000 0.000000
Ks 0.000000 0.000000 0.000000
Ke 0.0 0.0 0.0
Ni 1.450000
d 0.000000
illum 1
map_Kd acer2a.png

newmtl blad4_0_5.010
Ns 0.000000
Ka 1.000000 1.000000 1.000000
Kd 0.000000 0.000000 0.000000
Ks 0.000000 0.000000 0.000000
Ke 0.0 0.0 0.0
Ni 1.450000
d 0.000000
illum 1
map_Kd acer2a.png

newmtl blad4_0_5.011
Ns 0.000000
Ka 1.000000 1.000000 1.000000
Kd 0.000000 0.000000 0.000000
Ks 0.000000 0.000000 0.000000
Ke 0.0 0.0 0.0
Ni 1.450000
d 0.000000
illum 1
map_Kd acer2a.png

newmtl blad4_0_5.012
Ns 0.000000
Ka 1.000000 1.000000 1.000000
Kd 0.000000 0.000000 0.000000
Ks 0.000000 0.000000 0.000000
Ke 0.0 0.0 0.0
Ni 1.450000
d 0.000000
illum 1
map_Kd acer2a.png

newmtl blad4_0_5.013
Ns 0.000000
Ka 1.000000 1.000000 1.000000
Kd 0.000000 0.000000 0.000000
Ks 0.000000 0.000000 0.000000
Ke 0.0 0.0 0.0
Ni 1.450000
d 0.000000
illum 1
map_Kd acer2a.png

newmtl blad4_0_5.014
Ns 0.000000
Ka 1.000000 1.000000 1.000000
Kd 0.000000 0.000000 0.000000
Ks 0.000000 0.000000 0.000000
Ke 0.0 0.0 0.0
Ni 1.450000
d 0.000000
illum 1
map_Kd acer2a.png

newmtl blad4_0_5.015
Ns 0.000000
Ka 1.000000 1.000000 1.000000
Kd 0.000000 0.000000 0.000000
Ks 0.000000 0.000000 0.000000
Ke 0.0 0.0 0.0
Ni 1.450000
d 0.000000
illum 1
map_Kd acer2a.png

newmtl blad4_0_5.016
Ns 0.000000
Ka 1.000000 1.000000 1.000000
Kd 0.000000 0.000000 0.000000
Ks 0.000000 0.000000 0.000000
Ke 0.0 0.0 0.0
Ni 1.450000
d 0.000000
illum 1
map_Kd acer2a.png

newmtl blad4_0_5.017
Ns 0.000000
Ka 1.000000 1.000000 1.000000
Kd 0.000000 0.000000 0.000000
Ks 0.000000 0.000000 0.000000
Ke 0.0 0.0 0.0
Ni 1.450000
d 0.000000
illum 1
map_Kd acer2a.png

newmtl blad4_0_5.018
Ns 0.000000
Ka 1.000000 1.000000 1.000000
Kd 0.000000 0.000000 0.000000
Ks 0.000000 0.000000 0.000000
Ke 0.0 0.0 0.0
Ni 1.450000
d 0.000000
illum 1
map_Kd acer2a.png

newmtl blad4_0_5.019
Ns 0.000000
Ka 1.000000 1.000000 1.000000
Kd 0.000000 0.000000 0.000000
Ks 0.000000 0.000000 0.000000
Ke 0.0 0.0 0.0
Ni 1.450000
d 0.000000
illum 1
map_Kd acer2a.png

newmtl blad4_0_5.020
Ns 0.000000
Ka 1.000000 1.000000 1.000000
Kd 0.000000 0.000000 0.000000
Ks 0.000000 0.000000 0.000000
Ke 0.0 0.0 0.0
Ni 1.450000
d 0.000000
illum 1
map_Kd acer2a.png

newmtl blad4_0_5.021
Ns 0.000000
Ka 1.000000 1.000000 1.000000
Kd 0.000000 0.000000 0.000000
Ks 0.000000 0.000000 0.000000
Ke 0.0 0.0 0.0
Ni 1.450000
d 0.000000
illum 1
map_Kd acer2a.png

newmtl blad4_0_6.000
Ns 0.000000
Ka 1.000000 1.000000 1.000000
Kd 0.000000 0.000000 0.000000
Ks 0.000000 0.000000 0.000000
Ke 0.0 0.0 0.0
Ni 1.450000
d 0.000000
illum 1
map_Kd acer2a.png

newmtl blad4_0_6.001
Ns 0.000000
Ka 1.000000 1.000000 1.000000
Kd 0.000000 0.000000 0.000000
Ks 0.000000 0.000000 0.000000
Ke 0.0 0.0 0.0
Ni 1.450000
d 0.000000
illum 1
map_Kd acer2a.png

newmtl blad4_0_6.002
Ns 0.000000
Ka 1.000000 1.000000 1.000000
Kd 0.000000 0.000000 0.000000
Ks 0.000000 0.000000 0.000000
Ke 0.0 0.0 0.0
Ni 1.450000
d 0.000000
illum 1
map_Kd acer2a.png

newmtl blad4_0_6.004
Ns 0.000000
Ka 1.000000 1.000000 1.000000
Kd 0.000000 0.000000 0.000000
Ks 0.000000 0.000000 0.000000
Ke 0.0 0.0 0.0
Ni 1.450000
d 0.000000
illum 1
map_Kd acer2a.png

newmtl blad4_0_6.005
Ns 0.000000
Ka 1.000000 1.000000 1.000000
Kd 0.000000 0.000000 0.000000
Ks 0.000000 0.000000 0.000000
Ke 0.0 0.0 0.0
Ni 1.450000
d 0.000000
illum 1
map_Kd acer2a.png

newmtl blad4_0_6.006
Ns 0.000000
Ka 1.000000 1.000000 1.000000
Kd 0.000000 0.000000 0.000000
Ks 0.000000 0.000000 0.000000
Ke 0.0 0.0 0.0
Ni 1.450000
d 0.000000
illum 1
map_Kd acer2a.png

newmtl blad4_0_6.007
Ns 0.000000
Ka 1.000000 1.000000 1.000000
Kd 0.000000 0.000000 0.000000
Ks 0.000000 0.000000 0.000000
Ke 0.0 0.0 0.0
Ni 1.450000
d 0.000000
illum 1
map_Kd acer2a.png

newmtl blad4_0_6.008
Ns 0.000000
Ka 1.000000 1.000000 1.000000
Kd 0.000000 0.000000 0.000000
Ks 0.000000 0.000000 0.000000
Ke 0.0 0.0 0.0
Ni 1.450000
d 0.000000
illum 1
map_Kd acer2a.png

newmtl blad4_0_6.009
Ns 0.000000
Ka 1.000000 1.000000 1.000000
Kd 0.000000 0.000000 0.000000
Ks 0.000000 0.000000 0.000000
Ke 0.0 0.0 0.0
Ni 1.450000
d 0.000000
illum 1
map_Kd acer2a.png

newmtl blad4_0_6.010
Ns 0.000000
Ka 1.000000 1.000000 1.000000
Kd 0.000000 0.000000 0.000000
Ks 0.000000 0.000000 0.000000
Ke 0.0 0.0 0.0
Ni 1.450000
d 0.000000
illum 1
map_Kd acer2a.png

newmtl blad4_0_6.011
Ns 0.000000
Ka 1.000000 1.000000 1.000000
Kd 0.000000 0.000000 0.000000
Ks 0.000000 0.000000 0.000000
Ke 0.0 0.0 0.0
Ni 1.450000
d 0.000000
illum 1
map_Kd acer2a.png

newmtl blad4_0_6.012
Ns 0.000000
Ka 1.000000 1.000000 1.000000
Kd 0.000000 0.000000 0.000000
Ks 0.000000 0.000000 0.000000
Ke 0.0 0.0 0.0
Ni 1.450000
d 0.000000
illum 1
map_Kd acer2a.png

newmtl blad4_0_6.013
Ns 0.000000
Ka 1.000000 1.000000 1.000000
Kd 0.000000 0.000000 0.000000
Ks 0.000000 0.000000 0.000000
Ke 0.0 0.0 0.0
Ni 1.450000
d 0.000000
illum 1
map_Kd acer2a.png

newmtl blad4_0_6.014
Ns 0.000000
Ka 1.000000 1.000000 1.000000
Kd 0.000000 0.000000 0.000000
Ks 0.000000 0.000000 0.000000
Ke 0.0 0.0 0.0
Ni 1.450000
d 0.000000
illum 1
map_Kd acer2a.png

newmtl blad4_0_6.015
Ns 0.000000
Ka 1.000000 1.000000 1.000000
Kd 0.000000 0.000000 0.000000
Ks 0.000000 0.000000 0.000000
Ke 0.0 0.0 0.0
Ni 1.450000
d 0.000000
illum 1
map_Kd acer2a.png

newmtl blad4_0_6.016
Ns 0.000000
Ka 1.000000 1.000000 1.000000
Kd 0.000000 0.000000 0.000000
Ks 0.000000 0.000000 0.000000
Ke 0.0 0.0 0.0
Ni 1.450000
d 0.000000
illum 1
map_Kd acer2a.png

newmtl blad4_0_6.017
Ns 0.000000
Ka 1.000000 1.000000 1.000000
Kd 0.000000 0.000000 0.000000
Ks 0.000000 0.000000 0.000000
Ke 0.0 0.0 0.0
Ni 1.450000
d 0.000000
illum 1
map_Kd acer2a.png

newmtl blad4_0_6.018
Ns 0.000000
Ka 1.000000 1.000000 1.000000
Kd 0.000000 0.000000 0.000000
Ks 0.000000 0.000000 0.000000
Ke 0.0 0.0 0.0
Ni 1.450000
d 0.000000
illum 1
map_Kd acer2a.png

newmtl blad4_0_6.019
Ns 0.000000
Ka 1.000000 1.000000 1.000000
Kd 0.000000 0.000000 0.000000
Ks 0.000000 0.000000 0.000000
Ke 0.0 0.0 0.0
Ni 1.450000
d 0.000000
illum 1
map_Kd acer2a.png

newmtl blad4_0_6.020
Ns 0.000000
Ka 1.000000 1.000000 1.000000
Kd 0.000000 0.000000 0.000000
Ks 0.000000 0.000000 0.000000
Ke 0.0 0.0 0.0
Ni 1.450000
d 0.000000
illum 1
map_Kd acer2a.png

newmtl blad4_0_6.021
Ns 0.000000
Ka 1.000000 1.000000 1.000000
Kd 0.000000 0.000000 0.000000
Ks 0.000000 0.000000 0.000000
Ke 0.0 0.0 0.0
Ni 1.450000
d 0.000000
illum 1
map_Kd acer2a.png
