0.6067
0.5548
0.3523
0.2554
0.4068
0.3430
0.5703
0.2820
0.3860
0.4500
0.6449
0.4028
0.2691
0.5535
0.4710
0.2503
0.6458
0.6897
0.5861
0.6413
0.2861
0.5379
0.6393
0.5104
0.3833
0.1604
0.3605
0.4665
0.6478
0.6800
0.3862
0.6192
0.2563
0.5830
0.4292
0.1084
0.5318
0.3393
0.5949
0.5009
0.1007
0.3961
0.6206
0.2463
0.2951
0.6223
0.2146
0.4405
0.2432
0.6805
0.5819
0.3688
0.1483
0.2920
0.4048
0.6597
0.1654
0.4308
0.5239
0.4285
0.5887
0.4242
0.6783
0.4619
0.4526
0.3670
0.4578
0.3309
0.4454
0.2742
0.2136
0.2120
0.4677
0.4940
0.3859
0.1539
0.5546
0.6261
0.6540
0.6055
0.6389
0.6538
0.4244
0.3348
0.5232
0.2654
0.5870
0.6097
0.6370
0.4539
0.6699
0.4478
0.3703
0.4961
0.6978
0.6502
0.5760
0.1494
0.4677
0.3919
0.4781
0.6070
0.2458
0.5389
0.1703
0.2323
0.5767
0.2995
0.5895
0.1604
0.1878
0.5186
0.1271
0.4443
0.6460
0.4205
0.5084
0.1160
0.4810
0.4638
0.4456
0.3347
0.3221
0.6883
0.1218
0.1130
0.6766
0.2110
0.1743
0.2263
0.5804
0.6622
0.1137
0.3554
0.1609
0.2560
0.2325
0.4882
0.3102
0.2082
0.4022
0.1236
0.1606
0.6929
0.2196
0.3151
0.5390
0.6030
0.6511
0.2017
0.5036
0.6799
0.1348
0.5057
0.6073
0.3054
0.2504
0.4581
0.3654
0.2049
0.3830
0.3459
0.4415
0.4052
0.2869
0.3143
0.6026
0.2506
0.4364
0.1075
0.5449
0.3015
0.1274
0.2685
0.2441
0.6719
0.3113
0.2727
0.3155
0.6681
0.4802
0.4726
0.5294
0.3328
0.3487
0.4905
0.1009
0.2154
0.3006
0.2436
0.4824
0.3272
0.6253
0.4409
0.3486
0.3414
0.5211
0.3509
0.4973
0.1281
0.3672
0.2555
0.1946
0.4165
0.3924
0.4368
0.5533
0.6303
0.3967
0.2872
0.3801
0.5854
0.6250
0.5874
0.2128
0.6997
0.4799
0.1501
0.5353
0.6921
0.3411
0.5071
0.2897
0.2281
0.5304
0.1014
0.5936
0.4170
0.1587
0.1713
0.4896
0.6242
0.2680
0.6871
0.1601
0.6124
0.3380
0.1488
0.2648
0.3718
0.5754
0.6168
0.1801
0.4125
0.4905
0.3082
0.6231
0.2670
0.1111
0.1244
0.5086
0.4350
0.6679
0.6631
0.6459
0.1252
0.5495
0.5208
0.4932
0.5274
0.6416
0.4841
0.3235
0.4228
0.2247
0.4523
0.1053
0.1906
0.3000
0.5738
0.5311
0.3030
0.4723
0.1247
0.1983
0.6891
0.2737
0.3369
0.4291
0.2760
0.3868
0.2438
0.1290
0.2078
0.4138
0.1425
0.3419
0.2971
0.3488
0.1596
0.6452
0.3844
0.6045
0.6857
0.3062
0.3875
0.5198
0.3559
0.2811
0.5409
0.6366
0.6518
0.4760
0.3253
0.6847
0.4833
0.1395
0.1508
0.5499
0.1367
0.1047
0.3363
0.4114
0.3691
0.3932
0.4509
0.5076
0.3538
0.3210
0.6931
0.2565
0.5663
0.3587
0.3151
0.1383
0.6181
0.5212
0.6418
0.3710
0.5062
0.1713
0.3388
0.2243
0.1253
0.6688
0.2295
0.1878
0.2188
0.3268
0.4278
0.1908
0.6932
0.6898
0.1890
0.3435
0.5080
0.6266
0.3972
0.6502
0.2935
0.3991
0.3992
0.5020
0.2212
0.4659
0.2313
0.3041
0.6775
0.6394
0.5909
0.1213
0.1890
0.2541
0.5705
0.6054
0.4498
0.5309
0.5842
0.1398
0.1508
0.6213
0.1236
0.2351
0.1244
0.1092
0.6064
0.2984
0.1964
0.1893
0.4937
0.6812
0.4030
0.6407
0.4015
0.4443
0.5071
0.5831
0.5547
0.6943
0.5482
0.6435
0.2237
0.4212
0.4592
0.5954
0.3893
0.5746
0.3331
0.4518
0.6108
0.5788
0.4942
0.1001
0.2092
0.4041
0.2527
0.1394
0.6159
0.6658
0.2817
0.3448
0.5860
0.1374
0.4846
0.1764
0.2723
0.5980
0.1333
0.1216
0.3507
0.3951
0.6180
0.5303
0.5041
0.1908
0.6920
0.3467
0.4671
0.3320
0.1282
0.3825
0.1908
0.1195
0.4704
0.4780
0.1632
0.4295
0.3080
0.3300
0.5659
0.3942
0.6288
0.4661
0.3803
0.4794
0.3027
0.1746
0.5095
0.4732
0.5731
0.1763
0.6471
0.5796
0.6501
0.6235
0.5086
0.5862
0.4114
0.5713
0.2135
0.5693
0.3667
0.5540
0.3733
0.5737
0.1452
0.1268
0.6606
0.3917
0.6406
0.6669
0.4999
0.4431
0.2296
0.1561
0.5916
0.6333
0.5676
0.5191
0.3521
0.2832
0.1681
0.3556
0.4396
0.6537
0.6615
0.3494
0.1595
0.5643
0.5406
0.1184
0.3680
0.5119
0.1181
0.6516
0.6773
0.5335
0.1471
0.1422
0.3156
