1.00000
1071587.61807
4.49854
410.56618
2.00000
405249.94238
1.70124
409.58478
3.00000
375007.33321
1.57429
408.50080
4.00000
358889.68445
1.50662
413.81661
5.00000
346814.85971
1.45593
410.47298
6.00000
336540.73979
1.41280
411.42420
7.00000
329791.37302
1.38447
407.92336
8.00000
328039.19736
1.37711
410.30979
9.00000
321183.74277
1.34833
410.58333
10.00000
317794.38979
1.33410
411.10685
11.00000
316101.39964
1.32700
409.41401
12.00000
313807.23743
1.31737
410.47258
13.00000
312781.50060
1.31306
409.28646
14.00000
311431.22562
1.30739
412.64020
15.00000
310323.86119
1.30274
410.16179
16.00000
310031.72466
1.30152
414.31372
17.00000
320733.80000
1.34644
412.97859
18.00000
311109.28398
1.30604
411.64486
19.00000
308829.91119
1.29647
409.35321
20.00000
308055.41354
1.29322
411.53373
21.00000
307598.72443
1.29130
410.93386
22.00000
307005.92496
1.28881
411.12704
23.00000
306581.20366
1.28703
411.81606
24.00000
306261.28267
1.28569
408.29769
25.00000
305955.44562
1.28440
413.54690
26.00000
305501.03740
1.28250
412.32769
27.00000
305393.70723
1.28205
412.05686
28.00000
305096.97908
1.28080
411.30571
29.00000
304793.29518
1.27953
411.74768
30.00000
304697.50337
1.27912
411.55430
