28.07476
28.80371
29.14323
28.07476
28.80371
29.14323
29.14160
29.46848
29.87812
29.99189
29.86801
30.04465
30.14502
29.73501
29.96376
30.19877
30.19404
30.26345
30.27481
30.09981
30.23306
30.06580
30.30686
24.71684
30.31926
30.34944
30.33710
30.36241
30.28685
26.86361
29.22200
30.34482
30.35870
30.40150
30.36110
30.34948
30.39950
30.39180
30.40049
30.35951
30.32725
30.42338
30.23351
30.30140
30.16816
30.39829
30.38631
30.35855
30.40866
29.75875
30.40233
30.36799
27.09356
30.33716
30.27055
29.72948
30.25914
30.42557
30.40123
30.25829
30.22946
30.43923
30.38080
30.43318
30.21980
30.30853
30.40043
30.43242
30.44885
30.42489
30.24179
30.41678
30.44954
30.41385
25.33491
30.26948
29.43462
28.71277
29.98162
30.21586
30.34120
30.02114
27.20272
30.37529
30.42954
30.41642
29.31989
28.98576
30.43605
30.37694
30.44817
30.22561
30.39301
30.31679
30.43636
29.82908
30.45601
30.42491
30.37997
30.21881
30.13316
30.43771
30.42051
