30.05326
30.15011
30.21055
30.28363
30.31793
30.29896
30.34072
30.34640
30.36719
30.37231
30.38102
30.38186
30.37980
30.40265
30.42125
30.40531
30.40645
30.40509
30.43013
30.42589
30.41354
30.43401
30.44615
30.43733
30.44718
30.43359
30.43728
30.45478
30.43938
30.45785
30.48814
30.49525
30.49208
30.49303
30.48795
30.48576
30.48781
30.49541
30.48543
30.48678
30.48858
30.49089
30.49328
30.49681
30.49345
30.48457
30.49309
30.49399
30.48945
30.49857
30.49424
30.49799
30.50080
30.49021
30.49326
30.49799
30.49462
30.49810
30.49755
30.49936
30.50198
30.50924
30.50855
30.51351
30.51065
30.50822
30.50040
30.51072
30.50688
30.50621
30.48297
30.50404
30.50273
30.50598
30.50602
30.50970
30.50661
30.49024
30.50843
30.50857
30.50822
30.50429
30.49581
30.50731
30.50978
30.51274
30.51554
30.51127
30.51070
30.51171
30.51344
30.51102
30.50991
30.51258
30.51029
30.51281
30.49956
30.51073
30.50903
30.50740
