0.87454
0.89486
0.90121
0.89825
0.91050
0.91889
0.92123
0.91898
0.92327
0.92443
0.92336
0.92220
0.92558
0.92464
0.92666
0.92695
0.92251
0.92579
0.92223
0.92731
0.90012
0.92729
0.92786
0.92793
0.92824
0.92794
0.91957
0.92339
0.92835
0.92805
