26.89940
27.48954
28.23650
27.76989
28.57010
28.55142
28.67597
28.74064
28.91511
28.98846
28.63448
28.85749
29.02176
28.99338
29.08759
29.05981
28.87765
29.03061
28.80767
29.09485
24.01592
29.02035
29.14678
29.01050
29.10128
28.97071
25.76357
27.50846
29.14965
29.11875
