1.4396605246
1.3249743260
1.3081985619
1.2987980966
1.2924811959
1.2885282566
1.2848353495
1.2817580893
1.2799396766
1.2776690543
1.2757839711
1.2742568873
1.2729916717
1.2714818341
1.2699543208
1.2693483206
1.2683553037
1.2672008216
1.2668799185
1.2660817507
1.2652879748
1.2647051931
1.2640206729
1.2635286041
1.2631042525
1.2626259284
1.2620912140
1.2613884640
1.2608456890
1.2610952937
1.2540304427
1.2535318886
1.2530434611
1.2529257681
1.2524834271
1.2523222311
1.2523441119
1.2521270087
1.2521950615
1.2520666978
1.2520173132
1.2516034530
1.2514883032
1.2514541822
1.2516242229
1.2514401722
1.2515895629
1.2511968986
1.2509689718
1.2508914053
1.2507685231
1.2510264907
1.2507129031
1.2507148029
1.2509359222
1.2502750499
1.2504736883
1.2501707247
1.2502908965
1.2503372295
1.2487527090
1.2484367829
1.2485758530
1.2485327730
1.2483266741
1.2483807898
1.2482731210
1.2482360115
1.2484426851
1.2482152457
1.2485514161
1.2481588110
1.2481041018
1.2483103106
1.2479840855
1.2484037324
1.2478953999
1.2480476838
1.2476454440
1.2480665736
1.2479186666
1.2478246119
1.2478791168
1.2482466061
1.2479043471
1.2477242444
1.2479763140
1.2480927428
1.2477414254
1.2476504324
1.2475476307
1.2473706662
1.2473137933
1.2472988594
1.2474678640
1.2473925170
1.2473600592
1.2474986357
1.2476521691
1.2474207854
