27.05508
27.61259
28.38052
28.32946
28.38370
28.84827
28.95396
28.69309
29.03239
29.02276
29.11158
29.11961
29.12095
29.02869
29.13026
29.14566
29.11388
29.13454
29.12559
29.17753
29.14932
29.14337
29.17133
29.18607
29.11570
29.16380
29.19942
29.19369
29.20159
29.20943
