{
  "ES": {
    "title": "Contáctanos",
    "content": "Gracias por tu interés en nuestra empresa, te puedes comunicar con nosotros de esta forma",
    "web": "Página web",
    "email": "Correos",
    "phone": "Teléfonos"
  },
  "EN": {
    "title": "Contact us",
    "content": "Thank you for your interest in our company, you can communicate with us in this way",
    "web": "Website",
    "email": "Emails",
    "phone": "Phone numbers"
  }
}
