Necklace
3
1.564
17
1
Perfect Cut
46
Necklace
2
2120.32
22
0
Sonoma Mist
28
Necklace
1
1350
34
1
Everyday Diamond
52
Ring
2
3800
17
0
Sonoma Mist
24
Ring
1
4500
25
1
Perfect Cut
22
Ring
3
4253
19
0
Everyday Diamond
28
Earrings
1
1200
8
0
Perfect Cut
3
1
Earrings
2
2300
10
1
Sonoma Mist
2
0
Earrings
3
600
14
1
Everyday Diamond
1
0