﻿  main.cpp
F:\Daw\Documents\Master\WS2020-21\Shaderprogrammierung\Wolff3rd\Exercises\GeometryShader\includes\objmesh.h(3,10): fatal error C1083: Cannot open include file: 'trianglemesh.h': No such file or directory
  sceneexplosion.cpp
F:\Daw\Documents\Master\WS2020-21\Shaderprogrammierung\Wolff3rd\Exercises\GeometryShader\includes\objmesh.h(3,10): fatal error C1083: Cannot open include file: 'trianglemesh.h': No such file or directory
  scenenormals.cpp
F:\Daw\Documents\Master\WS2020-21\Shaderprogrammierung\Wolff3rd\Exercises\GeometryShader\includes\objmesh.h(3,10): fatal error C1083: Cannot open include file: 'trianglemesh.h': No such file or directory
  scenepointsprite.cpp
F:\Daw\Documents\Master\WS2020-21\Shaderprogrammierung\Wolff3rd\Exercises\GeometryShader\GeometryShader\scenepointsprite.cpp(2,10): fatal error C1083: Cannot open include file: 'texture.h': No such file or directory
  sceneshadewire.cpp
F:\Daw\Documents\Master\WS2020-21\Shaderprogrammierung\Wolff3rd\Exercises\GeometryShader\includes\objmesh.h(3,10): fatal error C1083: Cannot open include file: 'trianglemesh.h': No such file or directory
  scenesilhouette.cpp
F:\Daw\Documents\Master\WS2020-21\Shaderprogrammierung\Wolff3rd\Exercises\GeometryShader\includes\objmesh.h(3,10): fatal error C1083: Cannot open include file: 'trianglemesh.h': No such file or directory
  scenesphere.cpp
F:\Daw\Documents\Master\WS2020-21\Shaderprogrammierung\Wolff3rd\Exercises\GeometryShader\includes\objmesh.h(3,10): fatal error C1083: Cannot open include file: 'trianglemesh.h': No such file or directory
  Generating Code...
