'code';'codeSystem';'displayName';'parentCode';'concept_Beschreibung';'meaning';'hints';'level';'type';'relationships'
'HIST';'1.2.40.0.34.5.99';'Methode Material Histologie';;;;;'0';'L';
'KULTUR';'1.2.40.0.34.5.99';'Methode Kultur Material';;;;;'0';'L';
'MAT1';'1.2.40.0.34.5.99';'Primary Sample';;;;;'0';'L';
'MAT2';'1.2.40.0.34.5.99';'Secondary Sample';;;;;'0';'L';
'MIKRO';'1.2.40.0.34.5.99';'Methode Mikroskopie Material';;;;;'0';'L';
'NAT';'1.2.40.0.34.5.99';'Methode NAT Material';;;;;'0';'L';
'SERO';'1.2.40.0.34.5.99';'Methode Material Serologie';;;;;'0';'L';
'VIRUS';'1.2.40.0.34.5.99';'Methode Material Virusnachweis';;;;;'0';'L';
