'code';'codeSystem';'displayName';'parentCode';'concept_Beschreibung';'meaning';'hints';'level';'type';'relationships'
'1065';'1.2.40.0.34.5.205';'Becton Dickinson, BD Veritor System for Rapid Detection of SARS CoV 2';'';'Becton Dickinson, BD Veritor System for Rapid Detection of SARS CoV 2';'Becton Dickinson, BD Veritor System for Rapid Detection of SARS CoV 2';'';'0';'L';''
'1097';'1.2.40.0.34.5.205';'Quidel Corporation, Sofia 2 SARS Antigen FIA';'';'Quidel Corporation, Sofia 2 SARS Antigen FIA';'Quidel Corporation, Sofia 2 SARS Antigen FIA';'';'0';'L';''
'1114';'1.2.40.0.34.5.205';'Sugentech, Inc., SGTi-flex COVID-19 Ag';'';'Sugentech, Inc., SGTi-flex COVID-19 Ag';'Sugentech, Inc., SGTi-flex COVID-19 Ag';'';'0';'L';''
'1144';'1.2.40.0.34.5.205';'Green Cross Medical Science Corp., GENEDIA W COVID-19 Ag';'';'Green Cross Medical Science Corp., GENEDIA W COVID-19 Ag';'Green Cross Medical Science Corp., GENEDIA W COVID-19 Ag';'';'0';'L';''
'1173';'1.2.40.0.34.5.205';'CerTest Biotec, CerTest SARS-CoV-2 Card test';'';'CerTest Biotec, CerTest SARS-CoV-2 Card test';'CerTest Biotec, CerTest SARS-CoV-2 Card test';'';'0';'L';''
'1178';'1.2.40.0.34.5.205';'Shenzhen Microprofit Biotech Co., Ltd., SARS-CoV-2 Spike Protein Test Kit (Colloidal Gold Chromatographic Immunoassay)';'';'Shenzhen Microprofit Biotech Co., Ltd., SARS-CoV-2 Spike Protein Test Kit (Colloidal Gold Chromatographic Immunoassay)';'Shenzhen Microprofit Biotech Co., Ltd., SARS-CoV-2 Spike Protein Test Kit (Colloidal Gold Chromatographic Immunoassay)';'';'0';'L';''
'1180';'1.2.40.0.34.5.205';'MEDsan GmbH, MEDsan SARS-CoV-2 Antigen Rapid Test';'';'MEDsan GmbH, MEDsan SARS-CoV-2 Antigen Rapid Test';'MEDsan GmbH, MEDsan SARS-CoV-2 Antigen Rapid Test';'';'0';'L';''
'1190';'1.2.40.0.34.5.205';'möLab, COVID-19 Rapid Antigen Test';'';'möLab, COVID-19 Rapid Antigen Test';'möLab, COVID-19 Rapid Antigen Test';'';'0';'L';''
'1197';'1.2.40.0.34.5.205';'Goldsite Diagnostic Inc., SARS-CoV-2 Antigen Kit (Colloidal Gold)';'';'Goldsite Diagnostic Inc., SARS-CoV-2 Antigen Kit (Colloidal Gold)';'Goldsite Diagnostic Inc., SARS-CoV-2 Antigen Kit (Colloidal Gold)';'';'0';'L';''
'1199';'1.2.40.0.34.5.205';'Oncosem Onkolojik Sistemler San. ve Tic. A.S., CAT';'';'Oncosem Onkolojik Sistemler San. ve Tic. A.S., CAT';'Oncosem Onkolojik Sistemler San. ve Tic. A.S., CAT';'';'0';'L';''
'1201';'1.2.40.0.34.5.205';'ScheBo Biotech AG, ScheBo SARS CoV-2 Quick Antigen';'';'ScheBo Biotech AG, ScheBo SARS CoV-2 Quick Antigen';'ScheBo Biotech AG, ScheBo SARS CoV-2 Quick Antigen';'';'0';'L';''
'1215';'1.2.40.0.34.5.205';'Hangzhou Laihe Biotech Co., LYHER Novel Coronavirus (COVID-19) Antigen Test Kit (Colloidal Gold)';'';'Hangzhou Laihe Biotech Co., LYHER Novel Coronavirus (COVID-19) Antigen Test Kit (Colloidal Gold)';'Hangzhou Laihe Biotech Co., LYHER Novel Coronavirus (COVID-19) Antigen Test Kit (Colloidal Gold)';'';'0';'L';''
'1216';'1.2.40.0.34.5.205';'Guangdong Longsee Biomedical Co., Ltd., COVID-2019-nCoV Ag Rapid TestDetection Kit(Immuno-Chromatography)';'';'Guangdong Longsee Biomedical Co., Ltd., COVID-2019-nCoV Ag Rapid TestDetection Kit(Immuno-Chromatography)';'Guangdong Longsee Biomedical Co., Ltd., COVID-2019-nCoV Ag Rapid TestDetection Kit(Immuno-Chromatography)';'';'0';'L';''
'1218';'1.2.40.0.34.5.205';'Siemens Healthineers, CLINITEST Rapid COVID-19 Antigen Test';'';'Siemens Healthineers, CLINITEST Rapid COVID-19 Antigen Test';'Siemens Healthineers, CLINITEST Rapid COVID-19 Antigen Test';'';'0';'L';''
'1223';'1.2.40.0.34.5.205';'BIOSYNEX SA , BIOSYNEX COVID-19 Ag BSS';'';'BIOSYNEX SA , BIOSYNEX COVID-19 Ag BSS';'BIOSYNEX SA , BIOSYNEX COVID-19 Ag BSS';'';'0';'L';''
'1225';'1.2.40.0.34.5.205';'DDS DIAGNOSTIC, Test Rapid Covid-19 Antigen (tampon nazofaringian)';'';'DDS DIAGNOSTIC, Test Rapid Covid-19 Antigen (tampon nazofaringian)';'DDS DIAGNOSTIC, Test Rapid Covid-19 Antigen (tampon nazofaringian)';'';'0';'L';''
'1228';'1.2.40.0.34.5.205';'Shenzhen Microprofit Biotech Co., Ltd, SARS-CoV-2 Spike Protein Test Kit (Fluorescence Immunoassay)';'';'Shenzhen Microprofit Biotech Co., Ltd, SARS-CoV-2 Spike Protein Test Kit (Fluorescence Immunoassay)';'Shenzhen Microprofit Biotech Co., Ltd, SARS-CoV-2 Spike Protein Test Kit (Fluorescence Immunoassay)';'';'0';'L';''
'1232';'1.2.40.0.34.5.205';'Abbott Rapid Diagnostics, Panbio COVID-19 Ag Rapid Test';'';'Abbott Rapid Diagnostics, Panbio COVID-19 Ag Rapid Test';'Abbott Rapid Diagnostics, Panbio COVID-19 Ag Rapid Test ';'';'0';'L';''
'1236';'1.2.40.0.34.5.205';'BTNX Inc., Rapid Response COVID-19 Antigen Rapid Test Device';'';'BTNX Inc., Rapid Response COVID-19 Antigen Rapid Test Device';'BTNX Inc., Rapid Response COVID-19 Antigen Rapid Test Device';'';'0';'L';''
'1242';'1.2.40.0.34.5.205';'BIONOTE, NowCheck COVID-19 Ag Test';'';'BIONOTE, NowCheck COVID-19 Ag Test';'BIONOTE, NowCheck COVID-19 Ag Test';'';'0';'L';''
'1243';'1.2.40.0.34.5.205';'Edinburgh Genetics Limited, Edinburgh Genetics ActivXpress+ COVID-19 Antigen Complete Testing Kit';'';'Edinburgh Genetics Limited, Edinburgh Genetics ActivXpress+ COVID-19 Antigen Complete Testing Kit';'Edinburgh Genetics Limited, Edinburgh Genetics ActivXpress+ COVID-19 Antigen Complete Testing Kit';'';'0';'L';''
'1244';'1.2.40.0.34.5.205';'GenBody Inc, GenBody COVID-19 Ag Test';'';'GenBody Inc, GenBody COVID-19 Ag Test';'GenBody Inc, GenBody COVID-19 Ag Test';'';'0';'L';''
'1253';'1.2.40.0.34.5.205';'GenSure Biotech Inc, Gensure COVID-19 Antigen Rapid Test Kit (REF: P2004) (DIA-COVID -19 Ag Rapid Test)';'';'GenSure Biotech Inc, Gensure COVID-19 Antigen Rapid Test Kit (REF: P2004) (DIA-COVID -19 Ag Rapid Test)';'GenSure Biotech Inc, Gensure COVID-19 Antigen Rapid Test Kit (REF: P2004) (DIA-COVID -19 Ag Rapid Test)';'';'0';'L';''
'1257';'1.2.40.0.34.5.205';'Hangzhou AllTest Biotech Co., Ltd, COVID-19 Antigen Rapid Test';'';'Hangzhou AllTest Biotech Co., Ltd, COVID-19 Antigen Rapid Test';'Hangzhou AllTest Biotech Co., Ltd, COVID-19 Antigen Rapid Test  ';'';'0';'L';''
'1266';'1.2.40.0.34.5.205';'Labnovation Technologies Inc., SARS-CoV-2 Antigen Rapid Test Kit';'';'Labnovation Technologies Inc., SARS-CoV-2 Antigen Rapid Test Kit';'Labnovation Technologies Inc., SARS-CoV-2 Antigen Rapid Test Kit';'';'0';'L';''
'1267';'1.2.40.0.34.5.205';'LumiQuick Diagnostics Inc., QuickProfil COVID-19 ANTIGEN Test';'';'LumiQuick Diagnostics Inc., QuickProfile? COVID-19 ANTIGEN Test';'LumiQuick Diagnostics Inc., QuickProfile? COVID-19 ANTIGEN Test';'';'0';'L';''
'1268';'1.2.40.0.34.5.205';'LumiraDX , LumiraDx SARS-CoV-2 Ag Test';'';'LumiraDX , LumiraDx SARS-CoV-2 Ag Test';'LumiraDX , LumiraDx SARS-CoV-2 Ag Test ';'';'0';'L';''
'1271';'1.2.40.0.34.5.205';'Precision Biosensor Inc., Exdia COVI-19 Ag Test';'';'Precision Biosensor Inc., Exdia COVI-19 Ag Test';'Precision Biosensor Inc., Exdia COVI-19 Ag Test';'';'0';'L';''
'1276';'1.2.40.0.34.5.205';'Willi Fox GmbH, Willi Fox COVID-19 Antigen rapid test';'';'Willi Fox GmbH, Willi Fox COVID-19 Antigen rapid test';'Willi Fox GmbH, Willi Fox COVID-19 Antigen rapid test';'';'0';'L';''
'1278';'1.2.40.0.34.5.205';'Xiamen Boson Biotech Co, Rapid SARS-CoV-2 Antigen Test card';'';'Xiamen Boson Biotech Co, Rapid SARS-CoV-2 Antigen Test card';'Xiamen Boson Biotech Co, Rapid SARS-CoV-2 Antigen Test card ';'';'0';'L';''
'1286';'1.2.40.0.34.5.205';'BIOHIT HealthCcare (Hefei) Co., Ltd., SARS-CoV-2 Antigen Rapid Test Kit (Fluorescence Immunochromatography)';'';'BIOHIT HealthCcare (Hefei) Co., Ltd., SARS-CoV-2 Antigen Rapid Test Kit (Fluorescence Immunochromatography)';'BIOHIT HealthCcare (Hefei) Co., Ltd., SARS-CoV-2 Antigen Rapid Test Kit (Fluorescence Immunochromatography)';'';'0';'L';''
'1295';'1.2.40.0.34.5.205';'Zhejiang Anji Saianfu Biotech Co.., Ltd., reOpenTest COVID-19  Antigen Rapid Test';'';'Zhejiang Anji Saianfu Biotech Co.., Ltd., reOpenTest COVID-19  Antigen Rapid Test';'Zhejiang Anji Saianfu Biotech Co.., Ltd., reOpenTest COVID-19  Antigen Rapid Test';'';'0';'L';''
'1296';'1.2.40.0.34.5.205';'Zhejiang Anji Saianfu Biotech Co.., Ltd., AndLucky COVID-19 Antigen Rapid Test';'';'Zhejiang Anji Saianfu Biotech Co.., Ltd., AndLucky COVID-19 Antigen Rapid Test';'Zhejiang Anji Saianfu Biotech Co.., Ltd., AndLucky COVID-19 Antigen Rapid Test';'';'0';'L';''
'1304';'1.2.40.0.34.5.205';'AMEDA Labordiagnostik GmbH, AMP Rapid Test SARS-CoV-2 Ag';'';'AMEDA Labordiagnostik GmbH, AMP Rapid Test SARS-CoV-2 Ag';'AMEDA Labordiagnostik GmbH, AMP Rapid Test SARS-CoV-2 Ag';'';'0';'L';''
'1319';'1.2.40.0.34.5.205';'SGA Medikal, V-Chek SARS-CoV2- Rapid Ag Tets (Coloidal Gold)';'';'SGA Medikal, V-Chek SARS-CoV2- Rapid Ag Tets (Coloidal Gold)';'SGA Medikal, V-Chek SARS-CoV2- Rapid Ag Tets (Coloidal Gold)';'';'0';'L';''
'1331';'1.2.40.0.34.5.205';'Beijing Lepu Medical Technology, SARS-CoV-2 Antigen Rapid Test Kit (Colloidal Gold immunochromatography)';'';'Beijing Lepu Medical Technology, SARS-CoV-2 Antigen Rapid Test Kit (Colloidal Gold immunochromatography)';'Beijing Lepu Medical Technology, SARS-CoV-2 Antigen Rapid Test Kit (Colloidal Gold immunochromatography)';'';'0';'L';''
'1333';'1.2.40.0.34.5.205';'Joinstar Biomedical Technology Co. Ltd, COVID-19 Antigen Rapid Test (Colloidal Gold)';'';'Joinstar Biomedical Technology Co. Ltd, COVID-19 Antigen Rapid Test (Colloidal Gold)';'Joinstar Biomedical Technology Co. Ltd, COVID-19 Antigen Rapid Test (Colloidal Gold)';'';'0';'L';''
'1341';'1.2.40.0.34.5.205';'Qingdao Hightop Biotech Co. Ltd, SARS-CoV-2 Antigen Rapid Test';'';'Qingdao Hightop Biotech Co. Ltd, SARS-CoV-2 Antigen Rapid Test';'Qingdao Hightop Biotech Co. Ltd, SARS-CoV-2 Antigen Rapid Test';'';'0';'L';''
'1343';'1.2.40.0.34.5.205';'Zhejiang Orient Gene Biotech Co., Ltd, Coronavirus Ag Rapid Test Cassette (Swab)';'';'Zhejiang Orient Gene Biotech Co., Ltd, Coronavirus Ag Rapid Test Cassette (Swab)';'Zhejiang Orient Gene Biotech Co., Ltd, Coronavirus Ag Rapid Test Cassette (Swab)';'';'0';'L';''
'1347';'1.2.40.0.34.5.205';'Shenzhen YHLO Biotech Co., Ltd., GLINE-2019-nCoV Ag';'';'Shenzhen YHLO Biotech Co., Ltd., GLINE-2019-nCoV Ag';'Shenzhen YHLO Biotech Co., Ltd., GLINE-2019-nCoV Ag';'';'0';'L';''
'1353';'1.2.40.0.34.5.205';'LINKCARE (NANTONG DIAGNOS BIO), COVID-19 Antigen Test Kit (Colloidal Gold)';'';'LINKCARE (NANTONG DIAGNOS BIO), COVID-19 Antigen Test Kit (Colloidal Gold)';'LINKCARE (NANTONG DIAGNOS BIO), COVID-19 Antigen Test Kit (Colloidal Gold)';'';'0';'L';''
'1357';'1.2.40.0.34.5.205';'SGA Medikal, V-Chek SARS-CoV-2 Rapid Ag Test (colloidal gold)';'';'SGA Medikal, V-Chek SARS-CoV-2 Rapid Ag Test (colloidal gold)';'SGA Medikal, V-Chek SARS-CoV-2 Rapid Ag Test (colloidal gold)';'';'0';'L';''
'1360';'1.2.40.0.34.5.205';'Guangdong Wesail Biotech Co. Ltd, COVID-19 AG Test Kit';'';'Guangdong Wesail Biotech Co. Ltd, COVID-19 AG Test Kit';'Guangdong Wesail Biotech Co. Ltd, COVID-19 AG Test Kit ';'';'0';'L';''
'1363';'1.2.40.0.34.5.205';'Hangzhou Clongene Biotech Co., Ltd., COVID-19 Antigen Rapid Test Kit';'';'Hangzhou Clongene Biotech Co., Ltd., COVID-19 Antigen Rapid Test Kit';'Hangzhou Clongene Biotech Co., Ltd., COVID-19 Antigen Rapid Test Kit';'';'0';'L';''
'1365';'1.2.40.0.34.5.205';'Hangzhou Clongene Biotech Co., Ltd., COVID-19/Influenza A+B Antigen Combo Rapid Test';'';'Hangzhou Clongene Biotech Co., Ltd., COVID-19/Influenza A+B Antigen Combo Rapid Test';'Hangzhou Clongene Biotech Co., Ltd., COVID-19/Influenza A+B Antigen Combo Rapid Test';'';'0';'L';''
'1375';'1.2.40.0.34.5.205';'DIALAB GmbH, DIAQUICK COVID -19 Ag Cassette';'';'DIALAB GmbH, DIAQUICK COVID -19 Ag Cassette';'DIALAB GmbH, DIAQUICK COVID -19 Ag Cassette';'';'0';'L';''
'1392';'1.2.40.0.34.5.205';'Hangzhou Testsea Biotechnology Co., Ltd., Testsealabs Covid-19 Antigen Rapid Test Cassette';'';'Hangzhou Testsea Biotechnology Co., Ltd., Testsealabs Covid-19 Antigen Rapid Test Cassette';'Hangzhou Testsea Biotechnology Co., Ltd., Testsealabs Covid-19 Antigen Rapid Test Cassette';'';'0';'L';''
'1443';'1.2.40.0.34.5.205';'Vitrosens Biotechnology Co. Ltd, RapidFor SARS-CoV-2 Ag Test Kit';'';'Vitrosens Biotechnology Co. Ltd, RapidFor SARS-CoV-2 Ag Test Kit';'Vitrosens Biotechnology Co. Ltd, RapidFor SARS-CoV-2 Ag Test Kit';'';'0';'L';''
'1457';'1.2.40.0.34.5.205';'Acon Biotech (Hangzhou) Co., Ltd, SARS-CoV-2 Antigen Rapid Test';'';'Acon Biotech (Hangzhou) Co., Ltd, SARS-CoV-2 Antigen Rapid Test';'Acon Biotech (Hangzhou) Co., Ltd, SARS-CoV-2 Antigen Rapid Test';'';'0';'L';''
'1465';'1.2.40.0.34.5.205';'Triplex International Biosciences Co., Ltd, China, SARS-CoV-2 Antigen Rapid Test Kit';'';'Triplex International Biosciences Co., Ltd, China, SARS-CoV-2 Antigen Rapid Test Kit';'Triplex International Biosciences Co., Ltd, China, SARS-CoV-2 Antigen Rapid Test Kit';'';'0';'L';''
'1466';'1.2.40.0.34.5.205';'TODA PHARMA, TODA CORONADIAG Ag';'';'TODA PHARMA, TODA CORONADIAG Ag';'TODA PHARMA, TODA CORONADIAG Ag';'';'0';'L';''
'1468';'1.2.40.0.34.5.205';'ACON Laboratories, Inc, Flowflex SARS-CoV-2 Antigen Rapid Test';'';'ACON Laboratories, Inc, Flowflex SARS-CoV-2 Antigen Rapid Test';'ACON Laboratories, Inc, Flowflex SARS-CoV-2 Antigen Rapid Test ';'';'0';'L';''
'1481';'1.2.40.0.34.5.205';'MP Biomedicals , Rapid SARS-CoV-2 Antigen Test Card';'';'MP Biomedicals , Rapid SARS-CoV-2 Antigen Test Card';'MP Biomedicals , Rapid SARS-CoV-2 Antigen Test Card';'';'0';'L';''
'1485';'1.2.40.0.34.5.205';'Beijing Wantai Biological Pharmacy Enterprise Co., Ltd, Wantai SARS-CoV-2 Ag Rapid Test (colloidal gold)';'';'Beijing Wantai Biological Pharmacy Enterprise Co., Ltd, Wantai SARS-CoV-2 Ag Rapid Test (colloidal gold)';'Beijing Wantai Biological Pharmacy Enterprise Co., Ltd, Wantai SARS-CoV-2 Ag Rapid Test (colloidal gold)';'';'0';'L';''
'1489';'1.2.40.0.34.5.205';'Safecare Biotech Hangzhou Co, COVID-19 Antigen Rapid Test Kit (Swab)';'';'Safecare Biotech Hangzhou Co, COVID-19 Antigen Rapid Test Kit (Swab)';'Safecare Biotech Hangzhou Co, COVID-19 Antigen Rapid Test Kit (Swab)';'';'0';'L';''
'1490';'1.2.40.0.34.5.205';'Safecare Biotech Hangzhou Co, Multi-Respiratory Virus Antigen Test Kit (Swab) (Influenza A+B/COVID-19)';'';'Safecare Biotech Hangzhou Co, Multi-Respiratory Virus Antigen Test Kit (Swab) (Influenza A+B/COVID-19)';'Safecare Biotech Hangzhou Co, Multi-Respiratory Virus Antigen Test Kit (Swab) (Influenza A+B/COVID-19)';'';'0';'L';''
'1494';'1.2.40.0.34.5.205';'BIOSYNEX SA, BIOSYNEX COVID-19 Ag+ BSS';'';'BIOSYNEX SA, BIOSYNEX COVID-19 Ag+ BSS';'BIOSYNEX SA, BIOSYNEX COVID-19 Ag+ BSS';'';'0';'L';''
'1495';'1.2.40.0.34.5.205';'Prognosis Biotech, Rapid Test Ag 2019-nCov';'';'Prognosis Biotech, Rapid Test Ag 2019-nCov';'Prognosis Biotech, Rapid Test Ag 2019-nCov';'';'0';'L';''
'1501';'1.2.40.0.34.5.205';'New Gene (Hangzhou) Bioengineering Co., Ltd., COVID-19 Antigen Detection Kit';'';'New Gene (Hangzhou) Bioengineering Co., Ltd., COVID-19 Antigen Detection Kit';'New Gene (Hangzhou) Bioengineering Co., Ltd., COVID-19 Antigen Detection Kit';'';'0';'L';''
'1573';'1.2.40.0.34.5.205';'Nantong Egens Biotechnology Co.,Ltd, COVID-19 Antigen Rapid Test Kit';'';'Nantong Egens Biotechnology Co.,Ltd, COVID-19 Antigen Rapid Test Kit';'Nantong Egens Biotechnology Co.,Ltd, COVID-19 Antigen Rapid Test Kit';'';'0';'L';''
'1581';'1.2.40.0.34.5.205';'CTK Biotech, Inc, OnSite COVID-19 Ag Rapid Test';'';'CTK Biotech, Inc, OnSite COVID-19 Ag Rapid Test';'CTK Biotech, Inc, OnSite COVID-19 Ag Rapid Test';'';'0';'L';''
'1592';'1.2.40.0.34.5.205';'Shenzhen Lifotronic Technology Co., Ltd., Antigen Rapid Test Ag SARS-CoV-2';'';'Shenzhen Lifotronic Technology Co., Ltd., Antigen Rapid Test Ag SARS-CoV-2';'Shenzhen Lifotronic Technology Co., Ltd., Antigen Rapid Test Ag SARS-CoV-2';'';'0';'L';''
'1593';'1.2.40.0.34.5.205';'OSANG Healthcare Co., Ltd., GeneFinder COVID-19 Ag Rapid Test';'';'OSANG Healthcare Co., Ltd., GeneFinder COVID-19 Ag Rapid Test';'OSANG Healthcare Co., Ltd., GeneFinder COVID-19 Ag Rapid Test';'';'0';'L';''
'1599';'1.2.40.0.34.5.205';'Biomerica Inc., Biomerica COVID-19 Antigen Rapid Test (nasopharyngeal swab)';'';'Biomerica Inc., Biomerica COVID-19 Antigen Rapid Test (nasopharyngeal swab)';'Biomerica Inc., Biomerica COVID-19 Antigen Rapid Test (nasopharyngeal swab)';'';'0';'L';''
'1604';'1.2.40.0.34.5.205';'Roche (SD BIOSENSOR), SARS-CoV-2 Antigen Rapid Test';'';'Roche (SD BIOSENSOR), SARS-CoV-2 Antigen Rapid Test';'Roche (SD BIOSENSOR), SARS-CoV-2 Antigen Rapid Test';'';'0';'L';''
'1610';'1.2.40.0.34.5.205';'Hangzhou Clongene Biotech Co., Ltd, COVID-19 Antigen Rapid Test Casette';'';'Hangzhou Clongene Biotech Co., Ltd, COVID-19 Antigen Rapid Test Casette';'Hangzhou Clongene Biotech Co., Ltd, COVID-19 Antigen Rapid Test Casette';'';'0';'L';''
'1618';'1.2.40.0.34.5.205';'Artron Laboratories Inc., Artron COVID-19 Antigen Test';'';'Artron Laboratories Inc., Artron COVID-19 Antigen Test';'Artron Laboratories Inc., Artron COVID-19 Antigen Test';'';'0';'L';''
'1647';'1.2.40.0.34.5.205';'CALTH Inc., AllCheck COVID19 Ag';'';'CALTH Inc., AllCheck COVID19 Ag';'CALTH Inc., AllCheck COVID19 Ag';'';'0';'L';''
'1654';'1.2.40.0.34.5.205';'Asan Pharmaceutical CO., LTD, Asan Easy Test COVID-19 Ag';'';'Asan Pharmaceutical CO., LTD, Asan Easy Test COVID-19 Ag';'Asan Pharmaceutical CO., LTD, Asan Easy Test COVID-19 Ag';'';'0';'L';''
'1689';'1.2.40.0.34.5.205';'TÜRKLAB TIBBI MALZEMELER SAN. ve TIC. A.S., Covid-19 Ag Test';'';'TÜRKLAB TIBBI MALZEMELER SAN. ve TIC. A.S., Covid-19 Ag Test';'TÜRKLAB TIBBI MALZEMELER SAN. ve TIC. A.S., Covid-19 Ag Test';'';'0';'L';''
'1691';'1.2.40.0.34.5.205';'Chil Tibbi Malzeme Sanayi ve Ticaret Limited Sirketi, CHIL COVID-19 Antigen Rapid Test (Nasopharyngeal / Oropharyngeal Swab-Casette)';'';'Chil T?bbi Malzeme Sanayi ve Ticaret Limited Sirketi, CHIL COVID-19 Antigen Rapid Test (Nasopharyngeal / Oropharyngeal Swab-Casette)';'Chil T?bbi Malzeme Sanayi ve Ticaret Limited Sirketi, CHIL COVID-19 Antigen Rapid Test (Nasopharyngeal / Oropharyngeal Swab-Casette)';'';'0';'L';''
'1722';'1.2.40.0.34.5.205';'TÜRKLAB TIBBI MALZEMELER SAN. ve TIC. A.S., TOYO Covid-19 Ag Tes';'';'TÜRKLAB TIBBI MALZEMELER SAN. ve TIC. A.S., TOYO Covid-19 Ag Tes';'TÜRKLAB TIBBI MALZEMELER SAN. ve TIC. A.S., TOYO Covid-19 Ag Tes';'';'0';'L';''
'1736';'1.2.40.0.34.5.205';'Anhui Deep Blue Medical Technology Co. Ltd, COVID-19 (SARS-CoV-2) Antigen Test Kit (Colloidal Gold)';'';'Anhui Deep Blue Medical Technology Co. Ltd, COVID-19 (SARS-CoV-2) Antigen Test Kit (Colloidal Gold)';'Anhui Deep Blue Medical Technology Co. Ltd, COVID-19 (SARS-CoV-2) Antigen Test Kit (Colloidal Gold)';'';'0';'L';''
'1739';'1.2.40.0.34.5.205';'Eurobio Scientific, EBS SARS-CoV-2 Ag Rapid Test';'';'Eurobio Scientific, EBS SARS-CoV-2 Ag Rapid Test';'Eurobio Scientific, EBS SARS-CoV-2 Ag Rapid Test';'';'0';'L';''
'1747';'1.2.40.0.34.5.205';'Guangdong Hecin Scientific, Inc., 2019-nCoV Antigen Test Kit (colloidal gold method)';'';'Guangdong Hecin Scientific, Inc., 2019-nCoV Antigen Test Kit (colloidal gold method)';'Guangdong Hecin Scientific, Inc., 2019-nCoV Antigen Test Kit (colloidal gold method)';'';'0';'L';''
'1751';'1.2.40.0.34.5.205';'TÜRKLAB TIBBI MALZEMELER SAN. ve TIC. A.S., RAPIDAN TESTER Covid-19 Ag Test';'';'TÜRKLAB TIBBI MALZEMELER SAN. ve TIC. A.S., RAPIDAN TESTER Covid-19 Ag Test';'TÜRKLAB TIBBI MALZEMELER SAN. ve TIC. A.S., RAPIDAN TESTER Covid-19 Ag Test';'';'0';'L';''
'1759';'1.2.40.0.34.5.205';'Hubei Jinjian Biology Co., Ltd, SARS-CoV-2 Antigen Test Kit';'';'Hubei Jinjian Biology Co., Ltd, SARS-CoV-2 Antigen Test Kit';'Hubei Jinjian Biology Co., Ltd, SARS-CoV-2 Antigen Test Kit';'';'0';'L';''
'1762';'1.2.40.0.34.5.205';'Novatech, SARS-CoV-2 Antigen Rapid Test';'';'Novatech, SARS-CoV-2 Antigen Rapid Test';'Novatech, SARS-CoV-2 Antigen Rapid Test';'';'0';'L';''
'1763';'1.2.40.0.34.5.205';'Xiamen AmonMed Biotechnology Co., Ltd., COVID-19 Antigen Rapid Test Kit (Colloidal Gold)';'';'Xiamen AmonMed Biotechnology Co., Ltd., COVID-19 Antigen Rapid Test Kit (Colloidal Gold)';'Xiamen AmonMed Biotechnology Co., Ltd., COVID-19 Antigen Rapid Test Kit (Colloidal Gold)  ';'';'0';'L';''
'1764';'1.2.40.0.34.5.205';'JOYSBIO (Tianjin) Biotechnology Co., Ltd., SARS-CoV-2 Antigen Rapid Test Kit (Colloidal Gold immunochromatography)';'';'JOYSBIO (Tianjin) Biotechnology Co., Ltd., SARS-CoV-2 Antigen Rapid Test Kit (Colloidal Gold immunochromatography)';'JOYSBIO (Tianjin) Biotechnology Co., Ltd., SARS-CoV-2 Antigen Rapid Test Kit (Colloidal Gold immunochromatography)';'';'0';'L';''
'1767';'1.2.40.0.34.5.205';'Healgen Scientific Limited, Coronavirus Ag Rapid Test Cassette (Swab)';'';'Healgen Scientific Limited, Coronavirus Ag Rapid Test Cassette (Swab)';'Healgen Scientific Limited, Coronavirus Ag Rapid Test Cassette (Swab)';'';'0';'L';''
'1768';'1.2.40.0.34.5.205';'Shenzhen Watmind Medical Co., Ltd, SARS-CoV-2 Ag Diagnostic Test Kit (Immuno-fluorescence)';'';'Shenzhen Watmind Medical Co., Ltd, SARS-CoV-2 Ag Diagnostic Test Kit (Immuno-fluorescence)';'Shenzhen Watmind Medical Co., Ltd, SARS-CoV-2 Ag Diagnostic Test Kit (Immuno-fluorescence)';'';'0';'L';''
'1769';'1.2.40.0.34.5.205';'Shenzhen Watmind Medical Co., Ltd, SARS-CoV-2 Ag Diagnostic Test Kit (Colloidal Gold)';'';'Shenzhen Watmind Medical Co., Ltd, SARS-CoV-2 Ag Diagnostic Test Kit (Colloidal Gold)';'Shenzhen Watmind Medical Co., Ltd, SARS-CoV-2 Ag Diagnostic Test Kit (Colloidal Gold)';'';'0';'L';''
'1773';'1.2.40.0.34.5.205';'Wuhan Life Origin Biotech Joint Stock Co., Ltd., SARS-CoV-2 Antigen Assay Kit (Immunochromatography)';'';'Wuhan Life Origin Biotech Joint Stock Co., Ltd., SARS-CoV-2 Antigen Assay Kit (Immunochromatography)';'Wuhan Life Origin Biotech Joint Stock Co., Ltd., SARS-CoV-2 Antigen Assay Kit (Immunochromatography)';'';'0';'L';''
'1775';'1.2.40.0.34.5.205';'MEXACARE GmbH, MEXACARE COVID-19 Antigen Rapid Test';'';'MEXACARE GmbH, MEXACARE COVID-19 Antigen Rapid Test';'MEXACARE GmbH, MEXACARE COVID-19 Antigen Rapid Test';'';'0';'L';''
'1778';'1.2.40.0.34.5.205';'Beijing Kewei Clinical Diagnostic Reagent Inc, COVID19 Antigen Rapid Test Kit';'';'Beijing Kewei Clinical Diagnostic Reagent Inc, COVID19 Antigen Rapid Test Kit';'Beijing Kewei Clinical Diagnostic Reagent Inc, COVID19 Antigen Rapid Test Kit';'';'0';'L';''
'1780';'1.2.40.0.34.5.205';'Spring Healthcare Services AG, SARS-Cov-2 Antigen Rapid Test Cassette (swab)';'';'Spring Healthcare Services AG, SARS-Cov-2 Antigen Rapid Test Cassette (swab)';'Spring Healthcare Services AG, SARS-Cov-2 Antigen Rapid Test Cassette (swab)';'';'0';'L';''
'1783';'1.2.40.0.34.5.205';'InTec PRODUCTS, INC, Rapid SARS-CoV-2 Antigen Test (nasopharyngeal/nasal specimen)';'';'InTec PRODUCTS, INC, Rapid SARS-CoV-2 Antigen Test (nasopharyngeal/nasal specimen)';'InTec PRODUCTS, INC, Rapid SARS-CoV-2 Antigen Test (nasopharyngeal/nasal specimen)';'';'0';'L';''
'1791';'1.2.40.0.34.5.205';'Immunospark s.r.l., Rapid SARS-Cov2 Antigen Test';'';'Immunospark s.r.l., Rapid SARS-Cov2 Antigen Test';'Immunospark s.r.l., Rapid SARS-Cov2 Antigen Test';'';'0';'L';''
'1800';'1.2.40.0.34.5.205';'Avalun, Ksmart SARS-COV2 Antigen Rapid Test';'';'Avalun, Ksmart SARS-COV2 Antigen Rapid Test';'Avalun, Ksmart SARS-COV2 Antigen Rapid Test';'';'0';'L';''
'1801';'1.2.40.0.34.5.205';'Innova Medical Group.Inc, Innova SARS-CoV-2 Antigen Rapid Qualitative Test';'';'Innova Medical Group.Inc, Innova SARS-CoV-2 Antigen Rapid Qualitative Test';'Innova Medical Group.Inc, Innova SARS-CoV-2 Antigen Rapid Qualitative Test';'';'0';'L';''
'1813';'1.2.40.0.34.5.205';'Shenzhen Kisshealth Biotechnology Co., Ltd, SARS-CoV-2 Antigen Test Kit (GICA)';'';'Shenzhen Kisshealth Biotechnology Co., Ltd, SARS-CoV-2 Antigen Test Kit (GICA)';'Shenzhen Kisshealth Biotechnology Co., Ltd, SARS-CoV-2 Antigen Test Kit (GICA)';'';'0';'L';''
'1815';'1.2.40.0.34.5.205';'Anhui DeepBlue Medical Technology Co. Ltd, COVID-19 (SARS-CoV-2) Antigen Test Kit (Colloidal Gold) ? Nasal swab';'';'Anhui DeepBlue Medical Technology Co. Ltd, COVID-19 (SARS-CoV-2) Antigen Test Kit (Colloidal Gold) ? Nasal swab';'Anhui DeepBlue Medical Technology Co. Ltd, COVID-19 (SARS-CoV-2) Antigen Test Kit (Colloidal Gold) ? Nasal swab';'';'0';'L';''
'1820';'1.2.40.0.34.5.205';'Getein Biotech, Inc, SARS-CoV-2 Antigen (Colloidal Gold)';'';'Getein Biotech, Inc, SARS-CoV-2 Antigen (Colloidal Gold)';'Getein Biotech, Inc, SARS-CoV-2 Antigen (Colloidal Gold)';'';'0';'L';''
'1822';'1.2.40.0.34.5.205';'Anbio (Xiamen) Biotechnology Co., Ltd., Rapid COVID-19 Antigen-Test (colloidal Gold)';'';'Anbio (Xiamen) Biotechnology Co., Ltd., Rapid COVID-19 Antigen-Test (colloidal Gold)';'Anbio (Xiamen) Biotechnology Co., Ltd., Rapid COVID-19 Antigen-Test (colloidal Gold)';'';'0';'L';''
'1833';'1.2.40.0.34.5.205';'AAZ-LMB, COVID-VIRO Rapid antigen test COVID-19';'';'AAZ-LMB, COVID-VIRO Rapid antigen test COVID-19';'AAZ-LMB, COVID-VIRO Rapid antigen test COVID-19';'';'0';'L';''
'1855';'1.2.40.0.34.5.205';'GA Generic Assays GmbH, GA CoV-2 Antigen Rapid Test';'';'GA Generic Assays GmbH, GA CoV-2 Antigen Rapid Test';'GA Generic Assays GmbH, GA CoV-2 Antigen Rapid Test';'';'0';'L';''
'1865';'1.2.40.0.34.5.205';'ACON Biotech(Hangzhou) Co., Ltd., Flowflex SARS-CoV-2 Antigen Rapid Test (Nasal/Saliva)';'';'ACON Biotech(Hangzhou) Co., Ltd., Flowflex SARS-CoV-2 Antigen Rapid Test (Nasal/Saliva)';'ACON Biotech(Hangzhou) Co., Ltd., Flowflex SARS-CoV-2 Antigen Rapid Test (Nasal/Saliva)';'';'0';'L';''
'1870';'1.2.40.0.34.5.205';'Beijing Hotgen Biotech Co., Ltd., Novel Coronavirus 2019-nCoV Antigen Test (Colloidal Gold)';'';'Beijing Hotgen Biotech Co., Ltd., Novel Coronavirus 2019-nCoV Antigen Test (Colloidal Gold)';'Beijing Hotgen Biotech Co., Ltd., Novel Coronavirus 2019-nCoV Antigen Test (Colloidal Gold)';'';'0';'L';''
'1876';'1.2.40.0.34.5.205';'Hangzhou Biotest Biotech Co., Ltd, COVID-19 Antigen Rapid Test Cassette(Nasal Swab)';'';'Hangzhou Biotest Biotech Co., Ltd, COVID-19 Antigen Rapid Test Cassette(Nasal Swab)';'Hangzhou Biotest Biotech Co., Ltd, COVID-19 Antigen Rapid Test Cassette(Nasal Swab)';'';'0';'L';''
'1880';'1.2.40.0.34.5.205';'NG Biotech, Ninonasal';'';'NG Biotech, Ninonasal';'NG Biotech, Ninonasal';'';'0';'L';''
'1899';'1.2.40.0.34.5.205';'Jiangsu Konsung Bio-Medical Science and Technology Co., H+W_COVID-19 Antigen Rapid Test Kit (Colloidal Gold)';'';'Jiangsu Konsung Bio-Medical Science and Technology Co., H+W_COVID-19 Antigen Rapid Test Kit (Colloidal Gold)';'Jiangsu Konsung Bio-Medical Science and Technology Co., H+W_COVID-19 Antigen Rapid Test Kit (Colloidal Gold)';'';'0';'L';''
'1902';'1.2.40.0.34.5.205';'Zhuhai Encode Medical Engineering Co.,Ltd, ENCODE SARS-COV-2 Antigen Rapid Test Device';'';'Zhuhai Encode Medical Engineering Co.,Ltd, ENCODE SARS-COV-2 Antigen Rapid Test Device';'Zhuhai Encode Medical Engineering Co.,Ltd, ENCODE SARS-COV-2 Antigen Rapid Test Device';'';'0';'L';''
'1920';'1.2.40.0.34.5.205';'Jiangsu Diagnostics Biotechnology Co., Ltd, COVID-19 Antigen Rapid Test Cassette (Colloidal Gold)';'';'Jiangsu Diagnostics Biotechnology Co., Ltd, COVID-19 Antigen Rapid Test Cassette (Colloidal Gold)';'Jiangsu Diagnostics Biotechnology Co., Ltd, COVID-19 Antigen Rapid Test Cassette (Colloidal Gold)';'';'0';'L';''
'1926';'1.2.40.0.34.5.205';'ARISTA Biotech Pte.LTD., ARISTA COVID-19 Antigen Rapid Test';'';'ARISTA Biotech Pte.LTD., ARISTA COVID-19 Antigen Rapid Test';'ARISTA Biotech Pte.LTD., ARISTA COVID-19 Antigen Rapid Test';'';'0';'L';''
'1929';'1.2.40.0.34.5.205';'Hoyotek Biomedical Co.,Ltd., Corona Virus (COVID-19) Antigen Rapid Test (Colloidal Gold)';'';'Hoyotek Biomedical Co.,Ltd., Corona Virus (COVID-19) Antigen Rapid Test (Colloidal Gold)';'Hoyotek Biomedical Co.,Ltd., Corona Virus (COVID-19) Antigen Rapid Test (Colloidal Gold)';'';'0';'L';''
'1942';'1.2.40.0.34.5.205';'Surge Medical Inc., COVID-19 Antigen Test Kit';'';'Surge Medical Inc., COVID-19 Antigen Test Kit';'Surge Medical Inc., COVID-19 Antigen Test Kit';'';'0';'L';''
'1945';'1.2.40.0.34.5.205';'Hangzhou Sejoy Electronics & Instruments Co.Ltd, SARS-CoV-2 Antigen Rapid Test Cassette';'';'Hangzhou Sejoy Electronics & Instruments Co.Ltd, SARS-CoV-2 Antigen Rapid Test Cassette';'Hangzhou Sejoy Electronics & Instruments Co.Ltd, SARS-CoV-2 Antigen Rapid Test Cassette';'';'0';'L';''
'1952';'1.2.40.0.34.5.205';'Hangzhou Sejoy Electronics & Instruments Co.Ltd, SARS-CoV-2 Antigen Rapid Test Cassette (nasal, nasopharyngeal, oropharyngeal, saliva)';'';'Hangzhou Sejoy Electronics & Instruments Co.Ltd, SARS-CoV-2 Antigen Rapid Test Cassette (nasal, nasopharyngeal, oropharyngeal, saliva)';'Hangzhou Sejoy Electronics & Instruments Co.Ltd, SARS-CoV-2 Antigen Rapid Test Cassette (nasal, nasopharyngeal, oropharyngeal, saliva)';'';'0';'L';''
'1957';'1.2.40.0.34.5.205';'Zhuhai Lituo Biotechnology Co., Ltd., COVID-19 Antigen Detection Kit (Colloidal Gold)';'';'Zhuhai Lituo Biotechnology Co., Ltd., COVID-19 Antigen Detection Kit (Colloidal Gold)';'Zhuhai Lituo Biotechnology Co., Ltd., COVID-19 Antigen Detection Kit (Colloidal Gold)';'';'0';'L';''
'1967';'1.2.40.0.34.5.205';'Shenzhen Microprofit Biotech Co., Ltd, SARS-CoV-2 Antigen Test Kit (Colloidal Gold Chromatographic Immunoassay)';'';'Shenzhen Microprofit Biotech Co., Ltd, SARS-CoV-2 Antigen Test Kit (Colloidal Gold Chromatographic Immunoassay)';'Shenzhen Microprofit Biotech Co., Ltd, SARS-CoV-2 Antigen Test Kit (Colloidal Gold Chromatographic Immunoassay)';'';'0';'L';''
'1988';'1.2.40.0.34.5.205';'Inzek International Trading B.V., Biozek covid-19 Antigen Rapidtest BCOV-502';'';'Inzek International Trading B.V., Biozek covid-19 Antigen Rapidtest BCOV-502';'Inzek International Trading B.V., Biozek covid-19 Antigen Rapidtest BCOV-502';'';'0';'L';''
'1989';'1.2.40.0.34.5.205';'Boditech Med Inc, AFIAS COVID-19 Ag';'';'Boditech Med Inc, AFIAS COVID-19 Ag';'Boditech Med Inc, AFIAS COVID-19 Ag';'';'0';'L';''
'2006';'1.2.40.0.34.5.205';'Jiangsu Medomics medical technology Co.,Ltd., SARS-CoV-2 antigen Test Kit (LFIA)';'';'Jiangsu Medomics medical technology Co.,Ltd., SARS-CoV-2 antigen Test Kit (LFIA)';'Jiangsu Medomics medical technology Co.,Ltd., SARS-CoV-2 antigen Test Kit (LFIA)';'';'0';'L';''
'2012';'1.2.40.0.34.5.205';'Genrui Biotech Inc, SARS-CoV-2 Antigen Test Kit (Colloidal Gold)';'';'Genrui Biotech Inc, SARS-CoV-2 Antigen Test Kit (Colloidal Gold)';'Genrui Biotech Inc, SARS-CoV-2 Antigen Test Kit (Colloidal Gold)';'';'0';'L';''
'2013';'1.2.40.0.34.5.205';'Biotical Health S.L.U.BIOTICAL HEALTH S.L.U, biotical SARS-CoV-2 Ag Card';'';'Biotical Health S.L.U.BIOTICAL HEALTH S.L.U, biotical SARS-CoV-2 Ag Card';'Biotical Health S.L.U.BIOTICAL HEALTH S.L.U, biotical SARS-CoV-2 Ag Card';'';'0';'L';''
'2017';'1.2.40.0.34.5.205';'Shenzen Ultra-Diagnostics Biotec Co., SARS-CoV-2 Antigen test Kit (colloidal gold)';'';'Shenzen Ultra-Diagnostics Biotec Co., SARS-CoV-2 Antigen test Kit (colloidal gold)';'Shenzen Ultra-Diagnostics Biotec Co., SARS-CoV-2 Antigen test Kit (colloidal gold)';'';'0';'L';''
'2026';'1.2.40.0.34.5.205';'Shenzhen Reagent Technology Co.,Ltd, SARS-CoV-2 antigen IVD kit SWAB';'';'Shenzhen Reagent Technology Co.,Ltd, SARS-CoV-2 antigen IVD kit SWAB';'Shenzhen Reagent Technology Co.,Ltd, SARS-CoV-2 antigen IVD kit SWAB';'';'0';'L';''
'2029';'1.2.40.0.34.5.205';'Merlin Biomedical (Xiamen) Co., Ltd., SARS-CoV-2 Antigen Rapid Test Cassette';'';'Merlin Biomedical (Xiamen) Co., Ltd., SARS-CoV-2 Antigen Rapid Test Cassette';'Merlin Biomedical (Xiamen) Co., Ltd., SARS-CoV-2 Antigen Rapid Test Cassette';'';'0';'L';''
'2031';'1.2.40.0.34.5.205';'BIO-RAD, CORONAVIRUS AG RAPID TEST CASSETTE';'';'BIO-RAD, CORONAVIRUS AG RAPID TEST CASSETTE';'BIO-RAD, CORONAVIRUS AG RAPID TEST CASSETTE';'';'0';'L';''
'2035';'1.2.40.0.34.5.205';'BioMaxima SA, SARS-CoV-2 Ag Rapid Test';'';'BioMaxima SA, SARS-CoV-2 Ag Rapid Test';'BioMaxima SA, SARS-CoV-2 Ag Rapid Test';'';'0';'L';''
'2038';'1.2.40.0.34.5.205';'Koch Biotechnology (Beijing) Co., Ltd, COVID-19 Antigen Rapid Test Kit';'';'Koch Biotechnology (Beijing) Co., Ltd, COVID-19 Antigen Rapid Test Kit';'Koch Biotechnology (Beijing) Co., Ltd, COVID-19 Antigen Rapid Test Kit ';'';'0';'L';''
'2052';'1.2.40.0.34.5.205';'SD BIOSENSOR Inc. (manufacturer), STANDARD Q COVID-19 Ag Test Nasal';'';'SD BIOSENSOR Inc. (manufacturer), STANDARD Q COVID-19 Ag Test Nasal';'SD BIOSENSOR Inc. (manufacturer), STANDARD Q COVID-19 Ag Test Nasal';'';'0';'L';''
'2067';'1.2.40.0.34.5.205';'BIOTEKE CORPORATION (WUXI) CO., LTD, SARS-CoV-2 Antigen Test Kit (colloidal gold method)';'';'BIOTEKE CORPORATION (WUXI) CO., LTD, SARS-CoV-2 Antigen Test Kit (colloidal gold method)';'BIOTEKE CORPORATION (WUXI) CO., LTD, SARS-CoV-2 Antigen Test Kit (colloidal gold method)';'';'0';'L';''
'2072';'1.2.40.0.34.5.205';'Beijing Jinwofu Bioengineering Technology Co.,Ltd., Novel Coronavirus (SARS-CoV-2) Antigen Rapid Test Kit';'';'Beijing Jinwofu Bioengineering Technology Co.,Ltd., Novel Coronavirus (SARS-CoV-2) Antigen Rapid Test Kit';'Beijing Jinwofu Bioengineering Technology Co.,Ltd., Novel Coronavirus (SARS-CoV-2) Antigen Rapid Test Kit';'';'0';'L';''
'2074';'1.2.40.0.34.5.205';'Triplex International Biosciences Co., Ltd, SARS-CoV-2 Antigen Rapid Test Kit';'';'Triplex International Biosciences Co., Ltd, SARS-CoV-2 Antigen Rapid Test Kit';'Triplex International Biosciences Co., Ltd, SARS-CoV-2 Antigen Rapid Test Kit';'';'0';'L';''
'2078';'1.2.40.0.34.5.205';'ArcDia International Oy Ltd, mariPOC Respi+';'';'ArcDia International Oy Ltd, mariPOC Respi+';'ArcDia International Oy Ltd, mariPOC Respi+';'';'0';'L';''
'2079';'1.2.40.0.34.5.205';'ArcDia International Oy Ltd, mariPOC Quick Flu+';'';'ArcDia International Oy Ltd, mariPOC Quick Flu+';'ArcDia International Oy Ltd, mariPOC Quick Flu+';'';'0';'L';''
'2089';'1.2.40.0.34.5.205';'Anhui Formaster Biosci Co., Ltd., New Coronavirus (COVID-19) Antigen Rapid Test';'';'Anhui Formaster Biosci Co., Ltd., New Coronavirus (COVID-19) Antigen Rapid Test';'Anhui Formaster Biosci Co., Ltd., New Coronavirus (COVID-19) Antigen Rapid Test';'';'0';'L';''
'2090';'1.2.40.0.34.5.205';'Wuhan UNscience Biotechnology Co., Ltd., SARS-CoV-2 Antigen Rapid Test Kit';'';'Wuhan UNscience Biotechnology Co., Ltd., SARS-CoV-2 Antigen Rapid Test Kit';'Wuhan UNscience Biotechnology Co., Ltd., SARS-CoV-2 Antigen Rapid Test Kit';'';'0';'L';''
'2097';'1.2.40.0.34.5.205';'Sansure Biotech Inc, SARS-CoV-2 Rapid Antigen Test (Colloidal Gold Method)';'';'Sansure Biotech Inc, SARS-CoV-2 Rapid Antigen Test (Colloidal Gold Method)';'Sansure Biotech Inc, SARS-CoV-2 Rapid Antigen Test (Colloidal Gold Method)';'';'0';'L';''
'2098';'1.2.40.0.34.5.205';'Wuhan EasyDiagnosis Biomedicine Co., Ltd., COVID-19  (SARS-CoV-2) Antigen-Test kit';'';'Wuhan EasyDiagnosis Biomedicine Co., Ltd., COVID-19  (SARS-CoV-2) Antigen-Test kit';'Wuhan EasyDiagnosis Biomedicine Co., Ltd., COVID-19  (SARS-CoV-2) Antigen-Test kit ';'';'0';'L';''
'2100';'1.2.40.0.34.5.205';'VivaChek Biotech (Hangzhou) Co., Ltd, China, Verino Pro SARS CoV 2 Ag Rapid Test';'';'VivaChek Biotech (Hangzhou) Co., Ltd, China, Verino Pro SARS CoV 2 Ag Rapid Test';'VivaChek Biotech (Hangzhou) Co., Ltd, China, Verino Pro SARS CoV 2 Ag Rapid Test';'';'0';'L';''
'2101';'1.2.40.0.34.5.205';'AXIOM Gesellschaft für Diagnostica und Biochemica mbH, COVID-19 Antigen Rapid Test';'';'AXIOM Gesellschaft für Diagnostica und Biochemica mbH, COVID-19 Antigen Rapid Test';'AXIOM Gesellschaft für Diagnostica und Biochemica mbH, COVID-19 Antigen Rapid Test';'';'0';'L';''
'2107';'1.2.40.0.34.5.205';'Jiangsu Bioperfectus Technologies Co., Ltd., Novel Corona Virus (SARS-CoV-2) Ag Rapid Test Kit';'';'Jiangsu Bioperfectus Technologies Co., Ltd., Novel Corona Virus (SARS-CoV-2) Ag Rapid Test Kit';'Jiangsu Bioperfectus Technologies Co., Ltd., Novel Corona Virus (SARS-CoV-2) Ag Rapid Test Kit';'';'0';'L';''
'2109';'1.2.40.0.34.5.205';'Shenzhen Lvshiyuan Biotechnology Co., Ltd., Green Spring SARS-CoV-2 Antigen-Rapid test-Set';'';'Shenzhen Lvshiyuan Biotechnology Co., Ltd., Green Spring SARS-CoV-2 Antigen-Rapid test-Set';'Shenzhen Lvshiyuan Biotechnology Co., Ltd., Green Spring SARS-CoV-2 Antigen-Rapid test-Set';'';'0';'L';''
'2111';'1.2.40.0.34.5.205';'VivaChek Biotech (Hangzhou) Co., Ltd, SARS-CoV-2 Ag Rapid Test';'';'VivaChek Biotech (Hangzhou) Co., Ltd, SARS-CoV-2 Ag Rapid Test';'VivaChek Biotech (Hangzhou) Co., Ltd, SARS-CoV-2 Ag Rapid Test';'';'0';'L';''
'2116';'1.2.40.0.34.5.205';'PerGrande Biotech Development Co., Ltd., SARS-CoV-2 Antigen Detection Kit (Colloidal Gold Immunochromato-graphic assay)';'';'PerGrande Biotech Development Co., Ltd., SARS-CoV-2 Antigen Detection Kit (Colloidal Gold Immunochromato-graphic assay)';'PerGrande Biotech Development Co., Ltd., SARS-CoV-2 Antigen Detection Kit (Colloidal Gold Immunochromato-graphic assay)';'';'0';'L';''
'2124';'1.2.40.0.34.5.205';'Fujirebio, Lumipulse G SARS-CoV-2 Ag';'';'Fujirebio, Lumipulse G SARS-CoV-2 Ag';'Fujirebio, Lumipulse G SARS-CoV-2 Ag';'';'0';'L';''
'2128';'1.2.40.0.34.5.205';'Lumigenex (Suzhou) Co., Ltd, PocRoc SARS-CoV-2 Antigen Rapid Test Kit (Colloidal Gold)';'';'Lumigenex (Suzhou) Co., Ltd, PocRoc SARS-CoV-2 Antigen Rapid Test Kit (Colloidal Gold)';'Lumigenex (Suzhou) Co., Ltd, PocRoc SARS-CoV-2 Antigen Rapid Test Kit (Colloidal Gold)';'';'0';'L';''
'2130';'1.2.40.0.34.5.205';'Affimedix Inc., TestNOW - COVID-19 Antigen Test';'';'Affimedix Inc., TestNOW - COVID-19 Antigen Test';'Affimedix Inc., TestNOW - COVID-19 Antigen Test';'';'0';'L';''
'2139';'1.2.40.0.34.5.205';'Hangzhou Lysun Biotechnology Co., Ltd., COVID-19 antigen Rapid Test Device (Colloidal Gold)';'';'Hangzhou Lysun Biotechnology Co., Ltd., COVID-19 antigen Rapid Test Device (Colloidal Gold)';'Hangzhou Lysun Biotechnology Co., Ltd., COVID-19 antigen Rapid Test Device (Colloidal Gold)';'';'0';'L';''
'2143';'1.2.40.0.34.5.205';'Wuxi Biohermes Bio & Medical Technology Co., Ltd, SARS-CoV-2 Antigen Test Kit (Lateral Flow Assay)';'';'Wuxi Biohermes Bio & Medical Technology Co., Ltd, SARS-CoV-2 Antigen Test Kit (Lateral Flow Assay)';'Wuxi Biohermes Bio & Medical Technology Co., Ltd, SARS-CoV-2 Antigen Test Kit (Lateral Flow Assay)';'';'0';'L';''
'2144';'1.2.40.0.34.5.205';'Jiangsu Well Biotech Co., Ltd., COVID-19 Ag Rapid Test Device';'';'Jiangsu Well Biotech Co., Ltd., COVID-19 Ag Rapid Test Device';'Jiangsu Well Biotech Co., Ltd., COVID-19 Ag Rapid Test Device';'';'0';'L';''
'2147';'1.2.40.0.34.5.205';'Fujirebio , ESPLINE SARS-CoV-2';'';'Fujirebio , ESPLINE SARS-CoV-2';'Fujirebio , ESPLINE SARS-CoV-2';'';'0';'L';''
'2150';'1.2.40.0.34.5.205';'Chongqing M&D Biotechnology Co. Ltd, 2019-nCoV Antigen Test Kit';'';'Chongqing M&D Biotechnology Co. Ltd, 2019-nCoV Antigen Test Kit';'Chongqing M&D Biotechnology Co. Ltd, 2019-nCoV Antigen Test Kit';'';'0';'L';''
'2152';'1.2.40.0.34.5.205';'Shenzhen CAS-Envision Medical Technology Co., Ltd., SARS-CoV-2-Antigen Rapid Detection Kit';'';'Shenzhen CAS-Envision Medical Technology Co., Ltd., SARS-CoV-2-Antigen Rapid Detection Kit';'Shenzhen CAS-Envision Medical Technology Co., Ltd., SARS-CoV-2-Antigen Rapid Detection Kit';'';'0';'L';''
'2164';'1.2.40.0.34.5.205';'Nanjing Synthgene Medical Technology Co., Ltd., SARS-COV-2 Nucleocapsid (N) Antigen Rapid Detection Kit (Colloidal gold method)';'';'Nanjing Synthgene Medical Technology Co., Ltd., SARS-COV-2 Nucleocapsid (N) Antigen Rapid Detection Kit (Colloidal gold method)';'Nanjing Synthgene Medical Technology Co., Ltd., SARS-COV-2 Nucleocapsid (N) Antigen Rapid Detection Kit (Colloidal gold method)';'';'0';'L';''
'2183';'1.2.40.0.34.5.205';'Getein Biotech, Inc., One Step Test for SARS-CoV-2 Antigen (Colloidal Gold)';'';'Getein Biotech, Inc., One Step Test for SARS-CoV-2 Antigen (Colloidal Gold)';'Getein Biotech, Inc., One Step Test for SARS-CoV-2 Antigen (Colloidal Gold)';'';'0';'L';''
'2200';'1.2.40.0.34.5.205';'NanoRepro AG, NanoRepro SARS-CoV-2 Antigen Rapid Test';'';'NanoRepro AG, NanoRepro SARS-CoV-2 Antigen Rapid Test';'NanoRepro AG, NanoRepro SARS-CoV-2 Antigen Rapid Test';'';'0';'L';''
'2201';'1.2.40.0.34.5.205';'Zybio Inc., SARS-CoV-2 Antigen Assay Kit (Colloidal Gold Method)';'';'Zybio Inc., SARS-CoV-2 Antigen Assay Kit (Colloidal Gold Method)';'Zybio Inc., SARS-CoV-2 Antigen Assay Kit (Colloidal Gold Method)';'';'0';'L';''
'2228';'1.2.40.0.34.5.205';'Roche (SD BIOSENSOR), SARS-CoV-2 Rapid Antigen Test Nasal';'';'Roche (SD BIOSENSOR), SARS-CoV-2 Rapid Antigen Test Nasal';'Roche (SD BIOSENSOR), SARS-CoV-2 Rapid Antigen Test Nasal';'';'0';'L';''
'2230';'1.2.40.0.34.5.205';'BIOHIT HealthCcare (Hefei) Co., Ltd., SARS-CoV-2 Antigen Rapid Test (Colloidal Gold Method)';'';'BIOHIT HealthCcare (Hefei) Co., Ltd., SARS-CoV-2 Antigen Rapid Test (Colloidal Gold Method)';'BIOHIT HealthCcare (Hefei) Co., Ltd., SARS-CoV-2 Antigen Rapid Test (Colloidal Gold Method)';'';'0';'L';''
'2241';'1.2.40.0.34.5.205';'NESAPOR EUROPA SL, MARESKIT COVID-19 ANTIGEN RAPID TEST KIT';'';'NESAPOR EUROPA SL, MARESKIT COVID-19 ANTIGEN RAPID TEST KIT';'NESAPOR EUROPA SL, MARESKIT COVID-19 ANTIGEN RAPID TEST KIT';'';'0';'L';''
'2242';'1.2.40.0.34.5.205';'DNA Diagnostic, COVID-19 Antigen Detection Kit';'';'DNA Diagnostic, COVID-19 Antigen Detection Kit';'DNA Diagnostic, COVID-19 Antigen Detection Kit';'';'0';'L';''
'2247';'1.2.40.0.34.5.205';'BioGnost Ltd, CoviGnost AG Test Device 1x20';'';'BioGnost Ltd, CoviGnost AG Test Device 1x20';'BioGnost Ltd, CoviGnost AG Test Device 1x20';'';'0';'L';''
'2257';'1.2.40.0.34.5.205';'Hangzhou AllTest Biotech Co., Ltd, SARS-CoV-2 Antigen Rapid Test (Nasal Swab)';'';'Hangzhou AllTest Biotech Co., Ltd, SARS-CoV-2 Antigen Rapid Test (Nasal Swab)';'Hangzhou AllTest Biotech Co., Ltd, SARS-CoV-2 Antigen Rapid Test (Nasal Swab)';'';'0';'L';''
'2260';'1.2.40.0.34.5.205';'Multi-G bvba, Covid19Check-NAS';'';'Multi-G bvba, Covid19Check-NAS';'Multi-G bvba, Covid19Check-NAS';'';'0';'L';''
'2271';'1.2.40.0.34.5.205';'Pantest SA, Pantest Coronavirus Ag (Nasopharyngeal Swab)';'';'Pantest SA, Pantest Coronavirus Ag (Nasopharyngeal Swab)';'Pantest SA, Pantest Coronavirus Ag (Nasopharyngeal Swab)';'';'0';'L';''
'2273';'1.2.40.0.34.5.205';'Dräger Safety AG & Co. KGaA, Dräger Antigen Test SARS-CoV-2';'';'Dräger Safety AG & Co. KGaA, Dräger Antigen Test SARS-CoV-2';'Dräger Safety AG & Co. KGaA, Dräger Antigen Test SARS-CoV-2';'';'0';'L';''
'2278';'1.2.40.0.34.5.205';'Innovation Biotech(Beijing) Co.Ltd, Coronavirus (SARS-Cov-2) Antigen Rapid Test Cassette (Nasal swab)';'';'Innovation Biotech(Beijing) Co.Ltd, Coronavirus (SARS-Cov-2) Antigen Rapid Test Cassette (Nasal swab)';'Innovation Biotech(Beijing) Co.Ltd, Coronavirus (SARS-Cov-2) Antigen Rapid Test Cassette (Nasal swab)';'';'0';'L';''
'2282';'1.2.40.0.34.5.205';'Becton Dickinson, BD Kit for Rapid Detection of SARS-CoV-2';'';'Becton Dickinson, BD Kit for Rapid Detection of SARS-CoV-2';'Becton Dickinson, BD Kit for Rapid Detection of SARS-CoV-2';'';'0';'L';''
'2290';'1.2.40.0.34.5.205';'Rapid Pathogen Screening, Inc, LIAISON Quick Detect Covid Ag Assay';'';'Rapid Pathogen Screening, Inc, LIAISON Quick Detect Covid Ag Assay';'Rapid Pathogen Screening, Inc, LIAISON Quick Detect Covid Ag Assay';'';'0';'L';''
'2297';'1.2.40.0.34.5.205';'SureScreen Diagnostics, SARS-CoV-2 Rapid Antigen Test Cassette';'';'SureScreen Diagnostics, SARS-CoV-2 Rapid Antigen Test Cassette';'SureScreen Diagnostics, SARS-CoV-2 Rapid Antigen Test Cassette';'';'0';'L';''
'2301';'1.2.40.0.34.5.205';'Nanjing Liming Bio-Products Co., Ltd., StrongStep SARS-CoV-2 Antigen Rapid Test';'';'Nanjing Liming Bio-Products Co., Ltd., StrongStep SARS-CoV-2 Antigen Rapid Test';'Nanjing Liming Bio-Products Co., Ltd., StrongStep SARS-CoV-2 Antigen Rapid Test';'';'0';'L';''
'2302';'1.2.40.0.34.5.205';'Hangzhou AllTest Biotech Co., Ltd, COVID-19 Antigen Test Cassette (Nasopharyngeal Swab)(FIA)';'';'Hangzhou AllTest Biotech Co., Ltd, COVID-19 Antigen Test Cassette (Nasopharyngeal Swab)(FIA)';'Hangzhou AllTest Biotech Co., Ltd, COVID-19 Antigen Test Cassette (Nasopharyngeal Swab)(FIA)';'';'0';'L';''
'2319';'1.2.40.0.34.5.205';'Hangzhou AllTest Biotech Co., Ltd, CVAG4080A ? GSD NovaGen SARS-CoV-2 Ag Rapid Test (NP Swab)';'';'Hangzhou AllTest Biotech Co., Ltd, CVAG4080A ? GSD NovaGen SARS-CoV-2 Ag Rapid Test (NP Swab)';'Hangzhou AllTest Biotech Co., Ltd, CVAG4080A ? GSD NovaGen SARS-CoV-2 Ag Rapid Test (NP Swab)';'';'0';'L';''
'2325';'1.2.40.0.34.5.205';'Hangzhou AllTest Biotech Co., Ltd, GSD NovaGen SARS-CoV-2 Ag Rapid Test (Nasal Swab)';'';'Hangzhou AllTest Biotech Co., Ltd, GSD NovaGen SARS-CoV-2 Ag Rapid Test (Nasal Swab)';'Hangzhou AllTest Biotech Co., Ltd, GSD NovaGen SARS-CoV-2 Ag Rapid Test (Nasal Swab)';'';'0';'L';''
'2350';'1.2.40.0.34.5.205';'Assure Tech. (Hangzhou) Co., Ltd., ECOTEST COVID-19 Antigen Rapid Test Device';'';'Assure Tech. (Hangzhou) Co., Ltd., ECOTEST COVID-19 Antigen Rapid Test Device';'Assure Tech. (Hangzhou) Co., Ltd., ECOTEST COVID-19 Antigen Rapid Test Device';'';'0';'L';''
'2374';'1.2.40.0.34.5.205';'ABIOTEQ, Cora Gentest-19';'';'ABIOTEQ, Cora Gentest-19';'ABIOTEQ, Cora Gentest-19';'';'0';'L';''
'2380';'1.2.40.0.34.5.205';'BioSpeedia International, COVID19Speed-Antigen Test BSD_0503';'';'BioSpeedia International, COVID19Speed-Antigen Test BSD_0503';'BioSpeedia International, COVID19Speed-Antigen Test BSD_0503 ';'';'0';'L';''
'2414';'1.2.40.0.34.5.205';'Shenzhen Huian Biosci Technology Co., Ltd., SARS-CoV-2 Antigen Test Kit (Colloidal Gold)';'';'Shenzhen Huian Biosci Technology Co., Ltd., SARS-CoV-2 Antigen Test Kit (Colloidal Gold)';'Shenzhen Huian Biosci Technology Co., Ltd., SARS-CoV-2 Antigen Test Kit (Colloidal Gold)';'';'0';'L';''
'2415';'1.2.40.0.34.5.205';'Shenzhen Dymind Biotechnology Co., Ltd, SARS-CoV-2 Antigen Test Kit (Colloidal Gold)';'';'Shenzhen Dymind Biotechnology Co., Ltd, SARS-CoV-2 Antigen Test Kit (Colloidal Gold)';'Shenzhen Dymind Biotechnology Co., Ltd, SARS-CoV-2 Antigen Test Kit (Colloidal Gold)';'';'0';'L';''
'2419';'1.2.40.0.34.5.205';'InTec PRODUCTS, INC., Rapid SARS-CoV-2 Antigen Test (nasopharyngeal specimen)';'';'InTec PRODUCTS, INC., Rapid SARS-CoV-2 Antigen Test (nasopharyngeal specimen)';'InTec PRODUCTS, INC., Rapid SARS-CoV-2 Antigen Test (nasopharyngeal specimen)';'';'0';'L';''
'2449';'1.2.40.0.34.5.205';'Citest Diagnostics Inc., COVID-19 Antigen Rapid Test (Nasal Swab)';'';'Citest Diagnostics Inc., COVID-19 Antigen Rapid Test (Nasal Swab)';'Citest Diagnostics Inc., COVID-19 Antigen Rapid Test (Nasal Swab)';'';'0';'L';''
'2494';'1.2.40.0.34.5.205';'Beijing O&D Biotech Co., Ltd., COVID-19 Antigen Rapid Test';'';'Beijing O&D Biotech Co., Ltd., COVID-19 Antigen Rapid Test';'Beijing O&D Biotech Co., Ltd., COVID-19 Antigen Rapid Test';'';'0';'L';''
'2506';'1.2.40.0.34.5.205';'Nanjing Norman Biological Technology Co., Ltd., Novel Coronavirus (2019-nCoV) Antigen Testing Kit (Colloidal Gold)';'';'Nanjing Norman Biological Technology Co., Ltd., Novel Coronavirus (2019-nCoV) Antigen Testing Kit (Colloidal Gold)';'Nanjing Norman Biological Technology Co., Ltd., Novel Coronavirus (2019-nCoV) Antigen Testing Kit (Colloidal Gold)';'';'0';'L';''
'2519';'1.2.40.0.34.5.205';'BIOLAN HEALTH, S.L, COVID-19 Antigen Rapid Test (Colloidal Gold Method)';'';'BIOLAN HEALTH, S.L, COVID-19 Antigen Rapid Test (Colloidal Gold Method)';'BIOLAN HEALTH, S.L, COVID-19 Antigen Rapid Test (Colloidal Gold Method)';'';'0';'L';''
'2533';'1.2.40.0.34.5.205';'Dynamiker Biotechnolgy(Tianjin) Co., Ltd., Dynamiker SARS-CoV-2 Ag Rapid Test';'';'Dynamiker Biotechnolgy(Tianjin) Co., Ltd., Dynamiker SARS-CoV-2 Ag Rapid Test';'Dynamiker Biotechnolgy(Tianjin) Co., Ltd., Dynamiker SARS-CoV-2 Ag Rapid Test';'';'0';'L';''
'2555';'1.2.40.0.34.5.205';'IEDAU INTERNATIONAL GMBH, Covid-19 Antigen Schnelltest (Colloidales Gold)';'';'IEDAU INTERNATIONAL GMBH, Covid-19 Antigen Schnelltest (Colloidales Gold)';'IEDAU INTERNATIONAL GMBH, Covid-19 Antigen Schnelltest (Colloidales Gold)';'';'0';'L';''
'2579';'1.2.40.0.34.5.205';'AccuBioTech Co.,Ltd, Accu-Tell SARS-CoV-2 Ag Cassette';'';'AccuBioTech Co.,Ltd, Accu-Tell SARS-CoV-2 Ag Cassette';'AccuBioTech Co.,Ltd, Accu-Tell SARS-CoV-2 Ag Cassette';'';'0';'L';''
'2584';'1.2.40.0.34.5.205';'TÜRKLAB TIBBI MALZEMELER SAN. ve TIC. A.S., INFO Covid-19 Ag Test';'';'TÜRKLAB TIBBI MALZEMELER SAN. ve TIC. A.S., INFO Covid-19 Ag Test';'TÜRKLAB TIBBI MALZEMELER SAN. ve TIC. A.S., INFO Covid-19 Ag Test';'';'0';'L';''
'2586';'1.2.40.0.34.5.205';'Jiangsu Mole Bioscience CO., LTD., SARS-CoV-2 Antigen Test Cassette';'';'Jiangsu Mole Bioscience CO., LTD., SARS-CoV-2 Antigen Test Cassette';'Jiangsu Mole Bioscience CO., LTD., SARS-CoV-2 Antigen Test Cassette';'';'0';'L';''
'2588';'1.2.40.0.34.5.205';'Changzhou Biowin Pharmaceutical Co.,Ltd., Novel Coronavirus(COVID-19) Antigen Test Kit (Colloidal Gold)';'';'Changzhou Biowin Pharmaceutical Co.,Ltd., Novel Coronavirus(COVID-19) Antigen Test Kit (Colloidal Gold)';'Changzhou Biowin Pharmaceutical Co.,Ltd., Novel Coronavirus(COVID-19) Antigen Test Kit (Colloidal Gold)';'';'0';'L';''
'2608';'1.2.40.0.34.5.205';'Neo-nostics (Suzhou) Bioengineering Co., Ltd., COVID 19 Antigen Test Kit (Colloidal Gold Method)';'';'Neo-nostics (Suzhou) Bioengineering Co., Ltd., COVID 19 Antigen Test Kit (Colloidal Gold Method)';'Neo-nostics (Suzhou) Bioengineering Co., Ltd., COVID 19 Antigen Test Kit (Colloidal Gold Method)';'';'0';'L';''
'2629';'1.2.40.0.34.5.205';'Hangzhou DIAN Biotechnology Co., Ltd., COVID-19 Antigen Test Cassette';'';'Hangzhou DIAN Biotechnology Co., Ltd., COVID-19 Antigen Test Cassette';'Hangzhou DIAN Biotechnology Co., Ltd., COVID-19 Antigen Test Cassette';'';'0';'L';''
'2640';'1.2.40.0.34.5.205';'Mologic Ltd, COVIOS Ag COVID-19 Antigen Rapid Diagnostic Test';'';'Mologic Ltd, COVIOS Ag COVID-19 Antigen Rapid Diagnostic Test';'Mologic Ltd, COVIOS Ag COVID-19 Antigen Rapid Diagnostic Test';'';'0';'L';''
'2642';'1.2.40.0.34.5.205';'Genobio Pharmaceutical Co., Ltd., Virusee SARS-CoV-2 Antigen Rapid Test (Colloidal Gold)';'';'Genobio Pharmaceutical Co., Ltd., Virusee SARS-CoV-2 Antigen Rapid Test (Colloidal Gold)';'Genobio Pharmaceutical Co., Ltd., Virusee SARS-CoV-2 Antigen Rapid Test (Colloidal Gold)';'';'0';'L';''
'2672';'1.2.40.0.34.5.205';'Pierenkemper GmbH, (SARS-CoV-2) Antigen Rapid Test COVIDENT (SWAB) COVID-19';'';'Pierenkemper GmbH, (SARS-CoV-2) Antigen Rapid Test COVIDENT (SWAB) COVID-19';'Pierenkemper GmbH, (SARS-CoV-2) Antigen Rapid Test COVIDENT (SWAB) COVID-19';'';'0';'L';''
'2678';'1.2.40.0.34.5.205';'NDFOS Co., Ltd., ND COVID-19 Ag Test';'';'NDFOS Co., Ltd., ND COVID-19 Ag Test';'NDFOS Co., Ltd., ND COVID-19 Ag Test';'';'0';'L';''
'2684';'1.2.40.0.34.5.205';'Zhejiang GENE SCIENCE Co., Ltd, Novel Coronavirus (COVID-19) Antigen Detection Kit (Swab)';'';'Zhejiang GENE SCIENCE Co., Ltd, Novel Coronavirus (COVID-19) Antigen Detection Kit (Swab)';'Zhejiang GENE SCIENCE Co., Ltd, Novel Coronavirus (COVID-19) Antigen Detection Kit (Swab)';'';'0';'L';''
'2685';'1.2.40.0.34.5.205';'PRIMA Lab SA, COVID-19 Antigen Rapid Test';'';'PRIMA Lab SA, COVID-19 Antigen Rapid Test';'PRIMA Lab SA, COVID-19 Antigen Rapid Test';'';'0';'L';''
'2687';'1.2.40.0.34.5.205';'Zephyr Biomedicals - Tulip Diagnostics, PerkinElmer COVID 19 Antigen Test (NS, NP)';'';'Zephyr Biomedicals - Tulip Diagnostics, PerkinElmer COVID 19 Antigen Test (NS, NP)';'Zephyr Biomedicals - Tulip Diagnostics, PerkinElmer COVID 19 Antigen Test (NS, NP)';'';'0';'L';''
'2691';'1.2.40.0.34.5.205';'CALTH Inc., AllCheck COVID19 Ag Nasal';'';'CALTH Inc., AllCheck COVID19 Ag Nasal';'CALTH Inc., AllCheck COVID19 Ag Nasal';'';'0';'L';''
'2695';'1.2.40.0.34.5.205';'Glallergen CO., LTD., Novel Coronavirus (2019-nCoV) Antigen Test Kit (Colloidal gold immunochromatography)';'';'Glallergen CO., LTD., Novel Coronavirus (2019-nCoV) Antigen Test Kit (Colloidal gold immunochromatography)';'Glallergen CO., LTD., Novel Coronavirus (2019-nCoV) Antigen Test Kit (Colloidal gold immunochromatography)';'';'0';'L';''
'2696';'1.2.40.0.34.5.205';'Cesna Biyoteknoloji Arast?rma Gelistirme Laboratuvar Sist.Ins.Müh.Dan.San.Tic.Ltd.Sti., CHECK UP SARS-COV-2 NASAL ANTIGEN RAPID TEST';'';'Cesna Biyoteknoloji Arast?rma Gelistirme Laboratuvar Sist.Ins.Müh.Dan.San.Tic.Ltd.Sti., CHECK UP SARS-COV-2 NASAL ANTIGEN RAPID TEST';'Cesna Biyoteknoloji Arast?rma Gelistirme Laboratuvar Sist.Ins.Müh.Dan.San.Tic.Ltd.Sti., CHECK UP SARS-COV-2 NASAL ANTIGEN RAPID TEST';'';'0';'L';''
'2724';'1.2.40.0.34.5.205';'Fosun Diagnostics (Shanghai) Co.,Ltd., China, Fosun Covid-19 Ag Card';'';'Fosun Diagnostics (Shanghai) Co.,Ltd., China, Fosun Covid-19 Ag Card';'Fosun Diagnostics (Shanghai) Co.,Ltd., China, Fosun Covid-19 Ag Card';'';'0';'L';''
'2741';'1.2.40.0.34.5.205';'OSANG Healthcare Co., Ltd., GeneFinder COVID-19 Ag Plus Rapid Test';'';'OSANG Healthcare Co., Ltd., GeneFinder COVID-19 Ag Plus Rapid Test';'OSANG Healthcare Co., Ltd., GeneFinder COVID-19 Ag Plus Rapid Test';'';'0';'L';''
'2742';'1.2.40.0.34.5.205';'Wuhan HealthCare Biotechnology Co. Ltd., SARS-CoV-2 Antigen Test Kit (Colloidal Gold)';'';'Wuhan HealthCare Biotechnology Co. Ltd., SARS-CoV-2 Antigen Test Kit (Colloidal Gold)';'Wuhan HealthCare Biotechnology Co. Ltd., SARS-CoV-2 Antigen Test Kit (Colloidal Gold)';'';'0';'L';''
'2746';'1.2.40.0.34.5.205';'Cesna Biyoteknoloji Arast?rma Gelistirme Laboratuvar Sist.Ins.Müh.Dan.San.Tic.Ltd.Sti., CHECK UP SARS-COV-2 NASOPHARYNGEAL RAPID ANTIGEN TEST';'';'Cesna Biyoteknoloji Arast?rma Gelistirme Laboratuvar Sist.Ins.Müh.Dan.San.Tic.Ltd.Sti., CHECK UP SARS-COV-2 NASOPHARYNGEAL RAPID ANTIGEN TEST';'Cesna Biyoteknoloji Arast?rma Gelistirme Laboratuvar Sist.Ins.Müh.Dan.San.Tic.Ltd.Sti., CHECK UP SARS-COV-2 NASOPHARYNGEAL RAPID ANTIGEN TEST';'';'0';'L';''
'2754';'1.2.40.0.34.5.205';'Qingdao Hightop Biotech Co., Ltd., SARS-CoV-2/Flu A+B/RSV Antigen Rapid Test';'';'Qingdao Hightop Biotech Co., Ltd., SARS-CoV-2/Flu A+B/RSV Antigen Rapid Test';'Qingdao Hightop Biotech Co., Ltd., SARS-CoV-2/Flu A+B/RSV Antigen Rapid Test';'';'0';'L';''
'2756';'1.2.40.0.34.5.205';'DNA Diagnostic, SARS-CoV-2 Antigen Rapid Test';'';'DNA Diagnostic, SARS-CoV-2 Antigen Rapid Test';'DNA Diagnostic, SARS-CoV-2 Antigen Rapid Test';'';'0';'L';''
'2763';'1.2.40.0.34.5.205';'ScheBo Biotech, ScheBo SARS CoV-2 Quick ANTIGEN (Colloidal Gold Method)';'';'ScheBo Biotech, ScheBo SARS CoV-2 Quick ANTIGEN (Colloidal Gold Method)';'ScheBo Biotech, ScheBo SARS CoV-2 Quick ANTIGEN (Colloidal Gold Method)';'';'0';'L';''
'2807';'1.2.40.0.34.5.205';'Beijing Hotgen Biotech Co., Ltd, Coronavirus (2019-nCoV)-Antigentest';'';'Beijing Hotgen Biotech Co., Ltd, Coronavirus (2019-nCoV)-Antigentest';'Beijing Hotgen Biotech Co., Ltd, Coronavirus (2019-nCoV)-Antigentest';'';'0';'L';''
'2812';'1.2.40.0.34.5.205';'Shenzhen Huaree Technology Co.,Ltd, SARS-CoV-2 Antigen Rapid Test Kit (Immunochromatography)';'';'Shenzhen Huaree Technology Co.,Ltd, SARS-CoV-2 Antigen Rapid Test Kit (Immunochromatography)';'Shenzhen Huaree Technology Co.,Ltd, SARS-CoV-2 Antigen Rapid Test Kit (Immunochromatography)';'';'0';'L';''
'2853';'1.2.40.0.34.5.205';'GenSure Biotech Inc., GenSure COVID-19 Antigen Rapid Test Kit';'';'GenSure Biotech Inc., GenSure COVID-19 Antigen Rapid Test Kit';'GenSure Biotech Inc., GenSure COVID-19 Antigen Rapid Test Kit';'';'0';'L';''
'2858';'1.2.40.0.34.5.205';'Bioscience (Tianjin) Diagnostic Technology Co.,Ltd, Novel Coronavirus (2019-nCoV) Antigen Rapid Detection';'';'Bioscience (Tianjin) Diagnostic Technology Co.,Ltd, Novel Coronavirus (2019-nCoV) Antigen Rapid Detection';'Bioscience (Tianjin) Diagnostic Technology Co.,Ltd, Novel Coronavirus (2019-nCoV) Antigen Rapid Detection';'';'0';'L';''
'2862';'1.2.40.0.34.5.205';'Hangzhou Funworld Biotech Co., Ltd, SARS-CoV-2 Antigen Rapid Test Device';'';'Hangzhou Funworld Biotech Co., Ltd, SARS-CoV-2 Antigen Rapid Test Device';'Hangzhou Funworld Biotech Co., Ltd, SARS-CoV-2 Antigen Rapid Test Device';'';'0';'L';''
'2866';'1.2.40.0.34.5.205';'Lifecosm Biotech Limited, COVID-19 Antigen Test Cassette';'';'Lifecosm Biotech Limited, COVID-19 Antigen Test Cassette';'Lifecosm Biotech Limited, COVID-19 Antigen Test Cassette';'';'0';'L';''
'2885';'1.2.40.0.34.5.205';'Hangzhou GENESIS Biodetection and Biocontrol CO.,LTD, KaiBiLi COVID-19 Antigen Pro';'';'Hangzhou GENESIS Biodetection and Biocontrol CO.,LTD, KaiBiLi COVID-19 Antigen Pro';'Hangzhou GENESIS Biodetection and Biocontrol CO.,LTD, KaiBiLi COVID-19 Antigen Pro';'';'0';'L';''
'2941';'1.2.40.0.34.5.205';'Shenzhen Kingfocus Biomedical Engineering Co., Ltd., COVID-19 Antigen Detection Kit (Quantum Dots-Based Immunofluorescence Chromatography)';'';'Shenzhen Kingfocus Biomedical Engineering Co., Ltd., COVID-19 Antigen Detection Kit (Quantum Dots-Based Immunofluorescence Chromatography)';'Shenzhen Kingfocus Biomedical Engineering Co., Ltd., COVID-19 Antigen Detection Kit (Quantum Dots-Based Immunofluorescence Chromatography)';'';'0';'L';''
'2942';'1.2.40.0.34.5.205';'Hangzhou Zheda Dixun Biological Gene Engineering Co., Ltd., SARS-CoV-2 Nucleocapsid (N) Antigen Rapid Test Cassette (Swab)';'';'Hangzhou Zheda Dixun Biological Gene Engineering Co., Ltd., SARS-CoV-2 Nucleocapsid (N) Antigen Rapid Test Cassette (Swab)';'Hangzhou Zheda Dixun Biological Gene Engineering Co., Ltd., SARS-CoV-2 Nucleocapsid (N) Antigen Rapid Test Cassette (Swab)';'';'0';'L';''
'2963';'1.2.40.0.34.5.205';'Jiangxi Province JinHuan Medical Instrument Co., LTD., DREHA Novel Coronavirus (SARS-CoV-2) Antigen Rapid Detection Kit';'';'Jiangxi Province JinHuan Medical Instrument Co., LTD., DREHA Novel Coronavirus (SARS-CoV-2) Antigen Rapid Detection Kit';'Jiangxi Province JinHuan Medical Instrument Co., LTD., DREHA Novel Coronavirus (SARS-CoV-2) Antigen Rapid Detection Kit';'';'0';'L';''
'2979';'1.2.40.0.34.5.205';'Hangzhou Jucheng Medical Products Co., Ltd, SARS-CoV-2 Ag Rapid Test Kit';'';'Hangzhou Jucheng Medical Products Co., Ltd, SARS-CoV-2 Ag Rapid Test Kit';'Hangzhou Jucheng Medical Products Co., Ltd, SARS-CoV-2 Ag Rapid Test Kit';'';'0';'L';''
'3015';'1.2.40.0.34.5.205';'Suzhou Soochow University Saier Immuno Biotech Co., Ltd., InstantSure Covid-19 Ag CARD';'';'Suzhou Soochow University Saier Immuno Biotech Co., Ltd., InstantSure Covid-19 Ag CARD';'Suzhou Soochow University Saier Immuno Biotech Co., Ltd., InstantSure Covid-19 Ag CARD';'';'0';'L';''
'3093';'1.2.40.0.34.5.205';'TBG BIOTECHNOLOGY XIAMEN INC., SARS-CoV-2 Antigen Rapid Test (Nasal Swab)';'';'TBG BIOTECHNOLOGY XIAMEN INC., SARS-CoV-2 Antigen Rapid Test (Nasal Swab)';'TBG BIOTECHNOLOGY XIAMEN INC., SARS-CoV-2 Antigen Rapid Test (Nasal Swab)';'';'0';'L';''
'3099';'1.2.40.0.34.5.205';'BioDetect (Xiamen) Biotechnology Co., Ltd., RAPID SARS-COV-2 ANTIGEN TEST CARD';'';'BioDetect (Xiamen) Biotechnology Co., Ltd., RAPID SARS-COV-2 ANTIGEN TEST CARD';'BioDetect (Xiamen) Biotechnology Co., Ltd., RAPID SARS-COV-2 ANTIGEN TEST CARD';'';'0';'L';''
'344';'1.2.40.0.34.5.205';'SD BIOSENSOR Inc., STANDARD F COVID-19 Ag FIA';'';'SD BIOSENSOR Inc., STANDARD F COVID-19 Ag FIA';'SD BIOSENSOR Inc., STANDARD F COVID-19 Ag FIA';'';'0';'L';''
'345';'1.2.40.0.34.5.205';'SD BIOSENSOR Inc., STANDARD Q COVID-19 Ag Test';'';'SD BIOSENSOR Inc., STANDARD Q COVID-19 Ag Test';'SD BIOSENSOR Inc., STANDARD Q COVID-19 Ag Test';'';'0';'L';''
'768';'1.2.40.0.34.5.205';'ArcDia International Ltd, mariPOC SARS-CoV-2';'';'ArcDia International Ltd, mariPOC SARS-CoV-2';'ArcDia International Ltd, mariPOC SARS-CoV-2';'';'0';'L';''
'770';'1.2.40.0.34.5.205';'Assure Tech. (Hangzhou) Co., Ltd., ECOTEST COVID-19 Antigen Rapid Test Device';'';'Assure Tech. (Hangzhou) Co., Ltd., ECOTEST COVID-19 Antigen Rapid Test Device';'Assure Tech. (Hangzhou) Co., Ltd., ECOTEST COVID-19 Antigen Rapid Test Device';'';'0';'L';''
