{
  "resourceType": "CodeSystem",
  "id": "ips-conditionverificationstatus",
  "url": "https://termgit.elga.gv.at/CodeSystem-ips-conditionverificationstatus",
  "identifier": [
    {
      "use": "official",
      "system": "urn:ietf:rfc:3986",
      "value": "urn:oid:2.16.840.1.113883.4.642.3.115"
    }
  ],
  "version": "202002",
  "name": "ips-conditionverificationstatus",
  "title": "IPS_ConditionVerificationStatus",
  "status": "active",
  "date": "2020-02-04",
  "contact": [
    {
      "telecom": [
        {
          "system": "url",
          "value": "www.elga.gv.at"
        }
      ]
    }
  ],
  "content": "complete",
  "count": 6,
  "property": [
    {
      "code": "child",
      "type": "code"
    },
    {
      "code": "parent",
      "type": "code"
    }
  ],
  "concept": [
    {
      "code": "confirmed",
      "display": "best\u00e4tigt"
    },
    {
      "code": "refuted",
      "display": "ausgeschlossen"
    },
    {
      "code": "unconfirmed",
      "display": "unbest\u00e4tigt",
      "property": [
        {
          "code": "child",
          "valueCode": "differential"
        },
        {
          "code": "child",
          "valueCode": "provisional"
        }
      ]
    },
    {
      "code": "differential",
      "display": "alternativ m\u00f6glich (Differentialdiagnose)",
      "property": [
        {
          "code": "parent",
          "valueCode": "unconfirmed"
        }
      ]
    },
    {
      "code": "provisional",
      "display": "vorl\u00e4ufig",
      "property": [
        {
          "code": "parent",
          "valueCode": "unconfirmed"
        }
      ]
    },
    {
      "code": "unknown",
      "display": "unbekannt"
    }
  ]
}