{
  "resourceType": "ValueSet",
  "id": "elga-laborstruktur",
  "url": "https://termgit.elga.gv.at/ValueSet-elga-laborstruktur",
  "identifier": [
    {
      "use": "official",
      "system": "urn:ietf:rfc:3986",
      "value": "urn:oid:1.2.40.0.34.10.47"
    }
  ],
  "version": "4.3",
  "name": "elga-laborstruktur",
  "title": "ELGA_Laborstruktur",
  "status": "active",
  "date": "2018-01-18",
  "contact": [
    {
      "telecom": [
        {
          "system": "url",
          "value": "http://www.elga.gv.at"
        }
      ]
    }
  ],
  "description": "**Description:** Structure of an Austrian laboratory report. Three hierarchical levels: 'Allgemeiner Befund', 'Bereiche' and 'Gruppen'\n\n**Beschreibung:** Struktur eines \u00f6sterreichischen Laborbefundes. Drei Hierarchiebenenen: 'Allgemeiner Befund', 'Bereiche' und 'Gruppen'",
  "compose": {
    "include": [
      {
        "system": "https://termgit.elga.gv.at/CodeSystem-elga-laborparameterergaenzung",
        "concept": [
          {
            "code": "1",
            "display": "Allgemeiner Laborbefund"
          },
          {
            "code": "10",
            "display": "Probeninformation"
          },
          {
            "code": "100",
            "display": "Blutgruppenserologie"
          },
          {
            "code": "01850",
            "display": "Blutgruppenserologie"
          },
          {
            "code": "01860",
            "display": "HLA-Diagnostik"
          },
          {
            "code": "01870",
            "display": "HPA-Diagnostik"
          },
          {
            "code": "200",
            "display": "Blutgasanalytik"
          },
          {
            "code": "02060",
            "display": "Blutgasanalyse arteriell"
          },
          {
            "code": "02070",
            "display": "Hb-Derivate arteriell"
          },
          {
            "code": "02080",
            "display": "Blutgasanalyse ven\u00f6s"
          },
          {
            "code": "02090",
            "display": "Hb-Derivate ven\u00f6s"
          },
          {
            "code": "02100",
            "display": "Blutgasanalyse kapill\u00e4r"
          },
          {
            "code": "02110",
            "display": "Hb-Derivate kapill\u00e4r"
          },
          {
            "code": "02120",
            "display": "Hb-Derivate, gemischtven\u00f6s (Rechtsherzkatheter)"
          },
          {
            "code": "02130",
            "display": "BGA Sonstiges"
          },
          {
            "code": "300",
            "display": "H\u00e4matologie"
          },
          {
            "code": "03010",
            "display": "Blutbild"
          },
          {
            "code": "03020",
            "display": "Knochenmark Morphologie"
          },
          {
            "code": "03030",
            "display": "Immunph\u00e4notypisierung"
          },
          {
            "code": "03050",
            "display": "H\u00e4matologie Sonstiges"
          },
          {
            "code": "400",
            "display": "Gerinnung/H\u00e4mostaseologie"
          },
          {
            "code": "04140",
            "display": "H\u00e4mostaseologie Globaltests"
          },
          {
            "code": "04150",
            "display": "Einzelfaktoranalysen"
          },
          {
            "code": "04160",
            "display": "Thrombophilie Tests"
          },
          {
            "code": "04170",
            "display": "Gerinnung Sonstiges"
          },
          {
            "code": "500",
            "display": "Klinische Chemie/Proteindiagnostik"
          },
          {
            "code": "05180",
            "display": "Klinische Chemie"
          },
          {
            "code": "05190",
            "display": "Proteindiagnostik"
          },
          {
            "code": "05200",
            "display": "Spurenelemente"
          },
          {
            "code": "05210",
            "display": "Sondermaterialien"
          },
          {
            "code": "05220",
            "display": "Unters. bei Stoffwechselerkrankungen"
          },
          {
            "code": "600",
            "display": "Hormone/Vitamine/Tumormarker"
          },
          {
            "code": "06330",
            "display": "Hormone"
          },
          {
            "code": "06340",
            "display": "Vitamine"
          },
          {
            "code": "06350",
            "display": "Tumormarker"
          },
          {
            "code": "900",
            "display": "Toxikologie"
          },
          {
            "code": "07230",
            "display": "Urin-Screening"
          },
          {
            "code": "07240",
            "display": "Blut"
          },
          {
            "code": "07250",
            "display": "Toxikologie Sonstiges"
          },
          {
            "code": "1000",
            "display": "Medikamente"
          },
          {
            "code": "08260",
            "display": "Antibiotika"
          },
          {
            "code": "08270",
            "display": "Virostatika"
          },
          {
            "code": "08280",
            "display": "Antiepileptika"
          },
          {
            "code": "08290",
            "display": "Psychopharmaka"
          },
          {
            "code": "08300",
            "display": "Kardiaka"
          },
          {
            "code": "08310",
            "display": "Immunsuppressiva"
          },
          {
            "code": "08320",
            "display": "Medikamente Sonstiges"
          },
          {
            "code": "1100",
            "display": "Infektionsdiagnostik"
          },
          {
            "code": "10780",
            "display": "Virologie"
          },
          {
            "code": "10790",
            "display": "Bakteriologie"
          },
          {
            "code": "10800",
            "display": "Mykologie"
          },
          {
            "code": "10810",
            "display": "Parasitologie"
          },
          {
            "code": "10820",
            "display": "Makroskopie/Mikroskopie"
          },
          {
            "code": "1300",
            "display": "Autoimmundiagnostik"
          },
          {
            "code": "11360",
            "display": "Rheumatoide Arthritis-assoziierte Autoantik\u00f6rper"
          },
          {
            "code": "11370",
            "display": "Kollagenose-assoziierte Autoantik\u00f6rper"
          },
          {
            "code": "11380",
            "display": "Myositis-assoziierte Autoantik\u00f6rper"
          },
          {
            "code": "11390",
            "display": "Lebererkrankungen-assoziierte Autoantik\u00f6rper"
          },
          {
            "code": "11400",
            "display": "Pernizi\u00f6se An\u00e4mie assoziierte Autoantik\u00f6rper"
          },
          {
            "code": "11410",
            "display": "Vasculitis-assoziierte Antik\u00f6rper"
          },
          {
            "code": "11420",
            "display": "Goodpasture Syndrom assoziierte Autoantik\u00f6rper"
          },
          {
            "code": "11430",
            "display": "IBD assoziierte Autoantik\u00f6rper"
          },
          {
            "code": "11440",
            "display": "Z\u00f6liakie assoziierte Autoantik\u00f6rper"
          },
          {
            "code": "11450",
            "display": "Diabetes Mellitus assoziierte Autoantik\u00f6rper"
          },
          {
            "code": "11460",
            "display": "Paraneoplasie assoziierte Autoantik\u00f6rper"
          },
          {
            "code": "11470",
            "display": "Sonstige Autoantik\u00f6rper"
          },
          {
            "code": "1800",
            "display": "Allergiediagnostik"
          },
          {
            "code": "12010",
            "display": "Globalmarker"
          },
          {
            "code": "12020",
            "display": "Inhalationsallergene IgE"
          },
          {
            "code": "12030",
            "display": "Nahrungsmittelallergene IgE"
          },
          {
            "code": "12040",
            "display": "Umwelt- und Berufsallergene IgE"
          },
          {
            "code": "12050",
            "display": "Medikamente IgE"
          },
          {
            "code": "12060",
            "display": "Insekten und Insektengifte IgE"
          },
          {
            "code": "12070",
            "display": "Sonstige IgE"
          },
          {
            "code": "12080",
            "display": "Allergiechip IgE"
          },
          {
            "code": "12090",
            "display": "IgG Antigene"
          },
          {
            "code": "1400",
            "display": "Urindiagnostik"
          },
          {
            "code": "13730",
            "display": "Urinstreifen"
          },
          {
            "code": "13740",
            "display": "Urinsediment"
          },
          {
            "code": "13750",
            "display": "Urinchemie"
          },
          {
            "code": "1500",
            "display": "Stuhldiagnostik"
          },
          {
            "code": "14760",
            "display": "Stuhldiagnostik"
          },
          {
            "code": "1600",
            "display": "Liquordiagnostik"
          },
          {
            "code": "15770",
            "display": "Liquordiagnostik"
          },
          {
            "code": "2300",
            "display": "Genetische Diagnostik"
          },
          {
            "code": "16830",
            "display": "Pharmakogenetik"
          },
          {
            "code": "16840",
            "display": "Humangenetik"
          },
          {
            "code": "16841",
            "display": "H\u00e4matologische Genetik"
          },
          {
            "code": "2500",
            "display": "Sonstige"
          },
          {
            "code": "17880",
            "display": "Zytologie"
          },
          {
            "code": "17890",
            "display": "Sonstige"
          },
          {
            "code": "20",
            "display": "Befundbewertung"
          }
        ]
      }
    ]
  },
  "expansion": {
    "timestamp": "2022-09-13T14:16:41Z",
    "contains": [
      {
        "system": "https://termgit.elga.gv.at/CodeSystem-elga-laborparameterergaenzung",
        "code": "1",
        "display": "Allgemeiner Laborbefund",
        "contains": [
          {
            "system": "https://termgit.elga.gv.at/CodeSystem-elga-laborparameterergaenzung",
            "code": "10",
            "display": "Probeninformation"
          },
          {
            "system": "https://termgit.elga.gv.at/CodeSystem-elga-laborparameterergaenzung",
            "code": "100",
            "display": "Blutgruppenserologie",
            "contains": [
              {
                "system": "https://termgit.elga.gv.at/CodeSystem-elga-laborparameterergaenzung",
                "code": "01850",
                "display": "Blutgruppenserologie"
              },
              {
                "system": "https://termgit.elga.gv.at/CodeSystem-elga-laborparameterergaenzung",
                "code": "01860",
                "display": "HLA-Diagnostik"
              },
              {
                "system": "https://termgit.elga.gv.at/CodeSystem-elga-laborparameterergaenzung",
                "code": "01870",
                "display": "HPA-Diagnostik"
              }
            ]
          },
          {
            "system": "https://termgit.elga.gv.at/CodeSystem-elga-laborparameterergaenzung",
            "code": "200",
            "display": "Blutgasanalytik",
            "contains": [
              {
                "system": "https://termgit.elga.gv.at/CodeSystem-elga-laborparameterergaenzung",
                "code": "02060",
                "display": "Blutgasanalyse arteriell"
              },
              {
                "system": "https://termgit.elga.gv.at/CodeSystem-elga-laborparameterergaenzung",
                "code": "02070",
                "display": "Hb-Derivate arteriell"
              },
              {
                "system": "https://termgit.elga.gv.at/CodeSystem-elga-laborparameterergaenzung",
                "code": "02080",
                "display": "Blutgasanalyse ven\u00f6s"
              },
              {
                "system": "https://termgit.elga.gv.at/CodeSystem-elga-laborparameterergaenzung",
                "code": "02090",
                "display": "Hb-Derivate ven\u00f6s"
              },
              {
                "system": "https://termgit.elga.gv.at/CodeSystem-elga-laborparameterergaenzung",
                "code": "02100",
                "display": "Blutgasanalyse kapill\u00e4r"
              },
              {
                "system": "https://termgit.elga.gv.at/CodeSystem-elga-laborparameterergaenzung",
                "code": "02110",
                "display": "Hb-Derivate kapill\u00e4r"
              },
              {
                "system": "https://termgit.elga.gv.at/CodeSystem-elga-laborparameterergaenzung",
                "code": "02120",
                "display": "Hb-Derivate, gemischtven\u00f6s (Rechtsherzkatheter)"
              },
              {
                "system": "https://termgit.elga.gv.at/CodeSystem-elga-laborparameterergaenzung",
                "code": "02130",
                "display": "BGA Sonstiges"
              }
            ]
          },
          {
            "system": "https://termgit.elga.gv.at/CodeSystem-elga-laborparameterergaenzung",
            "code": "300",
            "display": "H\u00e4matologie",
            "contains": [
              {
                "system": "https://termgit.elga.gv.at/CodeSystem-elga-laborparameterergaenzung",
                "code": "03010",
                "display": "Blutbild"
              },
              {
                "system": "https://termgit.elga.gv.at/CodeSystem-elga-laborparameterergaenzung",
                "code": "03020",
                "display": "Knochenmark Morphologie"
              },
              {
                "system": "https://termgit.elga.gv.at/CodeSystem-elga-laborparameterergaenzung",
                "code": "03030",
                "display": "Immunph\u00e4notypisierung"
              },
              {
                "system": "https://termgit.elga.gv.at/CodeSystem-elga-laborparameterergaenzung",
                "code": "03050",
                "display": "H\u00e4matologie Sonstiges"
              }
            ]
          },
          {
            "system": "https://termgit.elga.gv.at/CodeSystem-elga-laborparameterergaenzung",
            "code": "400",
            "display": "Gerinnung/H\u00e4mostaseologie",
            "contains": [
              {
                "system": "https://termgit.elga.gv.at/CodeSystem-elga-laborparameterergaenzung",
                "code": "04140",
                "display": "H\u00e4mostaseologie Globaltests"
              },
              {
                "system": "https://termgit.elga.gv.at/CodeSystem-elga-laborparameterergaenzung",
                "code": "04150",
                "display": "Einzelfaktoranalysen"
              },
              {
                "system": "https://termgit.elga.gv.at/CodeSystem-elga-laborparameterergaenzung",
                "code": "04160",
                "display": "Thrombophilie Tests"
              },
              {
                "system": "https://termgit.elga.gv.at/CodeSystem-elga-laborparameterergaenzung",
                "code": "04170",
                "display": "Gerinnung Sonstiges"
              }
            ]
          },
          {
            "system": "https://termgit.elga.gv.at/CodeSystem-elga-laborparameterergaenzung",
            "code": "500",
            "display": "Klinische Chemie/Proteindiagnostik",
            "contains": [
              {
                "system": "https://termgit.elga.gv.at/CodeSystem-elga-laborparameterergaenzung",
                "code": "05180",
                "display": "Klinische Chemie"
              },
              {
                "system": "https://termgit.elga.gv.at/CodeSystem-elga-laborparameterergaenzung",
                "code": "05190",
                "display": "Proteindiagnostik"
              },
              {
                "system": "https://termgit.elga.gv.at/CodeSystem-elga-laborparameterergaenzung",
                "code": "05200",
                "display": "Spurenelemente"
              },
              {
                "system": "https://termgit.elga.gv.at/CodeSystem-elga-laborparameterergaenzung",
                "code": "05210",
                "display": "Sondermaterialien"
              },
              {
                "system": "https://termgit.elga.gv.at/CodeSystem-elga-laborparameterergaenzung",
                "code": "05220",
                "display": "Unters. bei Stoffwechselerkrankungen"
              }
            ]
          },
          {
            "system": "https://termgit.elga.gv.at/CodeSystem-elga-laborparameterergaenzung",
            "code": "600",
            "display": "Hormone/Vitamine/Tumormarker",
            "contains": [
              {
                "system": "https://termgit.elga.gv.at/CodeSystem-elga-laborparameterergaenzung",
                "code": "06330",
                "display": "Hormone"
              },
              {
                "system": "https://termgit.elga.gv.at/CodeSystem-elga-laborparameterergaenzung",
                "code": "06340",
                "display": "Vitamine"
              },
              {
                "system": "https://termgit.elga.gv.at/CodeSystem-elga-laborparameterergaenzung",
                "code": "06350",
                "display": "Tumormarker"
              }
            ]
          },
          {
            "system": "https://termgit.elga.gv.at/CodeSystem-elga-laborparameterergaenzung",
            "code": "900",
            "display": "Toxikologie",
            "contains": [
              {
                "system": "https://termgit.elga.gv.at/CodeSystem-elga-laborparameterergaenzung",
                "code": "07230",
                "display": "Urin-Screening"
              },
              {
                "system": "https://termgit.elga.gv.at/CodeSystem-elga-laborparameterergaenzung",
                "code": "07240",
                "display": "Blut"
              },
              {
                "system": "https://termgit.elga.gv.at/CodeSystem-elga-laborparameterergaenzung",
                "code": "07250",
                "display": "Toxikologie Sonstiges"
              }
            ]
          },
          {
            "system": "https://termgit.elga.gv.at/CodeSystem-elga-laborparameterergaenzung",
            "code": "1000",
            "display": "Medikamente",
            "contains": [
              {
                "system": "https://termgit.elga.gv.at/CodeSystem-elga-laborparameterergaenzung",
                "code": "08260",
                "display": "Antibiotika"
              },
              {
                "system": "https://termgit.elga.gv.at/CodeSystem-elga-laborparameterergaenzung",
                "code": "08270",
                "display": "Virostatika"
              },
              {
                "system": "https://termgit.elga.gv.at/CodeSystem-elga-laborparameterergaenzung",
                "code": "08280",
                "display": "Antiepileptika"
              },
              {
                "system": "https://termgit.elga.gv.at/CodeSystem-elga-laborparameterergaenzung",
                "code": "08290",
                "display": "Psychopharmaka"
              },
              {
                "system": "https://termgit.elga.gv.at/CodeSystem-elga-laborparameterergaenzung",
                "code": "08300",
                "display": "Kardiaka"
              },
              {
                "system": "https://termgit.elga.gv.at/CodeSystem-elga-laborparameterergaenzung",
                "code": "08310",
                "display": "Immunsuppressiva"
              },
              {
                "system": "https://termgit.elga.gv.at/CodeSystem-elga-laborparameterergaenzung",
                "code": "08320",
                "display": "Medikamente Sonstiges"
              }
            ]
          },
          {
            "system": "https://termgit.elga.gv.at/CodeSystem-elga-laborparameterergaenzung",
            "code": "1100",
            "display": "Infektionsdiagnostik",
            "contains": [
              {
                "system": "https://termgit.elga.gv.at/CodeSystem-elga-laborparameterergaenzung",
                "code": "10780",
                "display": "Virologie"
              },
              {
                "system": "https://termgit.elga.gv.at/CodeSystem-elga-laborparameterergaenzung",
                "code": "10790",
                "display": "Bakteriologie"
              },
              {
                "system": "https://termgit.elga.gv.at/CodeSystem-elga-laborparameterergaenzung",
                "code": "10800",
                "display": "Mykologie"
              },
              {
                "system": "https://termgit.elga.gv.at/CodeSystem-elga-laborparameterergaenzung",
                "code": "10810",
                "display": "Parasitologie"
              },
              {
                "system": "https://termgit.elga.gv.at/CodeSystem-elga-laborparameterergaenzung",
                "code": "10820",
                "display": "Makroskopie/Mikroskopie"
              }
            ]
          },
          {
            "system": "https://termgit.elga.gv.at/CodeSystem-elga-laborparameterergaenzung",
            "code": "1300",
            "display": "Autoimmundiagnostik",
            "contains": [
              {
                "system": "https://termgit.elga.gv.at/CodeSystem-elga-laborparameterergaenzung",
                "code": "11360",
                "display": "Rheumatoide Arthritis-assoziierte Autoantik\u00f6rper"
              },
              {
                "system": "https://termgit.elga.gv.at/CodeSystem-elga-laborparameterergaenzung",
                "code": "11370",
                "display": "Kollagenose-assoziierte Autoantik\u00f6rper"
              },
              {
                "system": "https://termgit.elga.gv.at/CodeSystem-elga-laborparameterergaenzung",
                "code": "11380",
                "display": "Myositis-assoziierte Autoantik\u00f6rper"
              },
              {
                "system": "https://termgit.elga.gv.at/CodeSystem-elga-laborparameterergaenzung",
                "code": "11390",
                "display": "Lebererkrankungen-assoziierte Autoantik\u00f6rper"
              },
              {
                "system": "https://termgit.elga.gv.at/CodeSystem-elga-laborparameterergaenzung",
                "code": "11400",
                "display": "Pernizi\u00f6se An\u00e4mie assoziierte Autoantik\u00f6rper"
              },
              {
                "system": "https://termgit.elga.gv.at/CodeSystem-elga-laborparameterergaenzung",
                "code": "11410",
                "display": "Vasculitis-assoziierte Antik\u00f6rper"
              },
              {
                "system": "https://termgit.elga.gv.at/CodeSystem-elga-laborparameterergaenzung",
                "code": "11420",
                "display": "Goodpasture Syndrom assoziierte Autoantik\u00f6rper"
              },
              {
                "system": "https://termgit.elga.gv.at/CodeSystem-elga-laborparameterergaenzung",
                "code": "11430",
                "display": "IBD assoziierte Autoantik\u00f6rper"
              },
              {
                "system": "https://termgit.elga.gv.at/CodeSystem-elga-laborparameterergaenzung",
                "code": "11440",
                "display": "Z\u00f6liakie assoziierte Autoantik\u00f6rper"
              },
              {
                "system": "https://termgit.elga.gv.at/CodeSystem-elga-laborparameterergaenzung",
                "code": "11450",
                "display": "Diabetes Mellitus assoziierte Autoantik\u00f6rper"
              },
              {
                "system": "https://termgit.elga.gv.at/CodeSystem-elga-laborparameterergaenzung",
                "code": "11460",
                "display": "Paraneoplasie assoziierte Autoantik\u00f6rper"
              },
              {
                "system": "https://termgit.elga.gv.at/CodeSystem-elga-laborparameterergaenzung",
                "code": "11470",
                "display": "Sonstige Autoantik\u00f6rper"
              }
            ]
          },
          {
            "system": "https://termgit.elga.gv.at/CodeSystem-elga-laborparameterergaenzung",
            "code": "1800",
            "display": "Allergiediagnostik",
            "contains": [
              {
                "system": "https://termgit.elga.gv.at/CodeSystem-elga-laborparameterergaenzung",
                "code": "12010",
                "display": "Globalmarker"
              },
              {
                "system": "https://termgit.elga.gv.at/CodeSystem-elga-laborparameterergaenzung",
                "code": "12020",
                "display": "Inhalationsallergene IgE"
              },
              {
                "system": "https://termgit.elga.gv.at/CodeSystem-elga-laborparameterergaenzung",
                "code": "12030",
                "display": "Nahrungsmittelallergene IgE"
              },
              {
                "system": "https://termgit.elga.gv.at/CodeSystem-elga-laborparameterergaenzung",
                "code": "12040",
                "display": "Umwelt- und Berufsallergene IgE"
              },
              {
                "system": "https://termgit.elga.gv.at/CodeSystem-elga-laborparameterergaenzung",
                "code": "12050",
                "display": "Medikamente IgE"
              },
              {
                "system": "https://termgit.elga.gv.at/CodeSystem-elga-laborparameterergaenzung",
                "code": "12060",
                "display": "Insekten und Insektengifte IgE"
              },
              {
                "system": "https://termgit.elga.gv.at/CodeSystem-elga-laborparameterergaenzung",
                "code": "12070",
                "display": "Sonstige IgE"
              },
              {
                "system": "https://termgit.elga.gv.at/CodeSystem-elga-laborparameterergaenzung",
                "code": "12080",
                "display": "Allergiechip IgE"
              },
              {
                "system": "https://termgit.elga.gv.at/CodeSystem-elga-laborparameterergaenzung",
                "code": "12090",
                "display": "IgG Antigene"
              }
            ]
          },
          {
            "system": "https://termgit.elga.gv.at/CodeSystem-elga-laborparameterergaenzung",
            "code": "1400",
            "display": "Urindiagnostik",
            "contains": [
              {
                "system": "https://termgit.elga.gv.at/CodeSystem-elga-laborparameterergaenzung",
                "code": "13730",
                "display": "Urinstreifen"
              },
              {
                "system": "https://termgit.elga.gv.at/CodeSystem-elga-laborparameterergaenzung",
                "code": "13740",
                "display": "Urinsediment"
              },
              {
                "system": "https://termgit.elga.gv.at/CodeSystem-elga-laborparameterergaenzung",
                "code": "13750",
                "display": "Urinchemie"
              }
            ]
          },
          {
            "system": "https://termgit.elga.gv.at/CodeSystem-elga-laborparameterergaenzung",
            "code": "1500",
            "display": "Stuhldiagnostik",
            "contains": [
              {
                "system": "https://termgit.elga.gv.at/CodeSystem-elga-laborparameterergaenzung",
                "code": "14760",
                "display": "Stuhldiagnostik"
              }
            ]
          },
          {
            "system": "https://termgit.elga.gv.at/CodeSystem-elga-laborparameterergaenzung",
            "code": "1600",
            "display": "Liquordiagnostik",
            "contains": [
              {
                "system": "https://termgit.elga.gv.at/CodeSystem-elga-laborparameterergaenzung",
                "code": "15770",
                "display": "Liquordiagnostik"
              }
            ]
          },
          {
            "system": "https://termgit.elga.gv.at/CodeSystem-elga-laborparameterergaenzung",
            "code": "2300",
            "display": "Genetische Diagnostik",
            "contains": [
              {
                "system": "https://termgit.elga.gv.at/CodeSystem-elga-laborparameterergaenzung",
                "code": "16830",
                "display": "Pharmakogenetik"
              },
              {
                "system": "https://termgit.elga.gv.at/CodeSystem-elga-laborparameterergaenzung",
                "code": "16840",
                "display": "Humangenetik"
              },
              {
                "system": "https://termgit.elga.gv.at/CodeSystem-elga-laborparameterergaenzung",
                "code": "16841",
                "display": "H\u00e4matologische Genetik"
              }
            ]
          },
          {
            "system": "https://termgit.elga.gv.at/CodeSystem-elga-laborparameterergaenzung",
            "code": "2500",
            "display": "Sonstige",
            "contains": [
              {
                "system": "https://termgit.elga.gv.at/CodeSystem-elga-laborparameterergaenzung",
                "code": "17880",
                "display": "Zytologie"
              },
              {
                "system": "https://termgit.elga.gv.at/CodeSystem-elga-laborparameterergaenzung",
                "code": "17890",
                "display": "Sonstige"
              }
            ]
          },
          {
            "system": "https://termgit.elga.gv.at/CodeSystem-elga-laborparameterergaenzung",
            "code": "20",
            "display": "Befundbewertung"
          }
        ]
      }
    ]
  }
}