"resource";"url";"version";"name";"title";"status";"description";"identifier";"date";"contact";"count"
"ValueSet";"https://termgit.elga.gv.at/ValueSet-elga-auditparticipantobjecttype";"3.0";"elga-auditparticipantobjecttype";"ELGA_AuditParticipantObjectType";"active";"**Beschreibung:** Codeliste der ELGA spezifischen Audit Participant Object Type Codes. Der Audit Participant Object Type beschreibt die Art eines Objekts, welches im Audit Event referenziert ist.";"1.2.40.0.34.10.154";"2015-06-01";"|url|www.elga.gv.at";"4"

"system";"code";"display"
"https://termgit.elga.gv.at/CodeSystem-elga-auditparticipantobjecttype";"100";"Policy"
"https://termgit.elga.gv.at/CodeSystem-elga-auditparticipantobjecttype";"110";"Kontaktbestätigung"
"https://termgit.elga.gv.at/CodeSystem-elga-auditparticipantobjecttype";"120";"Security Token"
"https://termgit.elga.gv.at/CodeSystem-elga-auditparticipantobjecttype";"130";"Vollmacht"