'code';'codeSystem';'displayName';'parentCodeSystemName';'concept_Beschreibung';'meaning';'hints';'orderNumber';'level';'type';'relationships';'einheit print';'einheit codiert'
'111636';'1.2.840.10008.2.16.4';'Entrance Exposure at RP';'https://termgit.elga.gv.at/CodeSystem-dcm';'';'Eingangsdosis';'';'1';'0';'L';'';'mGy';'mGy'
'111637';'1.2.840.10008.2.16.4';'Accumulated Average Glandular Dose';'https://termgit.elga.gv.at/CodeSystem-dcm';'';'Mittlere Parenchymdosis (AGD)';'';'2';'0';'L';'';'mGy';'mGy'
'113507';'1.2.840.10008.2.16.4';'Administered activity';'https://termgit.elga.gv.at/CodeSystem-dcm';'';'Applizierte Aktivität';'';'3';'0';'L';'';'MBq';'MBq'
'113722';'1.2.840.10008.2.16.4';'Dose Area Product Total';'https://termgit.elga.gv.at/CodeSystem-dcm';'';'Dosisflächenprodukt (DAP)';'';'4';'0';'L';'';'cGym²';'cGy.m2'
'113813';'1.2.840.10008.2.16.4';'CT Dose Length Product Total';'https://termgit.elga.gv.at/CodeSystem-dcm';'';'Dosislängenprodukt (DLP)';'';'5';'0';'L';'';'mGycm';'mGy.cm'
'113839';'1.2.840.10008.2.16.4';'Effective Dose';'https://termgit.elga.gv.at/CodeSystem-dcm';'';'Effektive Dosis';'';'6';'0';'L';'';'mSv';'mSv'
