"resource";"url";"version";"name";"title";"status";"description";"identifier";"date";"contact";"count"
"ValueSet";"https://termgit.elga.gv.at/ValueSet-elga-laborstruktur";"4.3";"elga-laborstruktur";"ELGA_Laborstruktur";"active";"**Description:** Structure of an Austrian laboratory report. Three hierarchical levels: 'Allgemeiner Befund', 'Bereiche' and 'Gruppen'

**Beschreibung:** Struktur eines österreichischen Laborbefundes. Drei Hierarchiebenenen: 'Allgemeiner Befund', 'Bereiche' und 'Gruppen'";"1.2.40.0.34.10.47";"2018-01-18";"|url|http://www.elga.gv.at";"92"

"system";"code";"display"
"https://termgit.elga.gv.at/CodeSystem-elga-laborparameterergaenzung";"1";"Allgemeiner Laborbefund"
"https://termgit.elga.gv.at/CodeSystem-elga-laborparameterergaenzung";"10";"Probeninformation"
"https://termgit.elga.gv.at/CodeSystem-elga-laborparameterergaenzung";"100";"Blutgruppenserologie"
"https://termgit.elga.gv.at/CodeSystem-elga-laborparameterergaenzung";"01850";"Blutgruppenserologie"
"https://termgit.elga.gv.at/CodeSystem-elga-laborparameterergaenzung";"01860";"HLA-Diagnostik"
"https://termgit.elga.gv.at/CodeSystem-elga-laborparameterergaenzung";"01870";"HPA-Diagnostik"
"https://termgit.elga.gv.at/CodeSystem-elga-laborparameterergaenzung";"200";"Blutgasanalytik"
"https://termgit.elga.gv.at/CodeSystem-elga-laborparameterergaenzung";"02060";"Blutgasanalyse arteriell"
"https://termgit.elga.gv.at/CodeSystem-elga-laborparameterergaenzung";"02070";"Hb-Derivate arteriell"
"https://termgit.elga.gv.at/CodeSystem-elga-laborparameterergaenzung";"02080";"Blutgasanalyse venös"
"https://termgit.elga.gv.at/CodeSystem-elga-laborparameterergaenzung";"02090";"Hb-Derivate venös"
"https://termgit.elga.gv.at/CodeSystem-elga-laborparameterergaenzung";"02100";"Blutgasanalyse kapillär"
"https://termgit.elga.gv.at/CodeSystem-elga-laborparameterergaenzung";"02110";"Hb-Derivate kapillär"
"https://termgit.elga.gv.at/CodeSystem-elga-laborparameterergaenzung";"02120";"Hb-Derivate, gemischtvenös (Rechtsherzkatheter)"
"https://termgit.elga.gv.at/CodeSystem-elga-laborparameterergaenzung";"02130";"BGA Sonstiges"
"https://termgit.elga.gv.at/CodeSystem-elga-laborparameterergaenzung";"300";"Hämatologie"
"https://termgit.elga.gv.at/CodeSystem-elga-laborparameterergaenzung";"03010";"Blutbild"
"https://termgit.elga.gv.at/CodeSystem-elga-laborparameterergaenzung";"03020";"Knochenmark Morphologie"
"https://termgit.elga.gv.at/CodeSystem-elga-laborparameterergaenzung";"03030";"Immunphänotypisierung"
"https://termgit.elga.gv.at/CodeSystem-elga-laborparameterergaenzung";"03050";"Hämatologie Sonstiges"
"https://termgit.elga.gv.at/CodeSystem-elga-laborparameterergaenzung";"400";"Gerinnung/Hämostaseologie"
"https://termgit.elga.gv.at/CodeSystem-elga-laborparameterergaenzung";"04140";"Hämostaseologie Globaltests"
"https://termgit.elga.gv.at/CodeSystem-elga-laborparameterergaenzung";"04150";"Einzelfaktoranalysen"
"https://termgit.elga.gv.at/CodeSystem-elga-laborparameterergaenzung";"04160";"Thrombophilie Tests"
"https://termgit.elga.gv.at/CodeSystem-elga-laborparameterergaenzung";"04170";"Gerinnung Sonstiges"
"https://termgit.elga.gv.at/CodeSystem-elga-laborparameterergaenzung";"500";"Klinische Chemie/Proteindiagnostik"
"https://termgit.elga.gv.at/CodeSystem-elga-laborparameterergaenzung";"05180";"Klinische Chemie"
"https://termgit.elga.gv.at/CodeSystem-elga-laborparameterergaenzung";"05190";"Proteindiagnostik"
"https://termgit.elga.gv.at/CodeSystem-elga-laborparameterergaenzung";"05200";"Spurenelemente"
"https://termgit.elga.gv.at/CodeSystem-elga-laborparameterergaenzung";"05210";"Sondermaterialien"
"https://termgit.elga.gv.at/CodeSystem-elga-laborparameterergaenzung";"05220";"Unters. bei Stoffwechselerkrankungen"
"https://termgit.elga.gv.at/CodeSystem-elga-laborparameterergaenzung";"600";"Hormone/Vitamine/Tumormarker"
"https://termgit.elga.gv.at/CodeSystem-elga-laborparameterergaenzung";"06330";"Hormone"
"https://termgit.elga.gv.at/CodeSystem-elga-laborparameterergaenzung";"06340";"Vitamine"
"https://termgit.elga.gv.at/CodeSystem-elga-laborparameterergaenzung";"06350";"Tumormarker"
"https://termgit.elga.gv.at/CodeSystem-elga-laborparameterergaenzung";"900";"Toxikologie"
"https://termgit.elga.gv.at/CodeSystem-elga-laborparameterergaenzung";"07230";"Urin-Screening"
"https://termgit.elga.gv.at/CodeSystem-elga-laborparameterergaenzung";"07240";"Blut"
"https://termgit.elga.gv.at/CodeSystem-elga-laborparameterergaenzung";"07250";"Toxikologie Sonstiges"
"https://termgit.elga.gv.at/CodeSystem-elga-laborparameterergaenzung";"1000";"Medikamente"
"https://termgit.elga.gv.at/CodeSystem-elga-laborparameterergaenzung";"08260";"Antibiotika"
"https://termgit.elga.gv.at/CodeSystem-elga-laborparameterergaenzung";"08270";"Virostatika"
"https://termgit.elga.gv.at/CodeSystem-elga-laborparameterergaenzung";"08280";"Antiepileptika"
"https://termgit.elga.gv.at/CodeSystem-elga-laborparameterergaenzung";"08290";"Psychopharmaka"
"https://termgit.elga.gv.at/CodeSystem-elga-laborparameterergaenzung";"08300";"Kardiaka"
"https://termgit.elga.gv.at/CodeSystem-elga-laborparameterergaenzung";"08310";"Immunsuppressiva"
"https://termgit.elga.gv.at/CodeSystem-elga-laborparameterergaenzung";"08320";"Medikamente Sonstiges"
"https://termgit.elga.gv.at/CodeSystem-elga-laborparameterergaenzung";"1100";"Infektionsdiagnostik"
"https://termgit.elga.gv.at/CodeSystem-elga-laborparameterergaenzung";"10780";"Virologie"
"https://termgit.elga.gv.at/CodeSystem-elga-laborparameterergaenzung";"10790";"Bakteriologie"
"https://termgit.elga.gv.at/CodeSystem-elga-laborparameterergaenzung";"10800";"Mykologie"
"https://termgit.elga.gv.at/CodeSystem-elga-laborparameterergaenzung";"10810";"Parasitologie"
"https://termgit.elga.gv.at/CodeSystem-elga-laborparameterergaenzung";"10820";"Makroskopie/Mikroskopie"
"https://termgit.elga.gv.at/CodeSystem-elga-laborparameterergaenzung";"1300";"Autoimmundiagnostik"
"https://termgit.elga.gv.at/CodeSystem-elga-laborparameterergaenzung";"11360";"Rheumatoide Arthritis-assoziierte Autoantikörper"
"https://termgit.elga.gv.at/CodeSystem-elga-laborparameterergaenzung";"11370";"Kollagenose-assoziierte Autoantikörper"
"https://termgit.elga.gv.at/CodeSystem-elga-laborparameterergaenzung";"11380";"Myositis-assoziierte Autoantikörper"
"https://termgit.elga.gv.at/CodeSystem-elga-laborparameterergaenzung";"11390";"Lebererkrankungen-assoziierte Autoantikörper"
"https://termgit.elga.gv.at/CodeSystem-elga-laborparameterergaenzung";"11400";"Perniziöse Anämie assoziierte Autoantikörper"
"https://termgit.elga.gv.at/CodeSystem-elga-laborparameterergaenzung";"11410";"Vasculitis-assoziierte Antikörper"
"https://termgit.elga.gv.at/CodeSystem-elga-laborparameterergaenzung";"11420";"Goodpasture Syndrom assoziierte Autoantikörper"
"https://termgit.elga.gv.at/CodeSystem-elga-laborparameterergaenzung";"11430";"IBD assoziierte Autoantikörper"
"https://termgit.elga.gv.at/CodeSystem-elga-laborparameterergaenzung";"11440";"Zöliakie assoziierte Autoantikörper"
"https://termgit.elga.gv.at/CodeSystem-elga-laborparameterergaenzung";"11450";"Diabetes Mellitus assoziierte Autoantikörper"
"https://termgit.elga.gv.at/CodeSystem-elga-laborparameterergaenzung";"11460";"Paraneoplasie assoziierte Autoantikörper"
"https://termgit.elga.gv.at/CodeSystem-elga-laborparameterergaenzung";"11470";"Sonstige Autoantikörper"
"https://termgit.elga.gv.at/CodeSystem-elga-laborparameterergaenzung";"1800";"Allergiediagnostik"
"https://termgit.elga.gv.at/CodeSystem-elga-laborparameterergaenzung";"12010";"Globalmarker"
"https://termgit.elga.gv.at/CodeSystem-elga-laborparameterergaenzung";"12020";"Inhalationsallergene IgE"
"https://termgit.elga.gv.at/CodeSystem-elga-laborparameterergaenzung";"12030";"Nahrungsmittelallergene IgE"
"https://termgit.elga.gv.at/CodeSystem-elga-laborparameterergaenzung";"12040";"Umwelt- und Berufsallergene IgE"
"https://termgit.elga.gv.at/CodeSystem-elga-laborparameterergaenzung";"12050";"Medikamente IgE"
"https://termgit.elga.gv.at/CodeSystem-elga-laborparameterergaenzung";"12060";"Insekten und Insektengifte IgE"
"https://termgit.elga.gv.at/CodeSystem-elga-laborparameterergaenzung";"12070";"Sonstige IgE"
"https://termgit.elga.gv.at/CodeSystem-elga-laborparameterergaenzung";"12080";"Allergiechip IgE"
"https://termgit.elga.gv.at/CodeSystem-elga-laborparameterergaenzung";"12090";"IgG Antigene"
"https://termgit.elga.gv.at/CodeSystem-elga-laborparameterergaenzung";"1400";"Urindiagnostik"
"https://termgit.elga.gv.at/CodeSystem-elga-laborparameterergaenzung";"13730";"Urinstreifen"
"https://termgit.elga.gv.at/CodeSystem-elga-laborparameterergaenzung";"13740";"Urinsediment"
"https://termgit.elga.gv.at/CodeSystem-elga-laborparameterergaenzung";"13750";"Urinchemie"
"https://termgit.elga.gv.at/CodeSystem-elga-laborparameterergaenzung";"1500";"Stuhldiagnostik"
"https://termgit.elga.gv.at/CodeSystem-elga-laborparameterergaenzung";"14760";"Stuhldiagnostik"
"https://termgit.elga.gv.at/CodeSystem-elga-laborparameterergaenzung";"1600";"Liquordiagnostik"
"https://termgit.elga.gv.at/CodeSystem-elga-laborparameterergaenzung";"15770";"Liquordiagnostik"
"https://termgit.elga.gv.at/CodeSystem-elga-laborparameterergaenzung";"2300";"Genetische Diagnostik"
"https://termgit.elga.gv.at/CodeSystem-elga-laborparameterergaenzung";"16830";"Pharmakogenetik"
"https://termgit.elga.gv.at/CodeSystem-elga-laborparameterergaenzung";"16840";"Humangenetik"
"https://termgit.elga.gv.at/CodeSystem-elga-laborparameterergaenzung";"16841";"Hämatologische Genetik"
"https://termgit.elga.gv.at/CodeSystem-elga-laborparameterergaenzung";"2500";"Sonstige"
"https://termgit.elga.gv.at/CodeSystem-elga-laborparameterergaenzung";"17880";"Zytologie"
"https://termgit.elga.gv.at/CodeSystem-elga-laborparameterergaenzung";"17890";"Sonstige"
"https://termgit.elga.gv.at/CodeSystem-elga-laborparameterergaenzung";"20";"Befundbewertung"