{
  "resourceType": "CodeSystem",
  "id": "appc-modalitaet",
  "url": "https://termgit.elga.gv.at/CodeSystem-appc-modalitaet",
  "identifier": [
    {
      "use": "official",
      "system": "urn:ietf:rfc:3986",
      "value": "urn:oid:1.2.40.0.34.5.38.1"
    }
  ],
  "version": "202008",
  "name": "appc-modalitaet",
  "title": "APPC_Modalitaet",
  "status": "active",
  "date": "2020-08-18",
  "contact": [
    {
      "telecom": [
        {
          "system": "url",
          "value": "http://www.bura.at/appc/"
        }
      ]
    }
  ],
  "description": "**Description:** Code List for all APPC-Codes for 1st Axis: Modality\n\n**Beschreibung:** Code Liste aller Codes der 1. APPC-Achse: Modalit\u00e4t",
  "content": "complete",
  "count": 16,
  "property": [
    {
      "code": "child",
      "type": "code"
    },
    {
      "code": "parent",
      "type": "code"
    }
  ],
  "concept": [
    {
      "code": "0",
      "display": "Modalitaet unbestimmt",
      "designation": [
        {
          "language": "de-AT",
          "value": "Modalitaet unbestimmt"
        }
      ]
    },
    {
      "code": "1",
      "display": "R\u00f6ntgen",
      "designation": [
        {
          "language": "de-AT",
          "value": "R\u00f6ntgenaufnahme"
        }
      ]
    },
    {
      "code": "10",
      "display": "Fotografische Dokumentation",
      "designation": [
        {
          "language": "de-AT",
          "value": "Fotografische Dokumentation"
        }
      ]
    },
    {
      "code": "11",
      "display": "Video Dokumentation",
      "designation": [
        {
          "language": "de-AT",
          "value": "Video Dokumentation"
        }
      ]
    },
    {
      "code": "2",
      "display": "CT",
      "designation": [
        {
          "language": "de-AT",
          "value": "Computer-Tomographie"
        }
      ]
    },
    {
      "code": "3",
      "display": "MRT",
      "designation": [
        {
          "language": "de-AT",
          "value": "Magnetresonanz-Tomographie"
        }
      ]
    },
    {
      "code": "4",
      "display": "US",
      "designation": [
        {
          "language": "de-AT",
          "value": "Ultraschalluntersuchung (Sonographie)"
        }
      ]
    },
    {
      "code": "5",
      "display": "NUK",
      "designation": [
        {
          "language": "de-AT",
          "value": "Nuklearmedizinische Untersuchung"
        }
      ]
    },
    {
      "code": "6",
      "display": "PET",
      "designation": [
        {
          "language": "de-AT",
          "value": "Positronen-Emissions-Tomographie"
        }
      ]
    },
    {
      "code": "7",
      "display": "Endoskopie",
      "designation": [
        {
          "language": "de-AT",
          "value": "Endoskopie"
        }
      ],
      "property": [
        {
          "code": "child",
          "valueCode": "7-1"
        },
        {
          "code": "child",
          "valueCode": "7-2"
        }
      ]
    },
    {
      "code": "7-1",
      "display": "Kapselendoskopie",
      "designation": [
        {
          "language": "de-AT",
          "value": "Kapselendoskopie"
        }
      ],
      "property": [
        {
          "code": "parent",
          "valueCode": "7"
        }
      ]
    },
    {
      "code": "7-2",
      "display": "Konfokale Laserendomikroskopie",
      "designation": [
        {
          "language": "de-AT",
          "value": "Konfokale Laserendomikroskopie"
        }
      ],
      "property": [
        {
          "code": "parent",
          "valueCode": "7"
        }
      ]
    },
    {
      "code": "8",
      "display": "Mikroskopische Untersuchung",
      "designation": [
        {
          "language": "de-AT",
          "value": "Mikroskopische Untersuchung"
        }
      ]
    },
    {
      "code": "9",
      "display": "Optische Koh\u00e4renztomografie",
      "designation": [
        {
          "language": "de-AT",
          "value": "Optische Koh\u00e4renztomografie"
        }
      ]
    },
    {
      "code": "999",
      "display": "Keine Modalit\u00e4t",
      "designation": [
        {
          "language": "de-AT",
          "value": "Keine Modalit\u00e4t"
        }
      ],
      "property": [
        {
          "code": "child",
          "valueCode": "999-1"
        }
      ]
    },
    {
      "code": "999-1",
      "display": "Keine Modalit\u00e4t - Studie entfernt",
      "designation": [
        {
          "language": "de-AT",
          "value": "Keine Modalit\u00e4t - Studie entfernt"
        }
      ],
      "property": [
        {
          "code": "parent",
          "valueCode": "999"
        }
      ]
    }
  ]
}