'code';'codeSystem';'displayName';'parentCode';'concept_Beschreibung';'meaning';'hints';'level';'type';'relationships'
'1';'1.2.40.0.34.5.86';'1';;;;;'0';'L';
'10';'1.2.40.0.34.5.86';'10';;;;;'0';'L';
'11';'1.2.40.0.34.5.86';'11';;;;;'0';'L';
'12';'1.2.40.0.34.5.86';'12';;;;;'0';'L';
'13';'1.2.40.0.34.5.86';'13';;;;;'0';'L';
'14';'1.2.40.0.34.5.86';'14';;;;;'0';'L';
'15';'1.2.40.0.34.5.86';'15';;;;;'0';'L';
'16';'1.2.40.0.34.5.86';'16';;;;;'0';'L';
'17';'1.2.40.0.34.5.86';'17';;;;;'0';'L';
'18';'1.2.40.0.34.5.86';'18';;;;;'0';'L';
'19';'1.2.40.0.34.5.86';'19';;;;;'0';'L';
'2';'1.2.40.0.34.5.86';'2';;;;;'0';'L';
'20';'1.2.40.0.34.5.86';'20';;;;;'0';'L';
'21';'1.2.40.0.34.5.86';'21';;;;;'0';'L';
'21_28';'1.2.40.0.34.5.86';'21/28';;;;;'0';'L';
'22';'1.2.40.0.34.5.86';'22';;;;;'0';'L';
'23';'1.2.40.0.34.5.86';'23';;;;;'0';'L';
'24';'1.2.40.0.34.5.86';'24';;;;;'0';'L';
'25';'1.2.40.0.34.5.86';'25';;;;;'0';'L';
'26';'1.2.40.0.34.5.86';'26';;;;;'0';'L';
'27';'1.2.40.0.34.5.86';'27';;;;;'0';'L';
'28';'1.2.40.0.34.5.86';'28';;;;;'0';'L';
'29';'1.2.40.0.34.5.86';'29';;;;;'0';'L';
'3';'1.2.40.0.34.5.86';'3';;;;;'0';'L';
'30';'1.2.40.0.34.5.86';'30';;;;;'0';'L';
'31';'1.2.40.0.34.5.86';'31';;;;;'0';'L';
'32';'1.2.40.0.34.5.86';'32';;;;;'0';'L';
'33';'1.2.40.0.34.5.86';'33';;;;;'0';'L';
'34';'1.2.40.0.34.5.86';'34';;;;;'0';'L';
'35';'1.2.40.0.34.5.86';'35';;;;;'0';'L';
'36';'1.2.40.0.34.5.86';'36';;;;;'0';'L';
'37';'1.2.40.0.34.5.86';'37';;;;;'0';'L';
'38';'1.2.40.0.34.5.86';'38';;;;;'0';'L';
'39';'1.2.40.0.34.5.86';'39';;;;;'0';'L';
'4';'1.2.40.0.34.5.86';'4';;;;;'0';'L';
'40';'1.2.40.0.34.5.86';'40';;;;;'0';'L';
'41';'1.2.40.0.34.5.86';'41';;;;;'0';'L';
'42';'1.2.40.0.34.5.86';'42';;;;;'0';'L';
'43';'1.2.40.0.34.5.86';'43';;;;;'0';'L';
'44';'1.2.40.0.34.5.86';'44';;;;;'0';'L';
'45';'1.2.40.0.34.5.86';'45';;;;;'0';'L';
'46';'1.2.40.0.34.5.86';'46';;;;;'0';'L';
'47';'1.2.40.0.34.5.86';'47';;;;;'0';'L';
'48';'1.2.40.0.34.5.86';'48';;;;;'0';'L';
'49';'1.2.40.0.34.5.86';'49';;;;;'0';'L';
'5';'1.2.40.0.34.5.86';'5';;;;;'0';'L';
'50';'1.2.40.0.34.5.86';'50';;;;;'0';'L';
'51';'1.2.40.0.34.5.86';'51';;;;;'0';'L';
'52';'1.2.40.0.34.5.86';'52';;;;;'0';'L';
'53';'1.2.40.0.34.5.86';'53';;;;;'0';'L';
'54';'1.2.40.0.34.5.86';'54';;;;;'0';'L';
'55';'1.2.40.0.34.5.86';'55';;;;;'0';'L';
'56';'1.2.40.0.34.5.86';'56';;;;;'0';'L';
'57';'1.2.40.0.34.5.86';'57';;;;;'0';'L';
'58';'1.2.40.0.34.5.86';'58';;;;;'0';'L';
'59';'1.2.40.0.34.5.86';'59';;;;;'0';'L';
'6';'1.2.40.0.34.5.86';'6';;;;;'0';'L';
'60';'1.2.40.0.34.5.86';'60';;;;;'0';'L';
'61';'1.2.40.0.34.5.86';'61';;;;;'0';'L';
'62';'1.2.40.0.34.5.86';'62';;;;;'0';'L';
'63';'1.2.40.0.34.5.86';'63';;;;;'0';'L';
'64';'1.2.40.0.34.5.86';'64';;;;;'0';'L';
'65';'1.2.40.0.34.5.86';'65';;;;;'0';'L';
'66';'1.2.40.0.34.5.86';'66';;;;;'0';'L';
'67';'1.2.40.0.34.5.86';'67';;;;;'0';'L';
'68';'1.2.40.0.34.5.86';'68';;;;;'0';'L';
'69';'1.2.40.0.34.5.86';'69';;;;;'0';'L';
'7';'1.2.40.0.34.5.86';'7';;;;;'0';'L';
'70';'1.2.40.0.34.5.86';'70';;;;;'0';'L';
'71';'1.2.40.0.34.5.86';'71';;;;;'0';'L';
'72';'1.2.40.0.34.5.86';'72';;;;;'0';'L';
'73';'1.2.40.0.34.5.86';'73';;;;;'0';'L';
'74';'1.2.40.0.34.5.86';'74';;;;;'0';'L';
'75';'1.2.40.0.34.5.86';'75';;;;;'0';'L';
'76';'1.2.40.0.34.5.86';'76';;;;;'0';'L';
'78';'1.2.40.0.34.5.86';'78';;;;;'0';'L';
'79';'1.2.40.0.34.5.86';'79';;;;;'0';'L';
'8';'1.2.40.0.34.5.86';'8';;;;;'0';'L';
'80';'1.2.40.0.34.5.86';'80';;;;;'0';'L';
'81';'1.2.40.0.34.5.86';'81';;;;;'0';'L';
'82';'1.2.40.0.34.5.86';'82';;;;;'0';'L';
'88';'1.2.40.0.34.5.86';'88';;;;;'0';'L';
'9';'1.2.40.0.34.5.86';'9';;;;;'0';'L';
'NA';'1.2.40.0.34.5.86';'Nicht Anwendbar';;;;;'0';'L';
'RDNC';'1.2.40.0.34.5.86';'RDNC';;;;;'0';'L';
