"resource";"url";"version";"name";"title";"status";"description";"identifier";"date";"count"
"ValueSet";"https://termgit.elga.gv.at/ValueSet-elga-medikationartanwendung";"20211126";"elga-medikationartanwendung";"ELGA_MedikationArtAnwendung";"active";"**Description:** Art der Anwendung (VS)

**Beschreibung:** Art der Anwendung (VS)";"1.2.40.0.34.10.66";"2021-11-26";"69"

"system";"code";"display"
"https://termgit.elga.gv.at/CodeSystem-medikationartanwendung";"100000073564";"Anwendung am Ohr"
"https://termgit.elga.gv.at/CodeSystem-medikationartanwendung";"100000073566";"Anwendung auf der Haut"
"https://termgit.elga.gv.at/CodeSystem-medikationartanwendung";"100000073567";"dentale Anwendung"
"https://termgit.elga.gv.at/CodeSystem-medikationartanwendung";"100000073568";"Badebehandlung"
"https://termgit.elga.gv.at/CodeSystem-medikationartanwendung";"100000073570";"Anwendung in den Nebenhöhlen"
"https://termgit.elga.gv.at/CodeSystem-medikationartanwendung";"100000073571";"endotracheopulmonale Anwendung"
"https://termgit.elga.gv.at/CodeSystem-medikationartanwendung";"100000073572";"epidurale Anwendung"
"https://termgit.elga.gv.at/CodeSystem-medikationartanwendung";"100000073573";"zum Auftragen auf die Wunde"
"https://termgit.elga.gv.at/CodeSystem-medikationartanwendung";"100000073577";"zur Anwendung mittels Magensonde"
"https://termgit.elga.gv.at/CodeSystem-medikationartanwendung";"100000073578";"Anwendung am Zahnfleisch"
"https://termgit.elga.gv.at/CodeSystem-medikationartanwendung";"100000073579";"Hämodialyse"
"https://termgit.elga.gv.at/CodeSystem-medikationartanwendung";"100000073584";"zur Inhalation"
"https://termgit.elga.gv.at/CodeSystem-medikationartanwendung";"100000073585";"intestinale Anwendung"
"https://termgit.elga.gv.at/CodeSystem-medikationartanwendung";"100000073587";"intraarterielle Anwendung"
"https://termgit.elga.gv.at/CodeSystem-medikationartanwendung";"100000073588";"intraartikuläre Anwendung"
"https://termgit.elga.gv.at/CodeSystem-medikationartanwendung";"100000073589";"intrabursale Anwendung"
"https://termgit.elga.gv.at/CodeSystem-medikationartanwendung";"100000073590";"intracardiale Anwendung"
"https://termgit.elga.gv.at/CodeSystem-medikationartanwendung";"100000073591";"intrakavernöse Anwendung"
"https://termgit.elga.gv.at/CodeSystem-medikationartanwendung";"100000073592";"Intrazerebrale Anwendung"
"https://termgit.elga.gv.at/CodeSystem-medikationartanwendung";"100000073593";"intrazervikale Anwendung"
"https://termgit.elga.gv.at/CodeSystem-medikationartanwendung";"100000073595";"intradermale Anwendung"
"https://termgit.elga.gv.at/CodeSystem-medikationartanwendung";"100000073597";"intraläsionale Anwendung"
"https://termgit.elga.gv.at/CodeSystem-medikationartanwendung";"100000073598";"intralymphatische Anwendung"
"https://termgit.elga.gv.at/CodeSystem-medikationartanwendung";"100000073600";"intramuskuläre Anwendung"
"https://termgit.elga.gv.at/CodeSystem-medikationartanwendung";"100000073602";"intraossäre Anwendung"
"https://termgit.elga.gv.at/CodeSystem-medikationartanwendung";"100000073604";"intraperitoneale Anwendung"
"https://termgit.elga.gv.at/CodeSystem-medikationartanwendung";"100000073608";"intrathekale Anwendung"
"https://termgit.elga.gv.at/CodeSystem-medikationartanwendung";"100000073609";"intratumorale Anwendung"
"https://termgit.elga.gv.at/CodeSystem-medikationartanwendung";"100000073610";"intrauterine Anwendung"
"https://termgit.elga.gv.at/CodeSystem-medikationartanwendung";"100000073611";"intravenöse Anwendung"
"https://termgit.elga.gv.at/CodeSystem-medikationartanwendung";"100000073612";"intravesikale Anwendung"
"https://termgit.elga.gv.at/CodeSystem-medikationartanwendung";"100000073613";"Intravitreal"
"https://termgit.elga.gv.at/CodeSystem-medikationartanwendung";"100000073615";"nasale Anwendung"
"https://termgit.elga.gv.at/CodeSystem-medikationartanwendung";"100000073616";"zum Vernebeln"
"https://termgit.elga.gv.at/CodeSystem-medikationartanwendung";"100000073617";"Anwendung am Auge"
"https://termgit.elga.gv.at/CodeSystem-medikationartanwendung";"100000073619";"zum Einnehmen"
"https://termgit.elga.gv.at/CodeSystem-medikationartanwendung";"100000073620";"Anwendung in der Mundhöhle"
"https://termgit.elga.gv.at/CodeSystem-medikationartanwendung";"100000073621";"zur Anwendung im Mund- und Rachenraum"
"https://termgit.elga.gv.at/CodeSystem-medikationartanwendung";"100000073623";"periartikuläre Anwendung"
"https://termgit.elga.gv.at/CodeSystem-medikationartanwendung";"100000073624";"perineurale Anwendung"
"https://termgit.elga.gv.at/CodeSystem-medikationartanwendung";"100000073625";"zur periodontalen Anwendung"
"https://termgit.elga.gv.at/CodeSystem-medikationartanwendung";"100000073628";"rektale Anwendung"
"https://termgit.elga.gv.at/CodeSystem-medikationartanwendung";"100000073629";"Art der Anwendung nicht spezifizierbar"
"https://termgit.elga.gv.at/CodeSystem-medikationartanwendung";"100000073632";"subkonjunktivale Anwendung"
"https://termgit.elga.gv.at/CodeSystem-medikationartanwendung";"100000073633";"subkutane Anwendung"
"https://termgit.elga.gv.at/CodeSystem-medikationartanwendung";"100000073634";"Sublingual"
"https://termgit.elga.gv.at/CodeSystem-medikationartanwendung";"100000073637";"transdermale Anwendung"
"https://termgit.elga.gv.at/CodeSystem-medikationartanwendung";"100000073638";"Anwendung in der Harnröhre"
"https://termgit.elga.gv.at/CodeSystem-medikationartanwendung";"100000073639";"vaginale Anwendung"
"https://termgit.elga.gv.at/CodeSystem-medikationartanwendung";"100000075243";"zur lokalen Anwendung"
"https://termgit.elga.gv.at/CodeSystem-medikationartanwendung";"100000075248";"Infiltration"
"https://termgit.elga.gv.at/CodeSystem-medikationartanwendung";"100000075249";"zur Implantation"
"https://termgit.elga.gv.at/CodeSystem-medikationartanwendung";"100000075264";"retrobulbäre Anwendung"
"https://termgit.elga.gv.at/CodeSystem-medikationartanwendung";"100000075275";"Buccale Anwendung"
"https://termgit.elga.gv.at/CodeSystem-medikationartanwendung";"100000075554";"submuköse Anwendung"
"https://termgit.elga.gv.at/CodeSystem-medikationartanwendung";"100000075556";"extrakorporale Anwendung"
"https://termgit.elga.gv.at/CodeSystem-medikationartanwendung";"100000075557";"periossäre Anwendung"
"https://termgit.elga.gv.at/CodeSystem-medikationartanwendung";"100000125763";"intrakamerale Anwendung"
"https://termgit.elga.gv.at/CodeSystem-medikationartanwendung";"100000157797";"intraglanduläre Anwendung"
"https://termgit.elga.gv.at/CodeSystem-medikationartanwendung";"900000000002";"subläsionale Anwendung"
"https://termgit.elga.gv.at/CodeSystem-medikationartanwendung";"900000000003";"perivasale Anwendung"
"https://termgit.elga.gv.at/CodeSystem-medikationartanwendung";"900000000007";"intratendineale Anwendung"
"https://termgit.elga.gv.at/CodeSystem-medikationartanwendung";"900000000008";"subepitheliale Anwendung"
"https://termgit.elga.gv.at/CodeSystem-medikationartanwendung";"900000000009";"intrakavitäre Anwendung"
"https://termgit.elga.gv.at/CodeSystem-medikationartanwendung";"900000000010";"peridurale Anwendung"
"https://termgit.elga.gv.at/CodeSystem-medikationartanwendung";"900000000012";"Hämofiltration"
"https://termgit.elga.gv.at/CodeSystem-medikationartanwendung";"900000000013";"parenterale Perfusion"
"https://termgit.elga.gv.at/CodeSystem-medikationartanwendung";"900000000014";"zur Instillation"
"https://termgit.elga.gv.at/CodeSystem-medikationartanwendung";"900000000015";"zur Wurzelkanalbehandlung"