{
  "resourceType": "ValueSet",
  "id": "elga-actcode-abginfo",
  "url": "https://termgit.elga.gv.at/ValueSet-elga-actcode-abginfo",
  "identifier": [
    {
      "use": "official",
      "system": "urn:ietf:rfc:3986",
      "value": "urn:oid:1.2.40.0.34.10.160"
    }
  ],
  "version": "3.0",
  "name": "elga-actcode-abginfo",
  "title": "ELGA_ActCode_AbgInfo",
  "status": "active",
  "date": "2015-03-31",
  "compose": {
    "include": [
      {
        "system": "https://termgit.elga.gv.at/CodeSystem-elga-actcode",
        "concept": [
          {
            "code": "ERGINFO",
            "display": "Erg\u00e4nzende Informationen zur Abgabe"
          },
          {
            "code": "MAGZUB",
            "display": "Erg\u00e4nzende Informationen zur magistralen Zubereitung"
          }
        ]
      }
    ]
  },
  "expansion": {
    "timestamp": "2022-09-13T14:15:07Z",
    "contains": [
      {
        "system": "https://termgit.elga.gv.at/CodeSystem-elga-actcode",
        "code": "ERGINFO",
        "display": "Erg\u00e4nzende Informationen zur Abgabe"
      },
      {
        "system": "https://termgit.elga.gv.at/CodeSystem-elga-actcode",
        "code": "MAGZUB",
        "display": "Erg\u00e4nzende Informationen zur magistralen Zubereitung"
      }
    ]
  }
}