'code';'codeSystem';'displayName';'parentCodeSystemName';'concept_Beschreibung';'meaning';'hints';'orderNumber';'level';'type';'relationships';'einheit print';'einheit codiert'
'NI';'2.16.840.1.113883.5.1008';'NoInformation';'https://termgit.elga.gv.at/CodeSystem-hl7-null-flavor';'';'keine Information vorhanden';'';'1';'0';'S';'';'';''
'INV';'2.16.840.1.113883.5.1008';'invalid';'https://termgit.elga.gv.at/CodeSystem-hl7-null-flavor';'';'';'Nur Gruppierung, nicht verwenden (in CDA R2 nicht erlaubt)';'2';'1';'A';'';'';''
'OTH';'2.16.840.1.113883.5.1008';'Other';'https://termgit.elga.gv.at/CodeSystem-hl7-null-flavor';'';'Andere';'';'3';'2';'S';'';'';''
'NINF';'2.16.840.1.113883.5.1008';'Negative infinity';'https://termgit.elga.gv.at/CodeSystem-hl7-null-flavor';'';'negativ unendlich';'';'4';'3';'L';'';'';''
'PINF';'2.16.840.1.113883.5.1008';'Positive infinity';'https://termgit.elga.gv.at/CodeSystem-hl7-null-flavor';'';'positiv unendlich';'';'5';'3';'L';'';'';''
'MSK';'2.16.840.1.113883.5.1008';'Masked';'https://termgit.elga.gv.at/CodeSystem-hl7-null-flavor';'';'maskiert/vertraulich/ nicht freigegeben';'';'6';'1';'L';'';'';''
'NA';'2.16.840.1.113883.5.1008';'Not applicable';'https://termgit.elga.gv.at/CodeSystem-hl7-null-flavor';'';'nicht anwendbar';'';'7';'1';'L';'';'';''
'UNK';'2.16.840.1.113883.5.1008';'Unknown';'https://termgit.elga.gv.at/CodeSystem-hl7-null-flavor';'';'unbekannt';'Wert ist unbekannt. Wenn der Wert bekannt ist, aber nicht codiert werden kann, soll UNC oder OTH verwendet werden.';'8';'1';'S';'';'';''
'ASKU';'2.16.840.1.113883.5.1008';'Asked, but unknown';'https://termgit.elga.gv.at/CodeSystem-hl7-null-flavor';'';'erfragt, aber unbekannt';'';'9';'2';'S';'';'';''
'NAV';'2.16.840.1.113883.5.1008';'Temporarily unavailable';'https://termgit.elga.gv.at/CodeSystem-hl7-null-flavor';'';'noch nicht bekannt';'';'10';'3';'L';'';'';''
'NASK';'2.16.840.1.113883.5.1008';'Not asked';'https://termgit.elga.gv.at/CodeSystem-hl7-null-flavor';'';'nicht erfragt';'';'11';'2';'L';'';'';''
'TRC';'2.16.840.1.113883.5.1008';'Trace';'https://termgit.elga.gv.at/CodeSystem-hl7-null-flavor';'';'nur in Spuren vorhanden';'';'12';'2';'L';'';'';''
