'code';'codeSystem';'displayName';'parentCode';'concept_Beschreibung';'meaning';'hints';'level';'type';'relationships'
'DengueSchwerVerlauf';'1.2.40.0.34.5.109';'Dengue-Fieber, schwere Verlaufsform';'';'';'';'';'0';'L';''
'Hautdiphterie';'1.2.40.0.34.5.109';'Hautdiphterie';'';'';'';'';'0';'L';''
'Osteomyelitis/septischeArthritis';'1.2.40.0.34.5.109';'Osteomyelitis/septische Arthritis';'';'';'';'';'0';'L';''
'ars_exHuster_exFieber';'1.2.40.0.34.5.109';'akute respiratorische Symptome ohne Husten und ohne Fieber';'';'';'';'';'0';'L';''
'ars_exHuster_inkFieber';'1.2.40.0.34.5.109';'akute respiratorische Symptome mit Fieber 38°C oder mehr und ohne Husten';'';'';'';'';'0';'L';''
'ars_inkHusten_exFieber';'1.2.40.0.34.5.109';'akute respiratorische Symptome inkl. Husten ohne Fieber';'';'';'';'';'0';'L';''
'ars_inkHusten_inkFieber';'1.2.40.0.34.5.109';'akute respiratorische Symptome inkl. Husten und Fieber 38°C oder mehr';'';'';'';'';'0';'L';''
