{
  "resourceType": "CodeSystem",
  "id": "hl7-confidentiality-code",
  "url": "https://termgit.elga.gv.at/CodeSystem-hl7-confidentiality-code",
  "identifier": [
    {
      "use": "official",
      "system": "urn:ietf:rfc:3986",
      "value": "urn:oid:2.16.840.1.113883.5.25"
    }
  ],
  "version": "202008",
  "name": "hl7-confidentiality-code",
  "title": "HL7 Confidentiality Code",
  "status": "active",
  "date": "2020-08-20",
  "content": "complete",
  "count": 6,
  "concept": [
    {
      "code": "L",
      "display": "low",
      "definition": "Definition: Privacy metadata indicating that the information has been de-identified, and there are mitigating circumstances that prevent re-identification, which minimize risk of harm from unauthorized disclosure. The information requires protection to maintain low sensitivity. Examples: Includes anonymized, pseudonymized, or non-personally identifiable information such as HIPAA limited data sets. Map: No clear map to ISO 13606-4 Sensitivity Level (1) Care Management: RECORD_COMPONENTs that might need to be accessed by a wide range of administrative staff to manage the subject of care's access to health services. Usage Note: This metadata indicates the receiver may have an obligation to comply with a data use agreement."
    },
    {
      "code": "M",
      "display": "moderate",
      "definition": "Definition: Privacy metadata indicating moderately sensitive information, which presents moderate risk of harm if disclosed without authorization.       Examples: Includes allergies of non-sensitive nature used inform food service; health information a patient authorizes to be used for marketing, released to a bank for a health credit card or savings account; or information in personal health record systems that are not governed under health privacy laws.       Map: Partial Map to ISO 13606-4 Sensitivity Level (2) Clinical Management: Less sensitive RECORD_COMPONENTs that might need to be accessed by a wider range of personnel not all of whom are actively caring for the patient (e.g. radiology staff).       Usage Note: This metadata indicates that the receiver may be obligated to comply with the receiver's terms of use or privacy policies."
    },
    {
      "code": "N",
      "display": "normal",
      "definition": "Definition: Privacy metadata indicating that the information is typical, non-stigmatizing health information, which presents typical risk of harm if disclosed without authorization. Examples: In the US, this includes what HIPAA identifies as the minimum necessary protected health information (PHI) given a covered purpose of use (treatment, payment, or operations). Includes typical, non-stigmatizing health information disclosed in an application for health, workers compensation, disability, or life insurance. Map: Partial Map to ISO 13606-4 Sensitivity Level (3) Clinical Care: Default for normal clinical care access (i.e. most clinical staff directly caring for the patient should be able to access nearly all of the EHR). Maps to normal confidentiality for treatment information but not to ancillary care, payment and operations. Usage Note: This metadata indicates that the receiver may be obligated to comply with applicable jurisdictional privacy law or disclosure authorization."
    },
    {
      "code": "R",
      "display": "restricted",
      "definition": "Privacy metadata indicating highly sensitive, potentially stigmatizing information, which presents a high risk to the information subject if disclosed without authorization. May be preempted by jurisdictional law, e.g., for public health reporting or emergency treatment.> Examples: In the US, this includes what HIPAA identifies as the minimum necessary protected health information (PHI) given a covered purpose of use (treatment, payment, or operations). Includes typical, non-stigmatizing health information disclosed in an application for health, workers compensation, disability, or life insurance. Map: Partial Map to ISO 13606-4 Sensitivity Level (3) Clinical Care: Default for normal clinical care access (i.e. most clinical staff directly caring for the patient should be able to access nearly all of the EHR). Maps to normal confidentiality for treatment information but not to ancillary care, payment and operations. Usage Note: This metadata indicates that the receiver may be obligated to comply with applicable, prevailing (default) jurisdictional privacy law or disclosure authorization."
    },
    {
      "code": "U",
      "display": "unrestricted",
      "definition": "Definition: Privacy metadata indicating that the information is not classified as sensitive.       Examples: Includes publicly available information, e.g., business name, phone, email or physical address.       Usage Note: This metadata indicates that the receiver has no obligation to consider additional policies when making access control decisions. Note that in some jurisdictions, personally identifiable information must be protected as confidential, so it would not be appropriate to assign a confidentiality code of unrestricted to that information even if it is publicly available."
    },
    {
      "code": "V",
      "display": "very restricted",
      "definition": ". Privacy metadata indicating that the information is extremely sensitive and likely stigmatizing health information that presents a very high risk if disclosed without authorization. This information must be kept in the highest confidence. Examples: Includes information about a victim of abuse, patient requested information sensitivity, and taboo subjects relating to health status that must be discussed with the patient by an attending provider before sharing with the patient. May also include information held under \u00e2??legal lock\u00e2?? or attorney-client privilege Map: This metadata indicates that the receiver may not disclose this information except as directed by the information custodian, who may be the information subject. Usage Note: This metadata indicates that the receiver may not disclose this information except as directed by the information custodian, who may be the information subject."
    }
  ]
}