'code';'codeSystem';'displayName';'parentCodeSystemName';'concept_Beschreibung';'meaning';'hints';'orderNumber';'level';'type';'relationships';'einheit print';'einheit codiert'
'19894004';'2.16.840.1.113883.6.96';'Food poisoning caused by Bacillus cereus (disorder)';'https://termgit.elga.gv.at/CodeSystem-snomed-ct-auszug';;;;'1';'0';'L';;;
'398384001';'2.16.840.1.113883.6.96';'Staphylococcus aureus food poisoning (disorder)';'https://termgit.elga.gv.at/CodeSystem-snomed-ct-auszug';;;;'2';'0';'L';;;
'70014009';'2.16.840.1.113883.6.96';'Food poisoning caused by Clostridium perfringens (disorder)';'https://termgit.elga.gv.at/CodeSystem-snomed-ct-auszug';;;;'3';'0';'L';;;
