{
  "resourceType": "CodeSystem",
  "id": "hl7-urlscheme",
  "url": "https://termgit.elga.gv.at/CodeSystem-hl7-urlscheme",
  "identifier": [
    {
      "use": "official",
      "system": "urn:ietf:rfc:3986",
      "value": "urn:oid:2.16.840.1.113883.5.143"
    }
  ],
  "version": "HL7:URLScheme",
  "name": "hl7-urlscheme",
  "title": "HL7 URLScheme",
  "status": "active",
  "date": "2013-01-10",
  "content": "complete",
  "count": 11,
  "concept": [
    {
      "code": "fax",
      "display": "Fax"
    },
    {
      "code": "file",
      "display": "File"
    },
    {
      "code": "ftp",
      "display": "FTP"
    },
    {
      "code": "http",
      "display": "HTTP"
    },
    {
      "code": "mailto",
      "display": "Mailto"
    },
    {
      "code": "me",
      "display": "ME-Nummer"
    },
    {
      "code": "mllp",
      "display": "HL7 Minimal Lower Layer Protocol"
    },
    {
      "code": "modem",
      "display": "Modem"
    },
    {
      "code": "nfs",
      "display": "NFS"
    },
    {
      "code": "tel",
      "display": "Telephone"
    },
    {
      "code": "telnet",
      "display": "Telnet"
    }
  ]
}