'code';'codeSystem';'displayName';'parentCode';'concept_Beschreibung';'meaning';'hints';'level';'type';'relationships'
'0';'1.2.40.0.34.3.1.10';'Allgemeinmedizin';'';'';'Allgemeinmedizin';'';'0';'L';''
'99';'1.2.40.0.34.3.1.10';'Approbierter Arzt';'';'';'Approbierter Arzt';'';'0';'L';''
