'code';'codeSystem';'displayName';'parentCode';'concept_Beschreibung';'meaning';'hints';'level';'type';'relationships'
'BE';'2.16.840.1.113883.5.1052';'bilateral ears';'';'';'';'';'0';'L';''
'BN';'2.16.840.1.113883.5.1052';'bilateral nares';'';'';'';'';'0';'L';''
'BU';'2.16.840.1.113883.5.1052';'buttock';'';'';'';'';'0';'L';''
'LA';'2.16.840.1.113883.5.1052';'left arm';'';'';'';'';'0';'L';''
'LAC';'2.16.840.1.113883.5.1052';'left anterior chest';'';'';'';'';'0';'L';''
'LACF';'2.16.840.1.113883.5.1052';'left antecubital fossa';'';'';'';'';'0';'L';''
'LD';'2.16.840.1.113883.5.1052';'left deltoid';'';'';'';'';'0';'L';''
'LE';'2.16.840.1.113883.5.1052';'left ear';'';'';'';'';'0';'L';''
'LEJ';'2.16.840.1.113883.5.1052';'left external jugular';'';'';'';'';'0';'L';''
'LF';'2.16.840.1.113883.5.1052';'left foot';'';'';'';'';'0';'L';''
'LG';'2.16.840.1.113883.5.1052';'left gluteus medius';'';'';'';'';'0';'L';''
'LH';'2.16.840.1.113883.5.1052';'left hand';'';'';'';'';'0';'L';''
'LIJ';'2.16.840.1.113883.5.1052';'left internal jugular';'';'';'';'';'0';'L';''
'LLAQ';'2.16.840.1.113883.5.1052';'left lower abd quadrant';'';'';'';'';'0';'L';''
'LLFA';'2.16.840.1.113883.5.1052';'left lower forearm';'';'';'';'';'0';'L';''
'LMFA';'2.16.840.1.113883.5.1052';'left mid forearm';'';'';'';'';'0';'L';''
'LN';'2.16.840.1.113883.5.1052';'left naris';'';'';'';'';'0';'L';''
'LPC';'2.16.840.1.113883.5.1052';'left posterior chest';'';'';'';'';'0';'L';''
'LSC';'2.16.840.1.113883.5.1052';'left subclavian';'';'';'';'';'0';'L';''
'LT';'2.16.840.1.113883.5.1052';'left thigh';'';'';'';'';'0';'L';''
'LUA';'2.16.840.1.113883.5.1052';'left upper arm';'';'';'';'';'0';'L';''
'LUAQ';'2.16.840.1.113883.5.1052';'left upper abd quadrant';'';'';'';'';'0';'L';''
'LUFA';'2.16.840.1.113883.5.1052';'left upper forearm';'';'';'';'';'0';'L';''
'LVG';'2.16.840.1.113883.5.1052';'left ventragluteal';'';'';'';'';'0';'L';''
'LVL';'2.16.840.1.113883.5.1052';'left vastus lateralis';'';'';'';'';'0';'L';''
'OD';'2.16.840.1.113883.5.1052';'right eye';'';'';'';'';'0';'L';''
'OS';'2.16.840.1.113883.5.1052';'left eye';'';'';'';'';'0';'L';''
'OU';'2.16.840.1.113883.5.1052';'bilateral eyes';'';'';'';'';'0';'L';''
'PA';'2.16.840.1.113883.5.1052';'perianal';'';'';'';'';'0';'L';''
'PERIN';'2.16.840.1.113883.5.1052';'perineal';'';'';'';'';'0';'L';''
'RA';'2.16.840.1.113883.5.1052';'right arm';'';'';'';'';'0';'L';''
'RAC';'2.16.840.1.113883.5.1052';'right anterior chest';'';'';'';'';'0';'L';''
'RACF';'2.16.840.1.113883.5.1052';'right antecubital fossa';'';'';'';'';'0';'L';''
'RD';'2.16.840.1.113883.5.1052';'right deltoid';'';'';'';'';'0';'L';''
'RE';'2.16.840.1.113883.5.1052';'right ear';'';'';'';'';'0';'L';''
'REJ';'2.16.840.1.113883.5.1052';'right external jugular';'';'';'';'';'0';'L';''
'RF';'2.16.840.1.113883.5.1052';'right foot';'';'';'';'';'0';'L';''
'RG';'2.16.840.1.113883.5.1052';'right gluteus medius';'';'';'';'';'0';'L';''
'RH';'2.16.840.1.113883.5.1052';'right hand';'';'';'';'';'0';'L';''
'RIJ';'2.16.840.1.113883.5.1052';'right internal jugular';'';'';'';'';'0';'L';''
'RLAQ';'2.16.840.1.113883.5.1052';'right lower abd quadrant';'';'';'';'';'0';'L';''
'RLFA';'2.16.840.1.113883.5.1052';'right lower forearm';'';'';'';'';'0';'L';''
'RMFA';'2.16.840.1.113883.5.1052';'right mid forearm';'';'';'';'';'0';'L';''
'RN';'2.16.840.1.113883.5.1052';'right naris';'';'';'';'';'0';'L';''
'RPC';'2.16.840.1.113883.5.1052';'right posterior chest';'';'';'';'';'0';'L';''
'RSC';'2.16.840.1.113883.5.1052';'right subclavian';'';'';'';'';'0';'L';''
'RT';'2.16.840.1.113883.5.1052';'right thigh';'';'';'';'';'0';'L';''
'RUA';'2.16.840.1.113883.5.1052';'right upper arm';'';'';'';'';'0';'L';''
'RUAQ';'2.16.840.1.113883.5.1052';'right upper abd quadrant';'';'';'';'';'0';'L';''
'RUFA';'2.16.840.1.113883.5.1052';'right upper forearm';'';'';'';'';'0';'L';''
'RVG';'2.16.840.1.113883.5.1052';'right ventragluteal';'';'';'';'';'0';'L';''
'RVL';'2.16.840.1.113883.5.1052';'right vastus lateralis';'';'';'';'';'0';'L';''
