'code';'codeSystem';'displayName';'parentCode';'concept_Beschreibung';'meaning';'hints';'level';'type';'relationships'
'EA';'1.2.40.0.34.5.75';'Ergebnis ausständig';;;;;'0';'L';
'NA';'1.2.40.0.34.5.75';'nicht anwendbar';;;;;'0';'L';
'NE';'1.2.40.0.34.5.75';'Nachweis erfolgt';;;;;'0';'L';
'NNE';'1.2.40.0.34.5.75';'Nachweis nicht erfolgt';;;;;'0';'L';
