{
  "resourceType": "ValueSet",
  "id": "elga-conditionverificationstatus",
  "url": "https://termgit.elga.gv.at/ValueSet-elga-conditionverificationstatus",
  "identifier": [
    {
      "use": "official",
      "system": "urn:ietf:rfc:3986",
      "value": "urn:oid:1.2.40.0.34.10.184"
    }
  ],
  "version": "202002",
  "name": "elga-conditionverificationstatus",
  "title": "ELGA_ConditionVerificationStatus",
  "status": "active",
  "date": "2020-02-04",
  "description": "**Description:** Clinical Status of Allergies Or Intolerances \n\n**Beschreibung:** Klinischer Status von Allergien und Intoleranzen",
  "compose": {
    "include": [
      {
        "system": "https://termgit.elga.gv.at/CodeSystem-ips-conditionverificationstatus",
        "concept": [
          {
            "code": "unconfirmed",
            "display": "unbest\u00e4tigt",
            "designation": [
              {
                "use": {
                  "system": "https://termgit.elga.gv.at/CodeSystem-austrian-designation-use",
                  "code": "concept_beschreibung",
                  "display": "concept_beschreibung"
                },
                "value": "IPSConditionVerificationStatus"
              }
            ]
          },
          {
            "code": "provisional",
            "display": "vorl\u00e4ufig",
            "designation": [
              {
                "use": {
                  "system": "https://termgit.elga.gv.at/CodeSystem-austrian-designation-use",
                  "code": "concept_beschreibung",
                  "display": "concept_beschreibung"
                },
                "value": "IPSConditionVerificationStatus"
              }
            ]
          },
          {
            "code": "differential",
            "display": "alternativ m\u00f6glich (Differentialdiagnose)",
            "designation": [
              {
                "use": {
                  "system": "https://termgit.elga.gv.at/CodeSystem-austrian-designation-use",
                  "code": "concept_beschreibung",
                  "display": "concept_beschreibung"
                },
                "value": "IPSConditionVerificationStatus"
              }
            ]
          },
          {
            "code": "confirmed",
            "display": "best\u00e4tigt",
            "designation": [
              {
                "use": {
                  "system": "https://termgit.elga.gv.at/CodeSystem-austrian-designation-use",
                  "code": "concept_beschreibung",
                  "display": "concept_beschreibung"
                },
                "value": "IPSConditionVerificationStatus"
              }
            ]
          },
          {
            "code": "refuted",
            "display": "ausgeschlossen",
            "designation": [
              {
                "use": {
                  "system": "https://termgit.elga.gv.at/CodeSystem-austrian-designation-use",
                  "code": "concept_beschreibung",
                  "display": "concept_beschreibung"
                },
                "value": "IPSConditionVerificationStatus"
              }
            ]
          },
          {
            "code": "unknown",
            "display": "unbekannt",
            "designation": [
              {
                "use": {
                  "system": "https://termgit.elga.gv.at/CodeSystem-austrian-designation-use",
                  "code": "concept_beschreibung",
                  "display": "concept_beschreibung"
                },
                "value": "IPSConditionVerificationStatus"
              }
            ]
          }
        ]
      }
    ]
  },
  "expansion": {
    "timestamp": "2022-09-13T14:16:55Z",
    "contains": [
      {
        "system": "https://termgit.elga.gv.at/CodeSystem-ips-conditionverificationstatus",
        "code": "unconfirmed",
        "display": "unbest\u00e4tigt",
        "designation": [
          {
            "use": {
              "system": "https://termgit.elga.gv.at/CodeSystem-austrian-designation-use",
              "code": "concept_beschreibung",
              "display": "concept_beschreibung"
            },
            "value": "IPSConditionVerificationStatus"
          }
        ],
        "contains": [
          {
            "system": "https://termgit.elga.gv.at/CodeSystem-ips-conditionverificationstatus",
            "code": "provisional",
            "display": "vorl\u00e4ufig",
            "designation": [
              {
                "use": {
                  "system": "https://termgit.elga.gv.at/CodeSystem-austrian-designation-use",
                  "code": "concept_beschreibung",
                  "display": "concept_beschreibung"
                },
                "value": "IPSConditionVerificationStatus"
              }
            ]
          },
          {
            "system": "https://termgit.elga.gv.at/CodeSystem-ips-conditionverificationstatus",
            "code": "differential",
            "display": "alternativ m\u00f6glich (Differentialdiagnose)",
            "designation": [
              {
                "use": {
                  "system": "https://termgit.elga.gv.at/CodeSystem-austrian-designation-use",
                  "code": "concept_beschreibung",
                  "display": "concept_beschreibung"
                },
                "value": "IPSConditionVerificationStatus"
              }
            ]
          }
        ]
      },
      {
        "system": "https://termgit.elga.gv.at/CodeSystem-ips-conditionverificationstatus",
        "code": "confirmed",
        "display": "best\u00e4tigt",
        "designation": [
          {
            "use": {
              "system": "https://termgit.elga.gv.at/CodeSystem-austrian-designation-use",
              "code": "concept_beschreibung",
              "display": "concept_beschreibung"
            },
            "value": "IPSConditionVerificationStatus"
          }
        ]
      },
      {
        "system": "https://termgit.elga.gv.at/CodeSystem-ips-conditionverificationstatus",
        "code": "refuted",
        "display": "ausgeschlossen",
        "designation": [
          {
            "use": {
              "system": "https://termgit.elga.gv.at/CodeSystem-austrian-designation-use",
              "code": "concept_beschreibung",
              "display": "concept_beschreibung"
            },
            "value": "IPSConditionVerificationStatus"
          }
        ]
      },
      {
        "system": "https://termgit.elga.gv.at/CodeSystem-ips-conditionverificationstatus",
        "code": "unknown",
        "display": "unbekannt",
        "designation": [
          {
            "use": {
              "system": "https://termgit.elga.gv.at/CodeSystem-austrian-designation-use",
              "code": "concept_beschreibung",
              "display": "concept_beschreibung"
            },
            "value": "IPSConditionVerificationStatus"
          }
        ]
      }
    ]
  }
}