"resource";"url";"version";"name";"title";"status";"description";"content";"identifier";"date";"count";"property";"property"
"CodeSystem";"https://termgit.elga.gv.at/CodeSystem-ems-krankheitsmerkmale";"202101";"ems-krankheitsmerkmale";"EMS_Krankheitsmerkmale";"active";"**Beschreibung:** Angaben weiterer Krankheitsmerkmale bei der Meldunge in das Epidemiologische Meldesystem vom BMG";"complete";"1.2.40.0.34.5.105";"2021-01-27";"5";"child|||code";"parent|||code"

"code";"display";"property";"property"
"ASYMPTOMATISCH";"Asymptomatisch"
"AUSSCHEIDER";"Ausscheider"
"Verstorben";"Verstorben";"child|TOD|code";"child|TOD_KRANKHEIT|code"
"TOD";"Tod";"parent|Verstorben|code";""
"TOD_KRANKHEIT";"Krankheitsbezogener Tod";"parent|Verstorben|code";""