{
  "resourceType": "CodeSystem",
  "id": "oeaek-spezialisierung",
  "url": "https://termgit.elga.gv.at/CodeSystem-oeaek-spezialisierung",
  "identifier": [
    {
      "use": "official",
      "system": "urn:ietf:rfc:3986",
      "value": "urn:oid:1.2.40.0.34.3.1.10.60"
    }
  ],
  "version": "1.0",
  "name": "oeaek-spezialisierung",
  "title": "OEAEK_Spezialisierung",
  "status": "active",
  "date": "2018-07-01",
  "description": "**Description:** Code List of all specialization diplomas valid in Austria issued by the Medical Chamber of Austria\n\n**Beschreibung:** Code Liste aller in \u00d6sterreich g\u00fcltigen Spezialisierungen",
  "content": "complete",
  "count": 6,
  "concept": [
    {
      "code": "1",
      "display": "Spez. Geriatrie",
      "designation": [
        {
          "language": "de-AT",
          "value": "Spez. Geriatrie"
        }
      ]
    },
    {
      "code": "2",
      "display": "Spez. Phoniatrie",
      "designation": [
        {
          "language": "de-AT",
          "value": "Spez. Phoniatrie"
        }
      ]
    },
    {
      "code": "3",
      "display": "Spez. Handchirurgie",
      "designation": [
        {
          "language": "de-AT",
          "value": "Spez. Handchirurgie"
        }
      ]
    },
    {
      "code": "4",
      "display": "Spez. Palliativmedizin",
      "designation": [
        {
          "language": "de-AT",
          "value": "Spez. Palliativmedizin"
        }
      ]
    },
    {
      "code": "5",
      "display": "Spez. Dermatohistopathologie",
      "designation": [
        {
          "language": "de-AT",
          "value": "Spez. Dermatohistopathologie"
        }
      ]
    },
    {
      "code": "6",
      "display": "Spez. in fachspezifischer psychosomatischer Medizin",
      "designation": [
        {
          "language": "de-AT",
          "value": "Spez. in fachspezifischer psychosomatischer Medizin"
        }
      ]
    }
  ]
}