'code';'codeSystem';'displayName';'parentCodeSystemName';'concept_Beschreibung';'meaning';'hints';'orderNumber';'level';'type';'relationships';'einheit print';'einheit codiert'
'344';'1.2.40.0.34.5.205';'SD BIOSENSOR Inc., STANDARD F COVID-19 Ag FIA';'https://termgit.elga.gv.at/CodeSystem-dgc-ratnamemanufacturer';'SD BIOSENSOR Inc., STANDARD F COVID-19 Ag FIA';'';'';'1';'0';'L';'1.2.40.0.34.5.205:344';'';''
'345';'1.2.40.0.34.5.205';'SD BIOSENSOR Inc., STANDARD Q COVID-19 Ag Test';'https://termgit.elga.gv.at/CodeSystem-dgc-ratnamemanufacturer';'SD BIOSENSOR Inc., STANDARD Q COVID-19 Ag Test';'';'';'2';'0';'L';'1.2.40.0.34.5.205:345';'';''
'768';'1.2.40.0.34.5.205';'ArcDia International Ltd, mariPOC SARS-CoV-2';'https://termgit.elga.gv.at/CodeSystem-dgc-ratnamemanufacturer';'ArcDia International Ltd, mariPOC SARS-CoV-2';'';'';'3';'0';'L';'1.2.40.0.34.5.205:768';'';''
'1097';'1.2.40.0.34.5.205';'Quidel Corporation, Sofia 2 SARS Antigen FIA';'https://termgit.elga.gv.at/CodeSystem-dgc-ratnamemanufacturer';'Quidel Corporation, Sofia 2 SARS Antigen FIA';'';'';'4';'0';'L';'1.2.40.0.34.5.205:1097';'';''
'1114';'1.2.40.0.34.5.205';'Sugentech, Inc., SGTi-flex COVID-19 Ag';'https://termgit.elga.gv.at/CodeSystem-dgc-ratnamemanufacturer';'Sugentech, Inc., SGTi-flex COVID-19 Ag';'';'';'5';'0';'L';'1.2.40.0.34.5.205:1114';'';''
'1180';'1.2.40.0.34.5.205';'MEDsan GmbH, MEDsan SARS-CoV-2 Antigen Rapid Test';'https://termgit.elga.gv.at/CodeSystem-dgc-ratnamemanufacturer';'MEDsan GmbH, MEDsan SARS-CoV-2 Antigen Rapid Test';'';'';'6';'0';'L';'1.2.40.0.34.5.205:1180';'';''
'1190';'1.2.40.0.34.5.205';'möLab, COVID-19 Rapid Antigen Test';'https://termgit.elga.gv.at/CodeSystem-dgc-ratnamemanufacturer';'möLab, COVID-19 Rapid Antigen Test';'';'';'7';'0';'L';'1.2.40.0.34.5.205:1190';'';''
'1199';'1.2.40.0.34.5.205';'Oncosem Onkolojik Sistemler San. ve Tic. A.S., CAT';'https://termgit.elga.gv.at/CodeSystem-dgc-ratnamemanufacturer';'Oncosem Onkolojik Sistemler San. ve Tic. A.S., CAT';'';'';'8';'0';'L';'1.2.40.0.34.5.205:1199';'';''
'1201';'1.2.40.0.34.5.205';'ScheBo Biotech AG, ScheBo SARS CoV-2 Quick Antigen';'https://termgit.elga.gv.at/CodeSystem-dgc-ratnamemanufacturer';'ScheBo Biotech AG, ScheBo SARS CoV-2 Quick Antigen';'';'';'9';'0';'L';'1.2.40.0.34.5.205:1201';'';''
'1215';'1.2.40.0.34.5.205';'Hangzhou Laihe Biotech Co., LYHER Novel Coronavirus (COVID-19) Antigen Test Kit (Colloidal Gold)';'https://termgit.elga.gv.at/CodeSystem-dgc-ratnamemanufacturer';'Hangzhou Laihe Biotech Co., LYHER Novel Coronavirus (COVID-19) Antigen Test Kit (Colloidal Gold)';'';'';'10';'0';'L';'1.2.40.0.34.5.205:1215';'';''
'1218';'1.2.40.0.34.5.205';'Siemens Healthineers, CLINITEST Rapid COVID-19 Antigen Test';'https://termgit.elga.gv.at/CodeSystem-dgc-ratnamemanufacturer';'Siemens Healthineers, CLINITEST Rapid COVID-19 Antigen Test';'';'';'11';'0';'L';'1.2.40.0.34.5.205:1218';'';''
'1223';'1.2.40.0.34.5.205';'BIOSYNEX SA , BIOSYNEX COVID-19 Ag BSS';'https://termgit.elga.gv.at/CodeSystem-dgc-ratnamemanufacturer';'BIOSYNEX SA , BIOSYNEX COVID-19 Ag BSS';'';'';'12';'0';'L';'1.2.40.0.34.5.205:1223';'';''
'1225';'1.2.40.0.34.5.205';'DDS DIAGNOSTIC, Test Rapid Covid-19 Antigen (tampon nazofaringian)';'https://termgit.elga.gv.at/CodeSystem-dgc-ratnamemanufacturer';'DDS DIAGNOSTIC, Test Rapid Covid-19 Antigen (tampon nazofaringian)';'';'';'13';'0';'L';'1.2.40.0.34.5.205:1225';'';''
'1232';'1.2.40.0.34.5.205';'Abbott Rapid Diagnostics, Panbio COVID-19 Ag Rapid Test ';'https://termgit.elga.gv.at/CodeSystem-dgc-ratnamemanufacturer';'Abbott Rapid Diagnostics, Panbio COVID-19 Ag Rapid Test ';'';'';'14';'0';'L';'1.2.40.0.34.5.205:1232';'';''
'1236';'1.2.40.0.34.5.205';'BTNX Inc., Rapid Response COVID-19 Antigen Rapid Test Device';'https://termgit.elga.gv.at/CodeSystem-dgc-ratnamemanufacturer';'BTNX Inc., Rapid Response COVID-19 Antigen Rapid Test Device';'';'';'15';'0';'L';'1.2.40.0.34.5.205:1236';'';''
'1253';'1.2.40.0.34.5.205';'GenSure Biotech Inc, Gensure COVID-19 Antigen Rapid Test Kit (REF: P2004) (DIA-COVID -19 Ag Rapid Test)';'https://termgit.elga.gv.at/CodeSystem-dgc-ratnamemanufacturer';'GenSure Biotech Inc, Gensure COVID-19 Antigen Rapid Test Kit (REF: P2004) (DIA-COVID -19 Ag Rapid Test)';'';'';'16';'0';'L';'1.2.40.0.34.5.205:1253';'';''
'1257';'1.2.40.0.34.5.205';'Hangzhou AllTest Biotech Co., Ltd, COVID-19 Antigen Rapid Test  ';'https://termgit.elga.gv.at/CodeSystem-dgc-ratnamemanufacturer';'Hangzhou AllTest Biotech Co., Ltd, COVID-19 Antigen Rapid Test  ';'';'';'17';'0';'L';'1.2.40.0.34.5.205:1257';'';''
'1266';'1.2.40.0.34.5.205';'Labnovation Technologies Inc., SARS-CoV-2 Antigen Rapid Test Kit';'https://termgit.elga.gv.at/CodeSystem-dgc-ratnamemanufacturer';'Labnovation Technologies Inc., SARS-CoV-2 Antigen Rapid Test Kit';'';'';'18';'0';'L';'1.2.40.0.34.5.205:1266';'';''
'1267';'1.2.40.0.34.5.205';'LumiQuick Diagnostics Inc., QuickProfil COVID-19 ANTIGEN Test';'https://termgit.elga.gv.at/CodeSystem-dgc-ratnamemanufacturer';'LumiQuick Diagnostics Inc., QuickProfile? COVID-19 ANTIGEN Test';'LumiQuick Diagnostics Inc., QuickProfile? COVID-19 ANTIGEN Test';'';'19';'0';'L';'1.2.40.0.34.5.205:1267';'';''
'1268';'1.2.40.0.34.5.205';'LumiraDX , LumiraDx SARS-CoV-2 Ag Test ';'https://termgit.elga.gv.at/CodeSystem-dgc-ratnamemanufacturer';'LumiraDX , LumiraDx SARS-CoV-2 Ag Test ';'';'';'20';'0';'L';'1.2.40.0.34.5.205:1268';'';''
'1271';'1.2.40.0.34.5.205';'Precision Biosensor Inc., Exdia COVI-19 Ag Test';'https://termgit.elga.gv.at/CodeSystem-dgc-ratnamemanufacturer';'Precision Biosensor Inc., Exdia COVI-19 Ag Test';'';'';'21';'0';'L';'1.2.40.0.34.5.205:1271';'';''
'1278';'1.2.40.0.34.5.205';'Xiamen Boson Biotech Co, Rapid SARS-CoV-2 Antigen Test card ';'https://termgit.elga.gv.at/CodeSystem-dgc-ratnamemanufacturer';'Xiamen Boson Biotech Co, Rapid SARS-CoV-2 Antigen Test card ';'';'';'22';'0';'L';'1.2.40.0.34.5.205:1278';'';''
'1295';'1.2.40.0.34.5.205';'Zhejiang Anji Saianfu Biotech Co.., Ltd., reOpenTest COVID-19  Antigen Rapid Test';'https://termgit.elga.gv.at/CodeSystem-dgc-ratnamemanufacturer';'Zhejiang Anji Saianfu Biotech Co.., Ltd., reOpenTest COVID-19  Antigen Rapid Test';'';'';'23';'0';'L';'1.2.40.0.34.5.205:1295';'';''
'1296';'1.2.40.0.34.5.205';'Zhejiang Anji Saianfu Biotech Co.., Ltd., AndLucky COVID-19 Antigen Rapid Test';'https://termgit.elga.gv.at/CodeSystem-dgc-ratnamemanufacturer';'Zhejiang Anji Saianfu Biotech Co.., Ltd., AndLucky COVID-19 Antigen Rapid Test';'';'';'24';'0';'L';'1.2.40.0.34.5.205:1296';'';''
'1304';'1.2.40.0.34.5.205';'AMEDA Labordiagnostik GmbH, AMP Rapid Test SARS-CoV-2 Ag';'https://termgit.elga.gv.at/CodeSystem-dgc-ratnamemanufacturer';'AMEDA Labordiagnostik GmbH, AMP Rapid Test SARS-CoV-2 Ag';'';'';'25';'0';'L';'1.2.40.0.34.5.205:1304';'';''
'1319';'1.2.40.0.34.5.205';'SGA Medikal, V-Chek SARS-CoV2- Rapid Ag Tets (Coloidal Gold)';'https://termgit.elga.gv.at/CodeSystem-dgc-ratnamemanufacturer';'SGA Medikal, V-Chek SARS-CoV2- Rapid Ag Tets (Coloidal Gold)';'';'';'26';'0';'L';'1.2.40.0.34.5.205:1319';'';''
'1331';'1.2.40.0.34.5.205';'Beijing Lepu Medical Technology, SARS-CoV-2 Antigen Rapid Test Kit (Colloidal Gold immunochromatography)';'https://termgit.elga.gv.at/CodeSystem-dgc-ratnamemanufacturer';'Beijing Lepu Medical Technology, SARS-CoV-2 Antigen Rapid Test Kit (Colloidal Gold immunochromatography)';'';'';'27';'0';'L';'1.2.40.0.34.5.205:1331';'';''
'1333';'1.2.40.0.34.5.205';'Joinstar Biomedical Technology Co. Ltd, COVID-19 Antigen Rapid Test (Colloidal Gold)';'https://termgit.elga.gv.at/CodeSystem-dgc-ratnamemanufacturer';'Joinstar Biomedical Technology Co. Ltd, COVID-19 Antigen Rapid Test (Colloidal Gold)';'';'';'28';'0';'L';'1.2.40.0.34.5.205:1333';'';''
'1341';'1.2.40.0.34.5.205';'Qingdao Hightop Biotech Co. Ltd, SARS-CoV-2 Antigen Rapid Test';'https://termgit.elga.gv.at/CodeSystem-dgc-ratnamemanufacturer';'Qingdao Hightop Biotech Co. Ltd, SARS-CoV-2 Antigen Rapid Test';'';'';'29';'0';'L';'1.2.40.0.34.5.205:1341';'';''
'1343';'1.2.40.0.34.5.205';'Zhejiang Orient Gene Biotech Co., Ltd, Coronavirus Ag Rapid Test Cassette (Swab)';'https://termgit.elga.gv.at/CodeSystem-dgc-ratnamemanufacturer';'Zhejiang Orient Gene Biotech Co., Ltd, Coronavirus Ag Rapid Test Cassette (Swab)';'';'';'30';'0';'L';'1.2.40.0.34.5.205:1343';'';''
'1360';'1.2.40.0.34.5.205';'Guangdong Wesail Biotech Co. Ltd, COVID-19 AG Test Kit ';'https://termgit.elga.gv.at/CodeSystem-dgc-ratnamemanufacturer';'Guangdong Wesail Biotech Co. Ltd, COVID-19 AG Test Kit ';'';'';'31';'0';'L';'1.2.40.0.34.5.205:1360';'';''
'1363';'1.2.40.0.34.5.205';'Hangzhou Clongene Biotech Co., Ltd., COVID-19 Antigen Rapid Test Kit';'https://termgit.elga.gv.at/CodeSystem-dgc-ratnamemanufacturer';'Hangzhou Clongene Biotech Co., Ltd., COVID-19 Antigen Rapid Test Kit';'';'';'32';'0';'L';'1.2.40.0.34.5.205:1363';'';''
'1365';'1.2.40.0.34.5.205';'Hangzhou Clongene Biotech Co., Ltd., COVID-19/Influenza A+B Antigen Combo Rapid Test';'https://termgit.elga.gv.at/CodeSystem-dgc-ratnamemanufacturer';'Hangzhou Clongene Biotech Co., Ltd., COVID-19/Influenza A+B Antigen Combo Rapid Test';'';'';'33';'0';'L';'1.2.40.0.34.5.205:1365';'';''
'1392';'1.2.40.0.34.5.205';'Hangzhou Testsea Biotechnology Co., Ltd., Testsealabs Covid-19 Antigen Rapid Test Cassette';'https://termgit.elga.gv.at/CodeSystem-dgc-ratnamemanufacturer';'Hangzhou Testsea Biotechnology Co., Ltd., Testsealabs Covid-19 Antigen Rapid Test Cassette';'';'';'34';'0';'L';'1.2.40.0.34.5.205:1392';'';''
'1443';'1.2.40.0.34.5.205';'Vitrosens Biotechnology Co. Ltd, RapidFor SARS-CoV-2 Ag Test Kit';'https://termgit.elga.gv.at/CodeSystem-dgc-ratnamemanufacturer';'Vitrosens Biotechnology Co. Ltd, RapidFor SARS-CoV-2 Ag Test Kit';'';'';'35';'0';'L';'1.2.40.0.34.5.205:1443';'';''
'1457';'1.2.40.0.34.5.205';'Acon Biotech (Hangzhou) Co., Ltd, SARS-CoV-2 Antigen Rapid Test';'https://termgit.elga.gv.at/CodeSystem-dgc-ratnamemanufacturer';'Acon Biotech (Hangzhou) Co., Ltd, SARS-CoV-2 Antigen Rapid Test';'';'';'36';'0';'L';'1.2.40.0.34.5.205:1457';'';''
'1466';'1.2.40.0.34.5.205';'TODA PHARMA, TODA CORONADIAG Ag';'https://termgit.elga.gv.at/CodeSystem-dgc-ratnamemanufacturer';'TODA PHARMA, TODA CORONADIAG Ag';'';'';'37';'0';'L';'1.2.40.0.34.5.205:1466';'';''
'1468';'1.2.40.0.34.5.205';'ACON Laboratories, Inc, Flowflex SARS-CoV-2 Antigen Rapid Test ';'https://termgit.elga.gv.at/CodeSystem-dgc-ratnamemanufacturer';'ACON Laboratories, Inc, Flowflex SARS-CoV-2 Antigen Rapid Test ';'';'';'38';'0';'L';'1.2.40.0.34.5.205:1468';'';''
'1481';'1.2.40.0.34.5.205';'MP Biomedicals , Rapid SARS-CoV-2 Antigen Test Card';'https://termgit.elga.gv.at/CodeSystem-dgc-ratnamemanufacturer';'MP Biomedicals , Rapid SARS-CoV-2 Antigen Test Card';'';'';'39';'0';'L';'1.2.40.0.34.5.205:1481';'';''
'1489';'1.2.40.0.34.5.205';'Safecare Biotech Hangzhou Co, COVID-19 Antigen Rapid Test Kit (Swab)';'https://termgit.elga.gv.at/CodeSystem-dgc-ratnamemanufacturer';'Safecare Biotech Hangzhou Co, COVID-19 Antigen Rapid Test Kit (Swab)';'';'';'40';'0';'L';'1.2.40.0.34.5.205:1489';'';''
'1490';'1.2.40.0.34.5.205';'Safecare Biotech Hangzhou Co, Multi-Respiratory Virus Antigen Test Kit (Swab) (Influenza A+B/COVID-19)';'https://termgit.elga.gv.at/CodeSystem-dgc-ratnamemanufacturer';'Safecare Biotech Hangzhou Co, Multi-Respiratory Virus Antigen Test Kit (Swab) (Influenza A+B/COVID-19)';'';'';'41';'0';'L';'1.2.40.0.34.5.205:1490';'';''
'1501';'1.2.40.0.34.5.205';'New Gene (Hangzhou) Bioengineering Co., Ltd., COVID-19 Antigen Detection Kit';'https://termgit.elga.gv.at/CodeSystem-dgc-ratnamemanufacturer';'New Gene (Hangzhou) Bioengineering Co., Ltd., COVID-19 Antigen Detection Kit';'';'';'42';'0';'L';'1.2.40.0.34.5.205:1501';'';''
'1604';'1.2.40.0.34.5.205';'Roche (SD BIOSENSOR), SARS-CoV-2 Antigen Rapid Test';'https://termgit.elga.gv.at/CodeSystem-dgc-ratnamemanufacturer';'Roche (SD BIOSENSOR), SARS-CoV-2 Antigen Rapid Test';'';'';'43';'0';'L';'1.2.40.0.34.5.205:1604';'';''
'1654';'1.2.40.0.34.5.205';'Asan Pharmaceutical CO., LTD, Asan Easy Test COVID-19 Ag';'https://termgit.elga.gv.at/CodeSystem-dgc-ratnamemanufacturer';'Asan Pharmaceutical CO., LTD, Asan Easy Test COVID-19 Ag';'';'';'44';'0';'L';'1.2.40.0.34.5.205:1654';'';''
'1736';'1.2.40.0.34.5.205';'Anhui Deep Blue Medical Technology Co. Ltd, COVID-19 (SARS-CoV-2) Antigen Test Kit (Colloidal Gold)';'https://termgit.elga.gv.at/CodeSystem-dgc-ratnamemanufacturer';'Anhui Deep Blue Medical Technology Co. Ltd, COVID-19 (SARS-CoV-2) Antigen Test Kit (Colloidal Gold)';'';'';'45';'0';'L';'1.2.40.0.34.5.205:1736';'';''
'1763';'1.2.40.0.34.5.205';'Xiamen AmonMed Biotechnology Co., Ltd., COVID-19 Antigen Rapid Test Kit (Colloidal Gold)  ';'https://termgit.elga.gv.at/CodeSystem-dgc-ratnamemanufacturer';'Xiamen AmonMed Biotechnology Co., Ltd., COVID-19 Antigen Rapid Test Kit (Colloidal Gold)  ';'';'';'46';'0';'L';'1.2.40.0.34.5.205:1763';'';''
'1764';'1.2.40.0.34.5.205';'JOYSBIO (Tianjin) Biotechnology Co., Ltd., SARS-CoV-2 Antigen Rapid Test Kit (Colloidal Gold immunochromatography)';'https://termgit.elga.gv.at/CodeSystem-dgc-ratnamemanufacturer';'JOYSBIO (Tianjin) Biotechnology Co., Ltd., SARS-CoV-2 Antigen Rapid Test Kit (Colloidal Gold immunochromatography)';'';'';'47';'0';'L';'1.2.40.0.34.5.205:1764';'';''
'1767';'1.2.40.0.34.5.205';'Healgen Scientific Limited, Coronavirus Ag Rapid Test Cassette (Swab)';'https://termgit.elga.gv.at/CodeSystem-dgc-ratnamemanufacturer';'Healgen Scientific Limited, Coronavirus Ag Rapid Test Cassette (Swab)';'';'';'48';'0';'L';'1.2.40.0.34.5.205:1767';'';''
'1769';'1.2.40.0.34.5.205';'Shenzhen Watmind Medical Co., Ltd, SARS-CoV-2 Ag Diagnostic Test Kit (Colloidal Gold)';'https://termgit.elga.gv.at/CodeSystem-dgc-ratnamemanufacturer';'Shenzhen Watmind Medical Co., Ltd, SARS-CoV-2 Ag Diagnostic Test Kit (Colloidal Gold)';'';'';'49';'0';'L';'1.2.40.0.34.5.205:1769';'';''
'1815';'1.2.40.0.34.5.205';'Anhui DeepBlue Medical Technology Co. Ltd, COVID-19 (SARS-CoV-2) Antigen Test Kit (Colloidal Gold) ? Nasal swab';'https://termgit.elga.gv.at/CodeSystem-dgc-ratnamemanufacturer';'Anhui DeepBlue Medical Technology Co. Ltd, COVID-19 (SARS-CoV-2) Antigen Test Kit (Colloidal Gold) ? Nasal swab';'';'';'50';'0';'L';'1.2.40.0.34.5.205:1815';'';''
'1822';'1.2.40.0.34.5.205';'Anbio (Xiamen) Biotechnology Co., Ltd., Rapid COVID-19 Antigen-Test (colloidal Gold)';'https://termgit.elga.gv.at/CodeSystem-dgc-ratnamemanufacturer';'Anbio (Xiamen) Biotechnology Co., Ltd., Rapid COVID-19 Antigen-Test (colloidal Gold)';'';'';'51';'0';'L';'1.2.40.0.34.5.205:1822';'';''
'1833';'1.2.40.0.34.5.205';'AAZ-LMB, COVID-VIRO Rapid antigen test COVID-19';'https://termgit.elga.gv.at/CodeSystem-dgc-ratnamemanufacturer';'AAZ-LMB, COVID-VIRO Rapid antigen test COVID-19';'';'';'52';'0';'L';'1.2.40.0.34.5.205:1833';'';''
'1870';'1.2.40.0.34.5.205';'Beijing Hotgen Biotech Co., Ltd., Novel Coronavirus 2019-nCoV Antigen Test (Colloidal Gold)';'https://termgit.elga.gv.at/CodeSystem-dgc-ratnamemanufacturer';'Beijing Hotgen Biotech Co., Ltd., Novel Coronavirus 2019-nCoV Antigen Test (Colloidal Gold)';'';'';'53';'0';'L';'1.2.40.0.34.5.205:1870';'';''
'2029';'1.2.40.0.34.5.205';'Merlin Biomedical (Xiamen) Co., Ltd., SARS-CoV-2 Antigen Rapid Test Cassette';'https://termgit.elga.gv.at/CodeSystem-dgc-ratnamemanufacturer';'Merlin Biomedical (Xiamen) Co., Ltd., SARS-CoV-2 Antigen Rapid Test Cassette';'';'';'54';'0';'L';'1.2.40.0.34.5.205:2029';'';''
'2074';'1.2.40.0.34.5.205';'Triplex International Biosciences Co., Ltd, SARS-CoV-2 Antigen Rapid Test Kit';'https://termgit.elga.gv.at/CodeSystem-dgc-ratnamemanufacturer';'Triplex International Biosciences Co., Ltd, SARS-CoV-2 Antigen Rapid Test Kit';'';'';'55';'0';'L';'1.2.40.0.34.5.205:2074';'';''
'2098';'1.2.40.0.34.5.205';'Wuhan EasyDiagnosis Biomedicine Co., Ltd., COVID-19  (SARS-CoV-2) Antigen-Test kit ';'https://termgit.elga.gv.at/CodeSystem-dgc-ratnamemanufacturer';'Wuhan EasyDiagnosis Biomedicine Co., Ltd., COVID-19  (SARS-CoV-2) Antigen-Test kit ';'';'';'56';'0';'L';'1.2.40.0.34.5.205:2098';'';''
'2101';'1.2.40.0.34.5.205';'AXIOM Gesellschaft für Diagnostica und Biochemica mbH, COVID-19 Antigen Rapid Test';'https://termgit.elga.gv.at/CodeSystem-dgc-ratnamemanufacturer';'AXIOM Gesellschaft für Diagnostica und Biochemica mbH, COVID-19 Antigen Rapid Test';'';'';'57';'0';'L';'1.2.40.0.34.5.205:2101';'';''
'2109';'1.2.40.0.34.5.205';'Shenzhen Lvshiyuan Biotechnology Co., Ltd., Green Spring SARS-CoV-2 Antigen-Rapid test-Set';'https://termgit.elga.gv.at/CodeSystem-dgc-ratnamemanufacturer';'Shenzhen Lvshiyuan Biotechnology Co., Ltd., Green Spring SARS-CoV-2 Antigen-Rapid test-Set';'';'';'58';'0';'L';'1.2.40.0.34.5.205:2109';'';''
'2116';'1.2.40.0.34.5.205';'PerGrande Biotech Development Co., Ltd., SARS-CoV-2 Antigen Detection Kit (Colloidal Gold Immunochromato-graphic assay)';'https://termgit.elga.gv.at/CodeSystem-dgc-ratnamemanufacturer';'PerGrande Biotech Development Co., Ltd., SARS-CoV-2 Antigen Detection Kit (Colloidal Gold Immunochromato-graphic assay)';'';'';'59';'0';'L';'1.2.40.0.34.5.205:2116';'';''
'2128';'1.2.40.0.34.5.205';'Lumigenex (Suzhou) Co., Ltd, PocRoc SARS-CoV-2 Antigen Rapid Test Kit (Colloidal Gold)';'https://termgit.elga.gv.at/CodeSystem-dgc-ratnamemanufacturer';'Lumigenex (Suzhou) Co., Ltd, PocRoc SARS-CoV-2 Antigen Rapid Test Kit (Colloidal Gold)';'';'';'60';'0';'L';'1.2.40.0.34.5.205:2128';'';''
'2130';'1.2.40.0.34.5.205';'Affimedix Inc., TestNOW - COVID-19 Antigen Test';'https://termgit.elga.gv.at/CodeSystem-dgc-ratnamemanufacturer';'Affimedix Inc., TestNOW - COVID-19 Antigen Test';'';'';'61';'0';'L';'1.2.40.0.34.5.205:2130';'';''
'2139';'1.2.40.0.34.5.205';'Hangzhou Lysun Biotechnology Co., Ltd., COVID-19 antigen Rapid Test Device (Colloidal Gold)';'https://termgit.elga.gv.at/CodeSystem-dgc-ratnamemanufacturer';'Hangzhou Lysun Biotechnology Co., Ltd., COVID-19 antigen Rapid Test Device (Colloidal Gold)';'';'';'62';'0';'L';'1.2.40.0.34.5.205:2139';'';''
'2183';'1.2.40.0.34.5.205';'Getein Biotech, Inc., One Step Test for SARS-CoV-2 Antigen (Colloidal Gold)';'https://termgit.elga.gv.at/CodeSystem-dgc-ratnamemanufacturer';'Getein Biotech, Inc., One Step Test for SARS-CoV-2 Antigen (Colloidal Gold)';'';'';'63';'0';'L';'1.2.40.0.34.5.205:2183';'';''
'2017';'1.2.40.0.34.5.205';'Shenzen Ultra-Diagnostics Biotec Co., SARS-CoV-2 Antigen test Kit (colloidal gold)';'https://termgit.elga.gv.at/CodeSystem-dgc-ratnamemanufacturer';'Shenzen Ultra-Diagnostics Biotec Co., SARS-CoV-2 Antigen test Kit (colloidal gold)';'';'';'64';'0';'L';'1.2.40.0.34.5.205:2017';'';''
'1065';'1.2.40.0.34.5.205';'Becton Dickinson, BD Veritor System for Rapid Detection of SARS CoV 2';'https://termgit.elga.gv.at/CodeSystem-dgc-ratnamemanufacturer';'Becton Dickinson, BD Veritor System for Rapid Detection of SARS CoV 2';'';'';'65';'0';'L';'1.2.40.0.34.5.205:1065';'';''
'1242';'1.2.40.0.34.5.205';'BIONOTE, NowCheck COVID-19 Ag Test';'https://termgit.elga.gv.at/CodeSystem-dgc-ratnamemanufacturer';'BIONOTE, NowCheck COVID-19 Ag Test';'';'';'66';'0';'L';'1.2.40.0.34.5.205:1242';'';''
'1357';'1.2.40.0.34.5.205';'SGA Medikal, V-Chek SARS-CoV-2 Rapid Ag Test (colloidal gold)';'https://termgit.elga.gv.at/CodeSystem-dgc-ratnamemanufacturer';'SGA Medikal, V-Chek SARS-CoV-2 Rapid Ag Test (colloidal gold)';'';'';'67';'0';'L';'1.2.40.0.34.5.205:1357';'';''
'1494';'1.2.40.0.34.5.205';'BIOSYNEX SA, BIOSYNEX COVID-19 Ag+ BSS';'https://termgit.elga.gv.at/CodeSystem-dgc-ratnamemanufacturer';'BIOSYNEX SA, BIOSYNEX COVID-19 Ag+ BSS';'';'';'68';'0';'L';'1.2.40.0.34.5.205:1494';'';''
'1495';'1.2.40.0.34.5.205';'Prognosis Biotech, Rapid Test Ag 2019-nCov';'https://termgit.elga.gv.at/CodeSystem-dgc-ratnamemanufacturer';'Prognosis Biotech, Rapid Test Ag 2019-nCov';'';'';'69';'0';'L';'1.2.40.0.34.5.205:1495';'';''
'1581';'1.2.40.0.34.5.205';'CTK Biotech, Inc, OnSite COVID-19 Ag Rapid Test';'https://termgit.elga.gv.at/CodeSystem-dgc-ratnamemanufacturer';'CTK Biotech, Inc, OnSite COVID-19 Ag Rapid Test';'';'';'70';'0';'L';'1.2.40.0.34.5.205:1581';'';''
'1599';'1.2.40.0.34.5.205';'Biomerica Inc., Biomerica COVID-19 Antigen Rapid Test (nasopharyngeal swab)';'https://termgit.elga.gv.at/CodeSystem-dgc-ratnamemanufacturer';'Biomerica Inc., Biomerica COVID-19 Antigen Rapid Test (nasopharyngeal swab)';'';'';'71';'0';'L';'1.2.40.0.34.5.205:1599';'';''
'1610';'1.2.40.0.34.5.205';'Hangzhou Clongene Biotech Co., Ltd, COVID-19 Antigen Rapid Test Casette';'https://termgit.elga.gv.at/CodeSystem-dgc-ratnamemanufacturer';'Hangzhou Clongene Biotech Co., Ltd, COVID-19 Antigen Rapid Test Casette';'';'';'72';'0';'L';'1.2.40.0.34.5.205:1610';'';''
'1739';'1.2.40.0.34.5.205';'Eurobio Scientific, EBS SARS-CoV-2 Ag Rapid Test';'https://termgit.elga.gv.at/CodeSystem-dgc-ratnamemanufacturer';'Eurobio Scientific, EBS SARS-CoV-2 Ag Rapid Test';'';'';'73';'0';'L';'1.2.40.0.34.5.205:1739';'';''
'1768';'1.2.40.0.34.5.205';'Shenzhen Watmind Medical Co., Ltd, SARS-CoV-2 Ag Diagnostic Test Kit (Immuno-fluorescence)';'https://termgit.elga.gv.at/CodeSystem-dgc-ratnamemanufacturer';'Shenzhen Watmind Medical Co., Ltd, SARS-CoV-2 Ag Diagnostic Test Kit (Immuno-fluorescence)';'';'';'74';'0';'L';'1.2.40.0.34.5.205:1768';'';''
'1775';'1.2.40.0.34.5.205';'MEXACARE GmbH, MEXACARE COVID-19 Antigen Rapid Test';'https://termgit.elga.gv.at/CodeSystem-dgc-ratnamemanufacturer';'MEXACARE GmbH, MEXACARE COVID-19 Antigen Rapid Test';'';'';'75';'0';'L';'1.2.40.0.34.5.205:1775';'';''
'1800';'1.2.40.0.34.5.205';'Avalun, Ksmart SARS-COV2 Antigen Rapid Test';'https://termgit.elga.gv.at/CodeSystem-dgc-ratnamemanufacturer';'Avalun, Ksmart SARS-COV2 Antigen Rapid Test';'';'';'76';'0';'L';'1.2.40.0.34.5.205:1800';'';''
'1967';'1.2.40.0.34.5.205';'Shenzhen Microprofit Biotech Co., Ltd, SARS-CoV-2 Antigen Test Kit (Colloidal Gold Chromatographic Immunoassay)';'https://termgit.elga.gv.at/CodeSystem-dgc-ratnamemanufacturer';'Shenzhen Microprofit Biotech Co., Ltd, SARS-CoV-2 Antigen Test Kit (Colloidal Gold Chromatographic Immunoassay)';'';'';'77';'0';'L';'1.2.40.0.34.5.205:1967';'';''
'2006';'1.2.40.0.34.5.205';'Jiangsu Medomics medical technology Co.,Ltd., SARS-CoV-2 antigen Test Kit (LFIA)';'https://termgit.elga.gv.at/CodeSystem-dgc-ratnamemanufacturer';'Jiangsu Medomics medical technology Co.,Ltd., SARS-CoV-2 antigen Test Kit (LFIA)';'';'';'78';'0';'L';'1.2.40.0.34.5.205:2006';'';''
'2012';'1.2.40.0.34.5.205';'Genrui Biotech Inc, SARS-CoV-2 Antigen Test Kit (Colloidal Gold)';'https://termgit.elga.gv.at/CodeSystem-dgc-ratnamemanufacturer';'Genrui Biotech Inc, SARS-CoV-2 Antigen Test Kit (Colloidal Gold)';'';'';'79';'0';'L';'1.2.40.0.34.5.205:2012';'';''
'2031';'1.2.40.0.34.5.205';'BIO-RAD, CORONAVIRUS AG RAPID TEST CASSETTE';'https://termgit.elga.gv.at/CodeSystem-dgc-ratnamemanufacturer';'BIO-RAD, CORONAVIRUS AG RAPID TEST CASSETTE';'';'';'80';'0';'L';'1.2.40.0.34.5.205:2031';'';''
'2090';'1.2.40.0.34.5.205';'Wuhan UNscience Biotechnology Co., Ltd., SARS-CoV-2 Antigen Rapid Test Kit';'https://termgit.elga.gv.at/CodeSystem-dgc-ratnamemanufacturer';'Wuhan UNscience Biotechnology Co., Ltd., SARS-CoV-2 Antigen Rapid Test Kit';'';'';'81';'0';'L';'1.2.40.0.34.5.205:2090';'';''
'2147';'1.2.40.0.34.5.205';'Fujirebio , ESPLINE SARS-CoV-2';'https://termgit.elga.gv.at/CodeSystem-dgc-ratnamemanufacturer';'Fujirebio , ESPLINE SARS-CoV-2';'';'';'82';'0';'L';'1.2.40.0.34.5.205:2147';'';''
'2228';'1.2.40.0.34.5.205';'Roche (SD BIOSENSOR), SARS-CoV-2 Rapid Antigen Test Nasal';'https://termgit.elga.gv.at/CodeSystem-dgc-ratnamemanufacturer';'Roche (SD BIOSENSOR), SARS-CoV-2 Rapid Antigen Test Nasal';'';'';'83';'0';'L';'1.2.40.0.34.5.205:2228';'';''
'2078';'1.2.40.0.34.5.205';'ArcDia International Oy Ltd, mariPOC Respi+';'https://termgit.elga.gv.at/CodeSystem-dgc-ratnamemanufacturer';'ArcDia International Oy Ltd, mariPOC Respi+';'';'';'84';'0';'L';'1.2.40.0.34.5.205:2078';'';''
'2079';'1.2.40.0.34.5.205';'ArcDia International Oy Ltd, mariPOC Quick Flu+';'https://termgit.elga.gv.at/CodeSystem-dgc-ratnamemanufacturer';'ArcDia International Oy Ltd, mariPOC Quick Flu+';'';'';'85';'0';'L';'1.2.40.0.34.5.205:2079';'';''
'1618';'1.2.40.0.34.5.205';'Artron Laboratories Inc., Artron COVID-19 Antigen Test';'https://termgit.elga.gv.at/CodeSystem-dgc-ratnamemanufacturer';'Artron Laboratories Inc., Artron COVID-19 Antigen Test';'';'';'86';'0';'L';'1.2.40.0.34.5.205:1618';'';''
'770';'1.2.40.0.34.5.205';'Assure Tech. (Hangzhou) Co., Ltd., ECOTEST COVID-19 Antigen Rapid Test Device';'https://termgit.elga.gv.at/CodeSystem-dgc-ratnamemanufacturer';'Assure Tech. (Hangzhou) Co., Ltd., ECOTEST COVID-19 Antigen Rapid Test Device';'';'';'87';'0';'L';'1.2.40.0.34.5.205:770';'';''
'2072';'1.2.40.0.34.5.205';'Beijing Jinwofu Bioengineering Technology Co.,Ltd., Novel Coronavirus (SARS-CoV-2) Antigen Rapid Test Kit';'https://termgit.elga.gv.at/CodeSystem-dgc-ratnamemanufacturer';'Beijing Jinwofu Bioengineering Technology Co.,Ltd., Novel Coronavirus (SARS-CoV-2) Antigen Rapid Test Kit';'';'';'88';'0';'L';'1.2.40.0.34.5.205:2072';'';''
'1485';'1.2.40.0.34.5.205';'Beijing Wantai Biological Pharmacy Enterprise Co., Ltd, Wantai SARS-CoV-2 Ag Rapid Test (colloidal gold)';'https://termgit.elga.gv.at/CodeSystem-dgc-ratnamemanufacturer';'Beijing Wantai Biological Pharmacy Enterprise Co., Ltd, Wantai SARS-CoV-2 Ag Rapid Test (colloidal gold)';'';'';'89';'0';'L';'1.2.40.0.34.5.205:1485';'';''
'2067';'1.2.40.0.34.5.205';'BIOTEKE CORPORATION (WUXI) CO., LTD, SARS-CoV-2 Antigen Test Kit (colloidal gold method)';'https://termgit.elga.gv.at/CodeSystem-dgc-ratnamemanufacturer';'BIOTEKE CORPORATION (WUXI) CO., LTD, SARS-CoV-2 Antigen Test Kit (colloidal gold method)';'';'';'90';'0';'L';'1.2.40.0.34.5.205:2067';'';''
'1243';'1.2.40.0.34.5.205';'Edinburgh Genetics Limited, Edinburgh Genetics ActivXpress+ COVID-19 Antigen Complete Testing Kit';'https://termgit.elga.gv.at/CodeSystem-dgc-ratnamemanufacturer';'Edinburgh Genetics Limited, Edinburgh Genetics ActivXpress+ COVID-19 Antigen Complete Testing Kit';'';'';'91';'0';'L';'1.2.40.0.34.5.205:1243';'';''
'1820';'1.2.40.0.34.5.205';'Getein Biotech, Inc, SARS-CoV-2 Antigen (Colloidal Gold)';'https://termgit.elga.gv.at/CodeSystem-dgc-ratnamemanufacturer';'Getein Biotech, Inc, SARS-CoV-2 Antigen (Colloidal Gold)';'';'';'92';'0';'L';'1.2.40.0.34.5.205:1820';'';''
'1197';'1.2.40.0.34.5.205';'Goldsite Diagnostic Inc., SARS-CoV-2 Antigen Kit (Colloidal Gold)';'https://termgit.elga.gv.at/CodeSystem-dgc-ratnamemanufacturer';'Goldsite Diagnostic Inc., SARS-CoV-2 Antigen Kit (Colloidal Gold)';'';'';'93';'0';'L';'1.2.40.0.34.5.205:1197';'';''
'1216';'1.2.40.0.34.5.205';'Guangdong Longsee Biomedical Co., Ltd., COVID-2019-nCoV Ag Rapid TestDetection Kit(Immuno-Chromatography)';'https://termgit.elga.gv.at/CodeSystem-dgc-ratnamemanufacturer';'Guangdong Longsee Biomedical Co., Ltd., COVID-2019-nCoV Ag Rapid TestDetection Kit(Immuno-Chromatography)';'';'';'94';'0';'L';'1.2.40.0.34.5.205:1216';'';''
'2107';'1.2.40.0.34.5.205';'Jiangsu Bioperfectus Technologies Co., Ltd., Novel Corona Virus (SARS-CoV-2) Ag Rapid Test Kit';'https://termgit.elga.gv.at/CodeSystem-dgc-ratnamemanufacturer';'Jiangsu Bioperfectus Technologies Co., Ltd., Novel Corona Virus (SARS-CoV-2) Ag Rapid Test Kit';'';'';'95';'0';'L';'1.2.40.0.34.5.205:2107';'';''
'1920';'1.2.40.0.34.5.205';'Jiangsu Diagnostics Biotechnology Co., Ltd, COVID-19 Antigen Rapid Test Cassette (Colloidal Gold)';'https://termgit.elga.gv.at/CodeSystem-dgc-ratnamemanufacturer';'Jiangsu Diagnostics Biotechnology Co., Ltd, COVID-19 Antigen Rapid Test Cassette (Colloidal Gold)';'';'';'96';'0';'L';'1.2.40.0.34.5.205:1920';'';''
'2200';'1.2.40.0.34.5.205';'NanoRepro AG, NanoRepro SARS-CoV-2 Antigen Rapid Test';'https://termgit.elga.gv.at/CodeSystem-dgc-ratnamemanufacturer';'NanoRepro AG, NanoRepro SARS-CoV-2 Antigen Rapid Test';'';'';'97';'0';'L';'1.2.40.0.34.5.205:2200';'';''
'1762';'1.2.40.0.34.5.205';'Novatech, SARS-CoV-2 Antigen Rapid Test';'https://termgit.elga.gv.at/CodeSystem-dgc-ratnamemanufacturer';'Novatech, SARS-CoV-2 Antigen Rapid Test';'';'';'98';'0';'L';'1.2.40.0.34.5.205:1762';'';''
'1465';'1.2.40.0.34.5.205';'Triplex International Biosciences Co., Ltd, China, SARS-CoV-2 Antigen Rapid Test Kit';'https://termgit.elga.gv.at/CodeSystem-dgc-ratnamemanufacturer';'Triplex International Biosciences Co., Ltd, China, SARS-CoV-2 Antigen Rapid Test Kit';'';'';'99';'0';'L';'1.2.40.0.34.5.205:1465';'';''
'1773';'1.2.40.0.34.5.205';'Wuhan Life Origin Biotech Joint Stock Co., Ltd., SARS-CoV-2 Antigen Assay Kit (Immunochromatography)';'https://termgit.elga.gv.at/CodeSystem-dgc-ratnamemanufacturer';'Wuhan Life Origin Biotech Joint Stock Co., Ltd., SARS-CoV-2 Antigen Assay Kit (Immunochromatography)';'';'';'100';'0';'L';'1.2.40.0.34.5.205:1773';'';''
'1957';'1.2.40.0.34.5.205';'Zhuhai Lituo Biotechnology Co., Ltd., COVID-19 Antigen Detection Kit (Colloidal Gold)';'https://termgit.elga.gv.at/CodeSystem-dgc-ratnamemanufacturer';'Zhuhai Lituo Biotechnology Co., Ltd., COVID-19 Antigen Detection Kit (Colloidal Gold)';'';'';'101';'0';'L';'1.2.40.0.34.5.205:1957';'';''
'2350';'1.2.40.0.34.5.205';'Assure Tech. (Hangzhou) Co., Ltd., ECOTEST COVID-19 Antigen Rapid Test Device';'https://termgit.elga.gv.at/CodeSystem-dgc-ratnamemanufacturer';'Assure Tech. (Hangzhou) Co., Ltd., ECOTEST COVID-19 Antigen Rapid Test Device';'';'';'102';'0';'L';'1.2.40.0.34.5.205:2350';'';''
'2247';'1.2.40.0.34.5.205';'BioGnost Ltd, CoviGnost AG Test Device 1x20';'https://termgit.elga.gv.at/CodeSystem-dgc-ratnamemanufacturer';'BioGnost Ltd, CoviGnost AG Test Device 1x20';'';'';'103';'0';'L';'1.2.40.0.34.5.205:2247';'';''
'1286';'1.2.40.0.34.5.205';'BIOHIT HealthCcare (Hefei) Co., Ltd., SARS-CoV-2 Antigen Rapid Test Kit (Fluorescence Immunochromatography)';'https://termgit.elga.gv.at/CodeSystem-dgc-ratnamemanufacturer';'BIOHIT HealthCcare (Hefei) Co., Ltd., SARS-CoV-2 Antigen Rapid Test Kit (Fluorescence Immunochromatography)';'';'';'104';'0';'L';'1.2.40.0.34.5.205:1286';'';''
'2035';'1.2.40.0.34.5.205';'BioMaxima SA, SARS-CoV-2 Ag Rapid Test';'https://termgit.elga.gv.at/CodeSystem-dgc-ratnamemanufacturer';'BioMaxima SA, SARS-CoV-2 Ag Rapid Test';'';'';'105';'0';'L';'1.2.40.0.34.5.205:2035';'';''
'2013';'1.2.40.0.34.5.205';'Biotical Health S.L.U.BIOTICAL HEALTH S.L.U, biotical SARS-CoV-2 Ag Card';'https://termgit.elga.gv.at/CodeSystem-dgc-ratnamemanufacturer';'Biotical Health S.L.U.BIOTICAL HEALTH S.L.U, biotical SARS-CoV-2 Ag Card';'';'';'106';'0';'L';'1.2.40.0.34.5.205:2013';'';''
'1989';'1.2.40.0.34.5.205';'Boditech Med Inc, AFIAS COVID-19 Ag';'https://termgit.elga.gv.at/CodeSystem-dgc-ratnamemanufacturer';'Boditech Med Inc, AFIAS COVID-19 Ag';'';'';'107';'0';'L';'1.2.40.0.34.5.205:1989';'';''
'2242';'1.2.40.0.34.5.205';'DNA Diagnostic, COVID-19 Antigen Detection Kit';'https://termgit.elga.gv.at/CodeSystem-dgc-ratnamemanufacturer';'DNA Diagnostic, COVID-19 Antigen Detection Kit';'';'';'108';'0';'L';'1.2.40.0.34.5.205:2242';'';''
'1855';'1.2.40.0.34.5.205';'GA Generic Assays GmbH, GA CoV-2 Antigen Rapid Test';'https://termgit.elga.gv.at/CodeSystem-dgc-ratnamemanufacturer';'GA Generic Assays GmbH, GA CoV-2 Antigen Rapid Test';'';'';'109';'0';'L';'1.2.40.0.34.5.205:1855';'';''
'1759';'1.2.40.0.34.5.205';'Hubei Jinjian Biology Co., Ltd, SARS-CoV-2 Antigen Test Kit';'https://termgit.elga.gv.at/CodeSystem-dgc-ratnamemanufacturer';'Hubei Jinjian Biology Co., Ltd, SARS-CoV-2 Antigen Test Kit';'';'';'110';'0';'L';'1.2.40.0.34.5.205:1759';'';''
'2241';'1.2.40.0.34.5.205';'NESAPOR EUROPA SL, MARESKIT COVID-19 ANTIGEN RAPID TEST KIT';'https://termgit.elga.gv.at/CodeSystem-dgc-ratnamemanufacturer';'NESAPOR EUROPA SL, MARESKIT COVID-19 ANTIGEN RAPID TEST KIT';'';'';'111';'0';'L';'1.2.40.0.34.5.205:2241';'';''
'2290';'1.2.40.0.34.5.205';'Rapid Pathogen Screening, Inc, LIAISON Quick Detect Covid Ag Assay';'https://termgit.elga.gv.at/CodeSystem-dgc-ratnamemanufacturer';'Rapid Pathogen Screening, Inc, LIAISON Quick Detect Covid Ag Assay';'';'';'112';'0';'L';'1.2.40.0.34.5.205:2290';'';''
'1178';'1.2.40.0.34.5.205';'Shenzhen Microprofit Biotech Co., Ltd., SARS-CoV-2 Spike Protein Test Kit (Colloidal Gold Chromatographic Immunoassay)';'https://termgit.elga.gv.at/CodeSystem-dgc-ratnamemanufacturer';'Shenzhen Microprofit Biotech Co., Ltd., SARS-CoV-2 Spike Protein Test Kit (Colloidal Gold Chromatographic Immunoassay)';'';'';'113';'0';'L';'1.2.40.0.34.5.205:1178';'';''
'2374';'1.2.40.0.34.5.205';'ABIOTEQ, Cora Gentest-19';'https://termgit.elga.gv.at/CodeSystem-dgc-ratnamemanufacturer';'ABIOTEQ, Cora Gentest-19';'';'';'114';'0';'L';'1.2.40.0.34.5.205:2374';'';''
'2579';'1.2.40.0.34.5.205';'AccuBioTech Co.,Ltd, Accu-Tell SARS-CoV-2 Ag Cassette';'https://termgit.elga.gv.at/CodeSystem-dgc-ratnamemanufacturer';'AccuBioTech Co.,Ltd, Accu-Tell SARS-CoV-2 Ag Cassette';'';'';'115';'0';'L';'1.2.40.0.34.5.205:2579';'';''
'2089';'1.2.40.0.34.5.205';'Anhui Formaster Biosci Co., Ltd., New Coronavirus (COVID-19) Antigen Rapid Test';'https://termgit.elga.gv.at/CodeSystem-dgc-ratnamemanufacturer';'Anhui Formaster Biosci Co., Ltd., New Coronavirus (COVID-19) Antigen Rapid Test';'';'';'116';'0';'L';'1.2.40.0.34.5.205:2089';'';''
'2494';'1.2.40.0.34.5.205';'Beijing O&D Biotech Co., Ltd., COVID-19 Antigen Rapid Test';'https://termgit.elga.gv.at/CodeSystem-dgc-ratnamemanufacturer';'Beijing O&D Biotech Co., Ltd., COVID-19 Antigen Rapid Test';'';'';'117';'0';'L';'1.2.40.0.34.5.205:2494';'';''
'1691';'1.2.40.0.34.5.205';'Chil Tibbi Malzeme Sanayi ve Ticaret Limited Sirketi, CHIL COVID-19 Antigen Rapid Test (Nasopharyngeal / Oropharyngeal Swab-Casette)';'https://termgit.elga.gv.at/CodeSystem-dgc-ratnamemanufacturer';'Chil T?bbi Malzeme Sanayi ve Ticaret Limited Sirketi, CHIL COVID-19 Antigen Rapid Test (Nasopharyngeal / Oropharyngeal Swab-Casette)';'Chil T?bbi Malzeme Sanayi ve Ticaret Limited Sirketi, CHIL COVID-19 Antigen Rapid Test (Nasopharyngeal / Oropharyngeal Swab-Casette)';'';'118';'0';'L';'1.2.40.0.34.5.205:1691';'';''
'2150';'1.2.40.0.34.5.205';'Chongqing M&D Biotechnology Co. Ltd, 2019-nCoV Antigen Test Kit';'https://termgit.elga.gv.at/CodeSystem-dgc-ratnamemanufacturer';'Chongqing M&D Biotechnology Co. Ltd, 2019-nCoV Antigen Test Kit';'';'';'119';'0';'L';'1.2.40.0.34.5.205:2150';'';''
'2273';'1.2.40.0.34.5.205';'Dräger Safety AG & Co. KGaA, Dräger Antigen Test SARS-CoV-2';'https://termgit.elga.gv.at/CodeSystem-dgc-ratnamemanufacturer';'Dräger Safety AG & Co. KGaA, Dräger Antigen Test SARS-CoV-2';'';'';'120';'0';'L';'1.2.40.0.34.5.205:2273';'';''
'2533';'1.2.40.0.34.5.205';'Dynamiker Biotechnolgy(Tianjin) Co., Ltd., Dynamiker SARS-CoV-2 Ag Rapid Test';'https://termgit.elga.gv.at/CodeSystem-dgc-ratnamemanufacturer';'Dynamiker Biotechnolgy(Tianjin) Co., Ltd., Dynamiker SARS-CoV-2 Ag Rapid Test';'';'';'121';'0';'L';'1.2.40.0.34.5.205:2533';'';''
'1929';'1.2.40.0.34.5.205';'Hoyotek Biomedical Co.,Ltd., Corona Virus (COVID-19) Antigen Rapid Test (Colloidal Gold)';'https://termgit.elga.gv.at/CodeSystem-dgc-ratnamemanufacturer';'Hoyotek Biomedical Co.,Ltd., Corona Virus (COVID-19) Antigen Rapid Test (Colloidal Gold)';'';'';'122';'0';'L';'1.2.40.0.34.5.205:1929';'';''
'1801';'1.2.40.0.34.5.205';'Innova Medical Group.Inc, Innova SARS-CoV-2 Antigen Rapid Qualitative Test';'https://termgit.elga.gv.at/CodeSystem-dgc-ratnamemanufacturer';'Innova Medical Group.Inc, Innova SARS-CoV-2 Antigen Rapid Qualitative Test';'';'';'123';'0';'L';'1.2.40.0.34.5.205:1801';'';''
'2278';'1.2.40.0.34.5.205';'Innovation Biotech(Beijing) Co.Ltd, Coronavirus (SARS-Cov-2) Antigen Rapid Test Cassette (Nasal swab)';'https://termgit.elga.gv.at/CodeSystem-dgc-ratnamemanufacturer';'Innovation Biotech(Beijing) Co.Ltd, Coronavirus (SARS-Cov-2) Antigen Rapid Test Cassette (Nasal swab)';'';'';'124';'0';'L';'1.2.40.0.34.5.205:2278';'';''
'2419';'1.2.40.0.34.5.205';'InTec PRODUCTS, INC., Rapid SARS-CoV-2 Antigen Test (nasopharyngeal specimen)';'https://termgit.elga.gv.at/CodeSystem-dgc-ratnamemanufacturer';'InTec PRODUCTS, INC., Rapid SARS-CoV-2 Antigen Test (nasopharyngeal specimen)';'';'';'125';'0';'L';'1.2.40.0.34.5.205:2419';'';''
'2144';'1.2.40.0.34.5.205';'Jiangsu Well Biotech Co., Ltd., COVID-19 Ag Rapid Test Device';'https://termgit.elga.gv.at/CodeSystem-dgc-ratnamemanufacturer';'Jiangsu Well Biotech Co., Ltd., COVID-19 Ag Rapid Test Device';'';'';'126';'0';'L';'1.2.40.0.34.5.205:2144';'';''
'2415';'1.2.40.0.34.5.205';'Shenzhen Dymind Biotechnology Co., Ltd, SARS-CoV-2 Antigen Test Kit (Colloidal Gold)';'https://termgit.elga.gv.at/CodeSystem-dgc-ratnamemanufacturer';'Shenzhen Dymind Biotechnology Co., Ltd, SARS-CoV-2 Antigen Test Kit (Colloidal Gold)';'';'';'127';'0';'L';'1.2.40.0.34.5.205:2415';'';''
'2414';'1.2.40.0.34.5.205';'Shenzhen Huian Biosci Technology Co., Ltd., SARS-CoV-2 Antigen Test Kit (Colloidal Gold)';'https://termgit.elga.gv.at/CodeSystem-dgc-ratnamemanufacturer';'Shenzhen Huian Biosci Technology Co., Ltd., SARS-CoV-2 Antigen Test Kit (Colloidal Gold)';'';'';'128';'0';'L';'1.2.40.0.34.5.205:2414';'';''
'1813';'1.2.40.0.34.5.205';'Shenzhen Kisshealth Biotechnology Co., Ltd, SARS-CoV-2 Antigen Test Kit (GICA)';'https://termgit.elga.gv.at/CodeSystem-dgc-ratnamemanufacturer';'Shenzhen Kisshealth Biotechnology Co., Ltd, SARS-CoV-2 Antigen Test Kit (GICA)';'';'';'129';'0';'L';'1.2.40.0.34.5.205:1813';'';''
'2026';'1.2.40.0.34.5.205';'Shenzhen Reagent Technology Co.,Ltd, SARS-CoV-2 antigen IVD kit SWAB';'https://termgit.elga.gv.at/CodeSystem-dgc-ratnamemanufacturer';'Shenzhen Reagent Technology Co.,Ltd, SARS-CoV-2 antigen IVD kit SWAB';'';'';'130';'0';'L';'1.2.40.0.34.5.205:2026';'';''
'2297';'1.2.40.0.34.5.205';'SureScreen Diagnostics, SARS-CoV-2 Rapid Antigen Test Cassette';'https://termgit.elga.gv.at/CodeSystem-dgc-ratnamemanufacturer';'SureScreen Diagnostics, SARS-CoV-2 Rapid Antigen Test Cassette';'';'';'131';'0';'L';'1.2.40.0.34.5.205:2297';'';''
'2143';'1.2.40.0.34.5.205';'Wuxi Biohermes Bio & Medical Technology Co., Ltd, SARS-CoV-2 Antigen Test Kit (Lateral Flow Assay)';'https://termgit.elga.gv.at/CodeSystem-dgc-ratnamemanufacturer';'Wuxi Biohermes Bio & Medical Technology Co., Ltd, SARS-CoV-2 Antigen Test Kit (Lateral Flow Assay)';'';'';'132';'0';'L';'1.2.40.0.34.5.205:2143';'';''
'1902';'1.2.40.0.34.5.205';'Zhuhai Encode Medical Engineering Co.,Ltd, ENCODE SARS-COV-2 Antigen Rapid Test Device';'https://termgit.elga.gv.at/CodeSystem-dgc-ratnamemanufacturer';'Zhuhai Encode Medical Engineering Co.,Ltd, ENCODE SARS-COV-2 Antigen Rapid Test Device';'';'';'133';'0';'L';'1.2.40.0.34.5.205:1902';'';''
'2282';'1.2.40.0.34.5.205';'Becton Dickinson, BD Kit for Rapid Detection of SARS-CoV-2';'https://termgit.elga.gv.at/CodeSystem-dgc-ratnamemanufacturer';'Becton Dickinson, BD Kit for Rapid Detection of SARS-CoV-2';'';'';'134';'0';'L';'1.2.40.0.34.5.205:2282';'';''
'2506';'1.2.40.0.34.5.205';'Nanjing Norman Biological Technology Co., Ltd., Novel Coronavirus (2019-nCoV) Antigen Testing Kit (Colloidal Gold)';'https://termgit.elga.gv.at/CodeSystem-dgc-ratnamemanufacturer';'Nanjing Norman Biological Technology Co., Ltd., Novel Coronavirus (2019-nCoV) Antigen Testing Kit (Colloidal Gold)';'';'';'135';'0';'L';'1.2.40.0.34.5.205:2506';'';''
'1880';'1.2.40.0.34.5.205';'NG Biotech, Ninonasal';'https://termgit.elga.gv.at/CodeSystem-dgc-ratnamemanufacturer';'NG Biotech, Ninonasal';'';'';'136';'0';'L';'1.2.40.0.34.5.205:1880';'';''
'2230';'1.2.40.0.34.5.205';'BIOHIT HealthCcare (Hefei) Co., Ltd., SARS-CoV-2 Antigen Rapid Test (Colloidal Gold Method)';'https://termgit.elga.gv.at/CodeSystem-dgc-ratnamemanufacturer';'BIOHIT HealthCcare (Hefei) Co., Ltd., SARS-CoV-2 Antigen Rapid Test (Colloidal Gold Method)';'';'';'137';'0';'L';'1.2.40.0.34.5.205:2230';'';''
'2642';'1.2.40.0.34.5.205';'Genobio Pharmaceutical Co., Ltd., Virusee SARS-CoV-2 Antigen Rapid Test (Colloidal Gold)';'https://termgit.elga.gv.at/CodeSystem-dgc-ratnamemanufacturer';'Genobio Pharmaceutical Co., Ltd., Virusee SARS-CoV-2 Antigen Rapid Test (Colloidal Gold)';'';'';'138';'0';'L';'1.2.40.0.34.5.205:2642';'';''
'1876';'1.2.40.0.34.5.205';'Hangzhou Biotest Biotech Co., Ltd, COVID-19 Antigen Rapid Test Cassette(Nasal Swab)';'https://termgit.elga.gv.at/CodeSystem-dgc-ratnamemanufacturer';'Hangzhou Biotest Biotech Co., Ltd, COVID-19 Antigen Rapid Test Cassette(Nasal Swab)';'';'';'139';'0';'L';'1.2.40.0.34.5.205:1876';'';''
'1945';'1.2.40.0.34.5.205';'Hangzhou Sejoy Electronics & Instruments Co.Ltd, SARS-CoV-2 Antigen Rapid Test Cassette';'https://termgit.elga.gv.at/CodeSystem-dgc-ratnamemanufacturer';'Hangzhou Sejoy Electronics & Instruments Co.Ltd, SARS-CoV-2 Antigen Rapid Test Cassette';'';'';'140';'0';'L';'1.2.40.0.34.5.205:1945';'';''
'2586';'1.2.40.0.34.5.205';'Jiangsu Mole Bioscience CO., LTD., SARS-CoV-2 Antigen Test Cassette';'https://termgit.elga.gv.at/CodeSystem-dgc-ratnamemanufacturer';'Jiangsu Mole Bioscience CO., LTD., SARS-CoV-2 Antigen Test Cassette';'';'';'141';'0';'L';'1.2.40.0.34.5.205:2586';'';''
'2555';'1.2.40.0.34.5.205';'IEDAU INTERNATIONAL GMBH, Covid-19 Antigen Schnelltest (Colloidales Gold)';'https://termgit.elga.gv.at/CodeSystem-dgc-ratnamemanufacturer';'IEDAU INTERNATIONAL GMBH, Covid-19 Antigen Schnelltest (Colloidales Gold)';'';'';'142';'0';'L';'1.2.40.0.34.5.205:2555';'';''
'2640';'1.2.40.0.34.5.205';'Mologic Ltd, COVIOS Ag COVID-19 Antigen Rapid Diagnostic Test';'https://termgit.elga.gv.at/CodeSystem-dgc-ratnamemanufacturer';'Mologic Ltd, COVIOS Ag COVID-19 Antigen Rapid Diagnostic Test';'';'';'143';'0';'L';'1.2.40.0.34.5.205:2640';'';''
'2301';'1.2.40.0.34.5.205';'Nanjing Liming Bio-Products Co., Ltd., StrongStep SARS-CoV-2 Antigen Rapid Test';'https://termgit.elga.gv.at/CodeSystem-dgc-ratnamemanufacturer';'Nanjing Liming Bio-Products Co., Ltd., StrongStep SARS-CoV-2 Antigen Rapid Test';'';'';'144';'0';'L';'1.2.40.0.34.5.205:2301';'';''
'2152';'1.2.40.0.34.5.205';'Shenzhen CAS-Envision Medical Technology Co., Ltd., SARS-CoV-2-Antigen Rapid Detection Kit';'https://termgit.elga.gv.at/CodeSystem-dgc-ratnamemanufacturer';'Shenzhen CAS-Envision Medical Technology Co., Ltd., SARS-CoV-2-Antigen Rapid Detection Kit';'';'';'145';'0';'L';'1.2.40.0.34.5.205:2152';'';''
'1228';'1.2.40.0.34.5.205';'Shenzhen Microprofit Biotech Co., Ltd, SARS-CoV-2 Spike Protein Test Kit (Fluorescence Immunoassay)';'https://termgit.elga.gv.at/CodeSystem-dgc-ratnamemanufacturer';'Shenzhen Microprofit Biotech Co., Ltd, SARS-CoV-2 Spike Protein Test Kit (Fluorescence Immunoassay)';'';'';'146';'0';'L';'1.2.40.0.34.5.205:1228';'';''
'1347';'1.2.40.0.34.5.205';'Shenzhen YHLO Biotech Co., Ltd., GLINE-2019-nCoV Ag';'https://termgit.elga.gv.at/CodeSystem-dgc-ratnamemanufacturer';'Shenzhen YHLO Biotech Co., Ltd., GLINE-2019-nCoV Ag';'';'';'147';'0';'L';'1.2.40.0.34.5.205:1347';'';''
'2271';'1.2.40.0.34.5.205';'Pantest SA, Pantest Coronavirus Ag (Nasopharyngeal Swab)';'https://termgit.elga.gv.at/CodeSystem-dgc-ratnamemanufacturer';'Pantest SA, Pantest Coronavirus Ag (Nasopharyngeal Swab)';'';'';'148';'0';'L';'1.2.40.0.34.5.205:2271';'';''
'2684';'1.2.40.0.34.5.205';'Zhejiang GENE SCIENCE Co., Ltd, Novel Coronavirus (COVID-19) Antigen Detection Kit (Swab)';'https://termgit.elga.gv.at/CodeSystem-dgc-ratnamemanufacturer';'Zhejiang GENE SCIENCE Co., Ltd, Novel Coronavirus (COVID-19) Antigen Detection Kit (Swab)';'';'';'149';'0';'L';'1.2.40.0.34.5.205:2684';'';''
'1778';'1.2.40.0.34.5.205';'Beijing Kewei Clinical Diagnostic Reagent Inc, COVID19 Antigen Rapid Test Kit';'https://termgit.elga.gv.at/CodeSystem-dgc-ratnamemanufacturer';'Beijing Kewei Clinical Diagnostic Reagent Inc, COVID19 Antigen Rapid Test Kit';'';'';'150';'0';'L';'1.2.40.0.34.5.205:1778';'';''
'2696';'1.2.40.0.34.5.205';'Cesna Biyoteknoloji Arast?rma Gelistirme Laboratuvar Sist.Ins.Müh.Dan.San.Tic.Ltd.Sti., CHECK UP SARS-COV-2 NASAL ANTIGEN RAPID TEST';'https://termgit.elga.gv.at/CodeSystem-dgc-ratnamemanufacturer';'Cesna Biyoteknoloji Arast?rma Gelistirme Laboratuvar Sist.Ins.Müh.Dan.San.Tic.Ltd.Sti., CHECK UP SARS-COV-2 NASAL ANTIGEN RAPID TEST';'';'';'151';'0';'L';'1.2.40.0.34.5.205:2696';'';''
'2746';'1.2.40.0.34.5.205';'Cesna Biyoteknoloji Arast?rma Gelistirme Laboratuvar Sist.Ins.Müh.Dan.San.Tic.Ltd.Sti., CHECK UP SARS-COV-2 NASOPHARYNGEAL RAPID ANTIGEN TEST';'https://termgit.elga.gv.at/CodeSystem-dgc-ratnamemanufacturer';'Cesna Biyoteknoloji Arast?rma Gelistirme Laboratuvar Sist.Ins.Müh.Dan.San.Tic.Ltd.Sti., CHECK UP SARS-COV-2 NASOPHARYNGEAL RAPID ANTIGEN TEST';'';'';'152';'0';'L';'1.2.40.0.34.5.205:2746';'';''
'2695';'1.2.40.0.34.5.205';'Glallergen CO., LTD., Novel Coronavirus (2019-nCoV) Antigen Test Kit (Colloidal gold immunochromatography)';'https://termgit.elga.gv.at/CodeSystem-dgc-ratnamemanufacturer';'Glallergen CO., LTD., Novel Coronavirus (2019-nCoV) Antigen Test Kit (Colloidal gold immunochromatography)';'';'';'153';'0';'L';'1.2.40.0.34.5.205:2695';'';''
'2629';'1.2.40.0.34.5.205';'Hangzhou DIAN Biotechnology Co., Ltd., COVID-19 Antigen Test Cassette';'https://termgit.elga.gv.at/CodeSystem-dgc-ratnamemanufacturer';'Hangzhou DIAN Biotechnology Co., Ltd., COVID-19 Antigen Test Cassette';'';'';'154';'0';'L';'1.2.40.0.34.5.205:2629';'';''
'1353';'1.2.40.0.34.5.205';'LINKCARE (NANTONG DIAGNOS BIO), COVID-19 Antigen Test Kit (Colloidal Gold)';'https://termgit.elga.gv.at/CodeSystem-dgc-ratnamemanufacturer';'LINKCARE (NANTONG DIAGNOS BIO), COVID-19 Antigen Test Kit (Colloidal Gold)';'';'';'155';'0';'L';'1.2.40.0.34.5.205:1353';'';''
'2741';'1.2.40.0.34.5.205';'OSANG Healthcare Co., Ltd., GeneFinder COVID-19 Ag Plus Rapid Test';'https://termgit.elga.gv.at/CodeSystem-dgc-ratnamemanufacturer';'OSANG Healthcare Co., Ltd., GeneFinder COVID-19 Ag Plus Rapid Test';'';'';'156';'0';'L';'1.2.40.0.34.5.205:2741';'';''
'2754';'1.2.40.0.34.5.205';'Qingdao Hightop Biotech Co., Ltd., SARS-CoV-2/Flu A+B/RSV Antigen Rapid Test';'https://termgit.elga.gv.at/CodeSystem-dgc-ratnamemanufacturer';'Qingdao Hightop Biotech Co., Ltd., SARS-CoV-2/Flu A+B/RSV Antigen Rapid Test';'';'';'157';'0';'L';'1.2.40.0.34.5.205:2754';'';''
'2097';'1.2.40.0.34.5.205';'Sansure Biotech Inc, SARS-CoV-2 Rapid Antigen Test (Colloidal Gold Method)';'https://termgit.elga.gv.at/CodeSystem-dgc-ratnamemanufacturer';'Sansure Biotech Inc, SARS-CoV-2 Rapid Antigen Test (Colloidal Gold Method)';'';'';'158';'0';'L';'1.2.40.0.34.5.205:2097';'';''
'2584';'1.2.40.0.34.5.205';'TÜRKLAB TIBBI MALZEMELER SAN. ve TIC. A.S., INFO Covid-19 Ag Test';'https://termgit.elga.gv.at/CodeSystem-dgc-ratnamemanufacturer';'TÜRKLAB TIBBI MALZEMELER SAN. ve TIC. A.S., INFO Covid-19 Ag Test';'';'';'159';'0';'L';'1.2.40.0.34.5.205:2584';'';''
'2100';'1.2.40.0.34.5.205';'VivaChek Biotech (Hangzhou) Co., Ltd, China, Verino Pro SARS CoV 2 Ag Rapid Test';'https://termgit.elga.gv.at/CodeSystem-dgc-ratnamemanufacturer';'VivaChek Biotech (Hangzhou) Co., Ltd, China, Verino Pro SARS CoV 2 Ag Rapid Test';'';'';'160';'0';'L';'1.2.40.0.34.5.205:2100';'';''
'2807';'1.2.40.0.34.5.205';'Beijing Hotgen Biotech Co., Ltd, Coronavirus (2019-nCoV)-Antigentest';'https://termgit.elga.gv.at/CodeSystem-dgc-ratnamemanufacturer';'Beijing Hotgen Biotech Co., Ltd, Coronavirus (2019-nCoV)-Antigentest';'';'';'161';'0';'L';'1.2.40.0.34.5.205:2807';'';''
'2380';'1.2.40.0.34.5.205';'BioSpeedia International, COVID19Speed-Antigen Test BSD_0503 ';'https://termgit.elga.gv.at/CodeSystem-dgc-ratnamemanufacturer';'BioSpeedia International, COVID19Speed-Antigen Test BSD_0503 ';'';'';'162';'0';'L';'1.2.40.0.34.5.205:2380';'';''
'2756';'1.2.40.0.34.5.205';'DNA Diagnostic, SARS-CoV-2 Antigen Rapid Test';'https://termgit.elga.gv.at/CodeSystem-dgc-ratnamemanufacturer';'DNA Diagnostic, SARS-CoV-2 Antigen Rapid Test';'';'';'163';'0';'L';'1.2.40.0.34.5.205:2756';'';''
'2164';'1.2.40.0.34.5.205';'Nanjing Synthgene Medical Technology Co., Ltd., SARS-COV-2 Nucleocapsid (N) Antigen Rapid Detection Kit (Colloidal gold method)';'https://termgit.elga.gv.at/CodeSystem-dgc-ratnamemanufacturer';'Nanjing Synthgene Medical Technology Co., Ltd., SARS-COV-2 Nucleocapsid (N) Antigen Rapid Detection Kit (Colloidal gold method)';'';'';'164';'0';'L';'1.2.40.0.34.5.205:2164';'';''
'2763';'1.2.40.0.34.5.205';'ScheBo Biotech, ScheBo SARS CoV-2 Quick ANTIGEN (Colloidal Gold Method)';'https://termgit.elga.gv.at/CodeSystem-dgc-ratnamemanufacturer';'ScheBo Biotech, ScheBo SARS CoV-2 Quick ANTIGEN (Colloidal Gold Method)';'';'';'165';'0';'L';'1.2.40.0.34.5.205:2763';'';''
'1942';'1.2.40.0.34.5.205';'Surge Medical Inc., COVID-19 Antigen Test Kit';'https://termgit.elga.gv.at/CodeSystem-dgc-ratnamemanufacturer';'Surge Medical Inc., COVID-19 Antigen Test Kit';'';'';'166';'0';'L';'1.2.40.0.34.5.205:1942';'';''
'1689';'1.2.40.0.34.5.205';'TÜRKLAB TIBBI MALZEMELER SAN. ve TIC. A.S., Covid-19 Ag Test';'https://termgit.elga.gv.at/CodeSystem-dgc-ratnamemanufacturer';'TÜRKLAB TIBBI MALZEMELER SAN. ve TIC. A.S., Covid-19 Ag Test';'';'';'167';'0';'L';'1.2.40.0.34.5.205:1689';'';''
'1751';'1.2.40.0.34.5.205';'TÜRKLAB TIBBI MALZEMELER SAN. ve TIC. A.S., RAPIDAN TESTER Covid-19 Ag Test';'https://termgit.elga.gv.at/CodeSystem-dgc-ratnamemanufacturer';'TÜRKLAB TIBBI MALZEMELER SAN. ve TIC. A.S., RAPIDAN TESTER Covid-19 Ag Test';'';'';'168';'0';'L';'1.2.40.0.34.5.205:1751';'';''
'1722';'1.2.40.0.34.5.205';'TÜRKLAB TIBBI MALZEMELER SAN. ve TIC. A.S., TOYO Covid-19 Ag Tes';'https://termgit.elga.gv.at/CodeSystem-dgc-ratnamemanufacturer';'TÜRKLAB TIBBI MALZEMELER SAN. ve TIC. A.S., TOYO Covid-19 Ag Tes';'';'';'169';'0';'L';'1.2.40.0.34.5.205:1722';'';''
'1865';'1.2.40.0.34.5.205';'ACON Biotech(Hangzhou) Co., Ltd., Flowflex SARS-CoV-2 Antigen Rapid Test (Nasal/Saliva)';'https://termgit.elga.gv.at/CodeSystem-dgc-ratnamemanufacturer';'ACON Biotech(Hangzhou) Co., Ltd., Flowflex SARS-CoV-2 Antigen Rapid Test (Nasal/Saliva)';'';'';'170';'0';'L';'1.2.40.0.34.5.205:1865';'';''
'2853';'1.2.40.0.34.5.205';'GenSure Biotech Inc., GenSure COVID-19 Antigen Rapid Test Kit';'https://termgit.elga.gv.at/CodeSystem-dgc-ratnamemanufacturer';'GenSure Biotech Inc., GenSure COVID-19 Antigen Rapid Test Kit';'';'';'171';'0';'L';'1.2.40.0.34.5.205:2853';'';''
'1899';'1.2.40.0.34.5.205';'Jiangsu Konsung Bio-Medical Science and Technology Co., H+W_COVID-19 Antigen Rapid Test Kit (Colloidal Gold)';'https://termgit.elga.gv.at/CodeSystem-dgc-ratnamemanufacturer';'Jiangsu Konsung Bio-Medical Science and Technology Co., H+W_COVID-19 Antigen Rapid Test Kit (Colloidal Gold)';'';'';'172';'0';'L';'1.2.40.0.34.5.205:1899';'';''
'2260';'1.2.40.0.34.5.205';'Multi-G bvba, Covid19Check-NAS';'https://termgit.elga.gv.at/CodeSystem-dgc-ratnamemanufacturer';'Multi-G bvba, Covid19Check-NAS';'';'';'173';'0';'L';'1.2.40.0.34.5.205:2260';'';''
'1573';'1.2.40.0.34.5.205';'Nantong Egens Biotechnology Co.,Ltd, COVID-19 Antigen Rapid Test Kit';'https://termgit.elga.gv.at/CodeSystem-dgc-ratnamemanufacturer';'Nantong Egens Biotechnology Co.,Ltd, COVID-19 Antigen Rapid Test Kit';'';'';'174';'0';'L';'1.2.40.0.34.5.205:1573';'';''
'2608';'1.2.40.0.34.5.205';'Neo-nostics (Suzhou) Bioengineering Co., Ltd., COVID 19 Antigen Test Kit (Colloidal Gold Method)';'https://termgit.elga.gv.at/CodeSystem-dgc-ratnamemanufacturer';'Neo-nostics (Suzhou) Bioengineering Co., Ltd., COVID 19 Antigen Test Kit (Colloidal Gold Method)';'';'';'175';'0';'L';'1.2.40.0.34.5.205:2608';'';''
'2519';'1.2.40.0.34.5.205';'BIOLAN HEALTH, S.L, COVID-19 Antigen Rapid Test (Colloidal Gold Method)';'https://termgit.elga.gv.at/CodeSystem-dgc-ratnamemanufacturer';'BIOLAN HEALTH, S.L, COVID-19 Antigen Rapid Test (Colloidal Gold Method)';'';'';'176';'0';'L';'1.2.40.0.34.5.205:2519';'';''
'2724';'1.2.40.0.34.5.205';'Fosun Diagnostics (Shanghai) Co.,Ltd., China, Fosun Covid-19 Ag Card';'https://termgit.elga.gv.at/CodeSystem-dgc-ratnamemanufacturer';'Fosun Diagnostics (Shanghai) Co.,Ltd., China, Fosun Covid-19 Ag Card';'';'';'177';'0';'L';'1.2.40.0.34.5.205:2724';'';''
'2257';'1.2.40.0.34.5.205';'Hangzhou AllTest Biotech Co., Ltd, SARS-CoV-2 Antigen Rapid Test (Nasal Swab)';'https://termgit.elga.gv.at/CodeSystem-dgc-ratnamemanufacturer';'Hangzhou AllTest Biotech Co., Ltd, SARS-CoV-2 Antigen Rapid Test (Nasal Swab)';'';'';'178';'0';'L';'1.2.40.0.34.5.205:2257';'';''
'1988';'1.2.40.0.34.5.205';'Inzek International Trading B.V., Biozek covid-19 Antigen Rapidtest BCOV-502';'https://termgit.elga.gv.at/CodeSystem-dgc-ratnamemanufacturer';'Inzek International Trading B.V., Biozek covid-19 Antigen Rapidtest BCOV-502';'';'';'179';'0';'L';'1.2.40.0.34.5.205:1988';'';''
'2672';'1.2.40.0.34.5.205';'Pierenkemper GmbH, (SARS-CoV-2) Antigen Rapid Test COVIDENT (SWAB) COVID-19';'https://termgit.elga.gv.at/CodeSystem-dgc-ratnamemanufacturer';'Pierenkemper GmbH, (SARS-CoV-2) Antigen Rapid Test COVIDENT (SWAB) COVID-19';'';'';'180';'0';'L';'1.2.40.0.34.5.205:2672';'';''
'2742';'1.2.40.0.34.5.205';'Wuhan HealthCare Biotechnology Co. Ltd., SARS-CoV-2 Antigen Test Kit (Colloidal Gold)';'https://termgit.elga.gv.at/CodeSystem-dgc-ratnamemanufacturer';'Wuhan HealthCare Biotechnology Co. Ltd., SARS-CoV-2 Antigen Test Kit (Colloidal Gold)';'';'';'181';'0';'L';'1.2.40.0.34.5.205:2742';'';''
'2201';'1.2.40.0.34.5.205';'Zybio Inc., SARS-CoV-2 Antigen Assay Kit (Colloidal Gold Method)';'https://termgit.elga.gv.at/CodeSystem-dgc-ratnamemanufacturer';'Zybio Inc., SARS-CoV-2 Antigen Assay Kit (Colloidal Gold Method)';'';'';'182';'0';'L';'1.2.40.0.34.5.205:2201';'';''
'1926';'1.2.40.0.34.5.205';'ARISTA Biotech Pte.LTD., ARISTA COVID-19 Antigen Rapid Test';'https://termgit.elga.gv.at/CodeSystem-dgc-ratnamemanufacturer';'ARISTA Biotech Pte.LTD., ARISTA COVID-19 Antigen Rapid Test';'';'';'183';'0';'L';'1.2.40.0.34.5.205:1926';'';''
'1244';'1.2.40.0.34.5.205';'GenBody Inc, GenBody COVID-19 Ag Test';'https://termgit.elga.gv.at/CodeSystem-dgc-ratnamemanufacturer';'GenBody Inc, GenBody COVID-19 Ag Test';'';'';'184';'0';'L';'1.2.40.0.34.5.205:1244';'';''
'2302';'1.2.40.0.34.5.205';'Hangzhou AllTest Biotech Co., Ltd, COVID-19 Antigen Test Cassette (Nasopharyngeal Swab)(FIA)';'https://termgit.elga.gv.at/CodeSystem-dgc-ratnamemanufacturer';'Hangzhou AllTest Biotech Co., Ltd, COVID-19 Antigen Test Cassette (Nasopharyngeal Swab)(FIA)';'';'';'185';'0';'L';'1.2.40.0.34.5.205:2302';'';''
'2862';'1.2.40.0.34.5.205';'Hangzhou Funworld Biotech Co., Ltd, SARS-CoV-2 Antigen Rapid Test Device';'https://termgit.elga.gv.at/CodeSystem-dgc-ratnamemanufacturer';'Hangzhou Funworld Biotech Co., Ltd, SARS-CoV-2 Antigen Rapid Test Device';'';'';'186';'0';'L';'1.2.40.0.34.5.205:2862';'';''
'2979';'1.2.40.0.34.5.205';'Hangzhou Jucheng Medical Products Co., Ltd, SARS-CoV-2 Ag Rapid Test Kit';'https://termgit.elga.gv.at/CodeSystem-dgc-ratnamemanufacturer';'Hangzhou Jucheng Medical Products Co., Ltd, SARS-CoV-2 Ag Rapid Test Kit';'';'';'187';'0';'L';'1.2.40.0.34.5.205:2979';'';''
'1783';'1.2.40.0.34.5.205';'InTec PRODUCTS, INC, Rapid SARS-CoV-2 Antigen Test (nasopharyngeal/nasal specimen)';'https://termgit.elga.gv.at/CodeSystem-dgc-ratnamemanufacturer';'InTec PRODUCTS, INC, Rapid SARS-CoV-2 Antigen Test (nasopharyngeal/nasal specimen)';'';'';'188';'0';'L';'1.2.40.0.34.5.205:1783';'';''
'2963';'1.2.40.0.34.5.205';'Jiangxi Province JinHuan Medical Instrument Co., LTD., DREHA Novel Coronavirus (SARS-CoV-2) Antigen Rapid Detection Kit';'https://termgit.elga.gv.at/CodeSystem-dgc-ratnamemanufacturer';'Jiangxi Province JinHuan Medical Instrument Co., LTD., DREHA Novel Coronavirus (SARS-CoV-2) Antigen Rapid Detection Kit';'';'';'189';'0';'L';'1.2.40.0.34.5.205:2963';'';''
'2685';'1.2.40.0.34.5.205';'PRIMA Lab SA, COVID-19 Antigen Rapid Test';'https://termgit.elga.gv.at/CodeSystem-dgc-ratnamemanufacturer';'PRIMA Lab SA, COVID-19 Antigen Rapid Test';'';'';'190';'0';'L';'1.2.40.0.34.5.205:2685';'';''
'2941';'1.2.40.0.34.5.205';'Shenzhen Kingfocus Biomedical Engineering Co., Ltd., COVID-19 Antigen Detection Kit (Quantum Dots-Based Immunofluorescence Chromatography)';'https://termgit.elga.gv.at/CodeSystem-dgc-ratnamemanufacturer';'Shenzhen Kingfocus Biomedical Engineering Co., Ltd., COVID-19 Antigen Detection Kit (Quantum Dots-Based Immunofluorescence Chromatography)';'';'';'191';'0';'L';'1.2.40.0.34.5.205:2941';'';''
'2124';'1.2.40.0.34.5.205';'Fujirebio, Lumipulse G SARS-CoV-2 Ag';'https://termgit.elga.gv.at/CodeSystem-dgc-ratnamemanufacturer';'Fujirebio, Lumipulse G SARS-CoV-2 Ag';'';'';'192';'0';'L';'1.2.40.0.34.5.205:2124';'';''
'1791';'1.2.40.0.34.5.205';'Immunospark s.r.l., Rapid SARS-Cov2 Antigen Test';'https://termgit.elga.gv.at/CodeSystem-dgc-ratnamemanufacturer';'Immunospark s.r.l., Rapid SARS-Cov2 Antigen Test';'';'';'193';'0';'L';'1.2.40.0.34.5.205:1791';'';''
'2866';'1.2.40.0.34.5.205';'Lifecosm Biotech Limited, COVID-19 Antigen Test Cassette';'https://termgit.elga.gv.at/CodeSystem-dgc-ratnamemanufacturer';'Lifecosm Biotech Limited, COVID-19 Antigen Test Cassette';'';'';'194';'0';'L';'1.2.40.0.34.5.205:2866';'';''
'2812';'1.2.40.0.34.5.205';'Shenzhen Huaree Technology Co.,Ltd, SARS-CoV-2 Antigen Rapid Test Kit (Immunochromatography)';'https://termgit.elga.gv.at/CodeSystem-dgc-ratnamemanufacturer';'Shenzhen Huaree Technology Co.,Ltd, SARS-CoV-2 Antigen Rapid Test Kit (Immunochromatography)';'';'';'195';'0';'L';'1.2.40.0.34.5.205:2812';'';''
'3015';'1.2.40.0.34.5.205';'Suzhou Soochow University Saier Immuno Biotech Co., Ltd., InstantSure Covid-19 Ag CARD';'https://termgit.elga.gv.at/CodeSystem-dgc-ratnamemanufacturer';'Suzhou Soochow University Saier Immuno Biotech Co., Ltd., InstantSure Covid-19 Ag CARD';'';'';'196';'0';'L';'1.2.40.0.34.5.205:3015';'';''
'2942';'1.2.40.0.34.5.205';'Hangzhou Zheda Dixun Biological Gene Engineering Co., Ltd., SARS-CoV-2 Nucleocapsid (N) Antigen Rapid Test Cassette (Swab)';'https://termgit.elga.gv.at/CodeSystem-dgc-ratnamemanufacturer';'Hangzhou Zheda Dixun Biological Gene Engineering Co., Ltd., SARS-CoV-2 Nucleocapsid (N) Antigen Rapid Test Cassette (Swab)';'';'';'197';'0';'L';'1.2.40.0.34.5.205:2942';'';''
'2319';'1.2.40.0.34.5.205';'Hangzhou AllTest Biotech Co., Ltd, CVAG4080A ? GSD NovaGen SARS-CoV-2 Ag Rapid Test (NP Swab)';'https://termgit.elga.gv.at/CodeSystem-dgc-ratnamemanufacturer';'Hangzhou AllTest Biotech Co., Ltd, CVAG4080A ? GSD NovaGen SARS-CoV-2 Ag Rapid Test (NP Swab)';'';'';'198';'0';'L';'1.2.40.0.34.5.205:2319';'';''
'1375';'1.2.40.0.34.5.205';'DIALAB GmbH, DIAQUICK COVID -19 Ag Cassette';'https://termgit.elga.gv.at/CodeSystem-dgc-ratnamemanufacturer';'DIALAB GmbH, DIAQUICK COVID -19 Ag Cassette';'';'';'199';'0';'L';'1.2.40.0.34.5.205:1375';'';''
'2111';'1.2.40.0.34.5.205';'VivaChek Biotech (Hangzhou) Co., Ltd, SARS-CoV-2 Ag Rapid Test';'https://termgit.elga.gv.at/CodeSystem-dgc-ratnamemanufacturer';'VivaChek Biotech (Hangzhou) Co., Ltd, SARS-CoV-2 Ag Rapid Test';'';'';'200';'0';'L';'1.2.40.0.34.5.205:2111';'';''
'2858';'1.2.40.0.34.5.205';'Bioscience (Tianjin) Diagnostic Technology Co.,Ltd, Novel Coronavirus (2019-nCoV) Antigen Rapid Detection';'https://termgit.elga.gv.at/CodeSystem-dgc-ratnamemanufacturer';'Bioscience (Tianjin) Diagnostic Technology Co.,Ltd, Novel Coronavirus (2019-nCoV) Antigen Rapid Detection';'';'';'201';'0';'L';'1.2.40.0.34.5.205:2858';'';''
'2588';'1.2.40.0.34.5.205';'Changzhou Biowin Pharmaceutical Co.,Ltd., Novel Coronavirus(COVID-19) Antigen Test Kit (Colloidal Gold)';'https://termgit.elga.gv.at/CodeSystem-dgc-ratnamemanufacturer';'Changzhou Biowin Pharmaceutical Co.,Ltd., Novel Coronavirus(COVID-19) Antigen Test Kit (Colloidal Gold)';'';'';'202';'0';'L';'1.2.40.0.34.5.205:2588';'';''
'2449';'1.2.40.0.34.5.205';'Citest Diagnostics Inc., COVID-19 Antigen Rapid Test (Nasal Swab)';'https://termgit.elga.gv.at/CodeSystem-dgc-ratnamemanufacturer';'Citest Diagnostics Inc., COVID-19 Antigen Rapid Test (Nasal Swab)';'';'';'203';'0';'L';'1.2.40.0.34.5.205:2449';'';''
'2885';'1.2.40.0.34.5.205';'Hangzhou GENESIS Biodetection and Biocontrol CO.,LTD, KaiBiLi COVID-19 Antigen Pro';'https://termgit.elga.gv.at/CodeSystem-dgc-ratnamemanufacturer';'Hangzhou GENESIS Biodetection and Biocontrol CO.,LTD, KaiBiLi COVID-19 Antigen Pro';'';'';'204';'0';'L';'1.2.40.0.34.5.205:2885';'';''
'1952';'1.2.40.0.34.5.205';'Hangzhou Sejoy Electronics & Instruments Co.Ltd, SARS-CoV-2 Antigen Rapid Test Cassette (nasal, nasopharyngeal, oropharyngeal, saliva)';'https://termgit.elga.gv.at/CodeSystem-dgc-ratnamemanufacturer';'Hangzhou Sejoy Electronics & Instruments Co.Ltd, SARS-CoV-2 Antigen Rapid Test Cassette (nasal, nasopharyngeal, oropharyngeal, saliva)';'';'';'205';'0';'L';'1.2.40.0.34.5.205:1952';'';''
'1780';'1.2.40.0.34.5.205';'Spring Healthcare Services AG, SARS-Cov-2 Antigen Rapid Test Cassette (swab)';'https://termgit.elga.gv.at/CodeSystem-dgc-ratnamemanufacturer';'Spring Healthcare Services AG, SARS-Cov-2 Antigen Rapid Test Cassette (swab)';'';'';'206';'0';'L';'1.2.40.0.34.5.205:1780';'';''
'3093';'1.2.40.0.34.5.205';'TBG BIOTECHNOLOGY XIAMEN INC., SARS-CoV-2 Antigen Rapid Test (Nasal Swab)';'https://termgit.elga.gv.at/CodeSystem-dgc-ratnamemanufacturer';'TBG BIOTECHNOLOGY XIAMEN INC., SARS-CoV-2 Antigen Rapid Test (Nasal Swab)';'';'';'207';'0';'L';'1.2.40.0.34.5.205:3093';'';''
'1276';'1.2.40.0.34.5.205';'Willi Fox GmbH, Willi Fox COVID-19 Antigen rapid test';'https://termgit.elga.gv.at/CodeSystem-dgc-ratnamemanufacturer';'Willi Fox GmbH, Willi Fox COVID-19 Antigen rapid test';'';'';'208';'0';'L';'1.2.40.0.34.5.205:1276';'';''
'3099';'1.2.40.0.34.5.205';'BioDetect (Xiamen) Biotechnology Co., Ltd., RAPID SARS-COV-2 ANTIGEN TEST CARD';'https://termgit.elga.gv.at/CodeSystem-dgc-ratnamemanufacturer';'BioDetect (Xiamen) Biotechnology Co., Ltd., RAPID SARS-COV-2 ANTIGEN TEST CARD';'';'';'209';'0';'L';'1.2.40.0.34.5.205:3099';'';''
'1647';'1.2.40.0.34.5.205';'CALTH Inc., AllCheck COVID19 Ag';'https://termgit.elga.gv.at/CodeSystem-dgc-ratnamemanufacturer';'CALTH Inc., AllCheck COVID19 Ag';'';'';'210';'0';'L';'1.2.40.0.34.5.205:1647';'';''
'2691';'1.2.40.0.34.5.205';'CALTH Inc., AllCheck COVID19 Ag Nasal';'https://termgit.elga.gv.at/CodeSystem-dgc-ratnamemanufacturer';'CALTH Inc., AllCheck COVID19 Ag Nasal';'';'';'211';'0';'L';'1.2.40.0.34.5.205:2691';'';''
'1593';'1.2.40.0.34.5.205';'OSANG Healthcare Co., Ltd., GeneFinder COVID-19 Ag Rapid Test';'https://termgit.elga.gv.at/CodeSystem-dgc-ratnamemanufacturer';'OSANG Healthcare Co., Ltd., GeneFinder COVID-19 Ag Rapid Test';'';'';'212';'0';'L';'1.2.40.0.34.5.205:1593';'';''
'2052';'1.2.40.0.34.5.205';'SD BIOSENSOR Inc. (manufacturer), STANDARD Q COVID-19 Ag Test Nasal';'https://termgit.elga.gv.at/CodeSystem-dgc-ratnamemanufacturer';'SD BIOSENSOR Inc.(manufacturer), STANDARD Q COVID-19 Ag Test Nasal';'SD BIOSENSOR Inc.(manufacturer), STANDARD Q COVID-19 Ag Test Nasal';'';'213';'0';'L';'1.2.40.0.34.5.205:2052';'';''
'1592';'1.2.40.0.34.5.205';'Shenzhen Lifotronic Technology Co., Ltd., Antigen Rapid Test Ag SARS-CoV-2';'https://termgit.elga.gv.at/CodeSystem-dgc-ratnamemanufacturer';'Shenzhen Lifotronic Technology Co., Ltd., Antigen Rapid Test Ag SARS-CoV-2';'';'';'214';'0';'L';'1.2.40.0.34.5.205:1592';'';''
'2325';'1.2.40.0.34.5.205';'Hangzhou AllTest Biotech Co., Ltd, GSD NovaGen SARS-CoV-2 Ag Rapid Test (Nasal Swab)';'https://termgit.elga.gv.at/CodeSystem-dgc-ratnamemanufacturer';'Hangzhou AllTest Biotech Co., Ltd, GSD NovaGen SARS-CoV-2 Ag Rapid Test (Nasal Swab)';'';'';'215';'0';'L';'1.2.40.0.34.5.205:2325';'';''
'2038';'1.2.40.0.34.5.205';'Koch Biotechnology (Beijing) Co., Ltd, COVID-19 Antigen Rapid Test Kit ';'https://termgit.elga.gv.at/CodeSystem-dgc-ratnamemanufacturer';'Koch Biotechnology (Beijing) Co., Ltd, COVID-19 Antigen Rapid Test Kit ';'';'';'216';'0';'L';'1.2.40.0.34.5.205:2038';'';''
'2678';'1.2.40.0.34.5.205';'NDFOS Co., Ltd., ND COVID-19 Ag Test';'https://termgit.elga.gv.at/CodeSystem-dgc-ratnamemanufacturer';'NDFOS Co., Ltd., ND COVID-19 Ag Test';'';'';'217';'0';'L';'1.2.40.0.34.5.205:2678';'';''
'2687';'1.2.40.0.34.5.205';'Zephyr Biomedicals - Tulip Diagnostics, PerkinElmer COVID 19 Antigen Test (NS, NP)';'https://termgit.elga.gv.at/CodeSystem-dgc-ratnamemanufacturer';'Zephyr Biomedicals - Tulip Diagnostics, PerkinElmer COVID 19 Antigen Test (NS, NP)';'';'';'218';'0';'L';'1.2.40.0.34.5.205:2687';'';''
'1173';'1.2.40.0.34.5.205';'CerTest Biotec, CerTest SARS-CoV-2 Card test';'https://termgit.elga.gv.at/CodeSystem-dgc-ratnamemanufacturer';'CerTest Biotec, CerTest SARS-CoV-2 Card test';'';'';'219';'0';'L';'1.2.40.0.34.5.205:1173';'';''
'1144';'1.2.40.0.34.5.205';'Green Cross Medical Science Corp., GENEDIA W COVID-19 Ag';'https://termgit.elga.gv.at/CodeSystem-dgc-ratnamemanufacturer';'Green Cross Medical Science Corp., GENEDIA W COVID-19 Ag';'';'';'220';'0';'L';'1.2.40.0.34.5.205:1144';'';''
'1747';'1.2.40.0.34.5.205';'Guangdong Hecin Scientific, Inc., 2019-nCoV Antigen Test Kit (colloidal gold method)';'https://termgit.elga.gv.at/CodeSystem-dgc-ratnamemanufacturer';'Guangdong Hecin Scientific, Inc., 2019-nCoV Antigen Test Kit (colloidal gold method)';'';'';'221';'0';'L';'1.2.40.0.34.5.205:1747';'';''
