'code';'codeSystem';'displayName';'parentCodeSystemName';'concept_Beschreibung';'meaning';'hints';'orderNumber';'level';'type';'relationships';'einheit print';'einheit codiert'
'55607006';'2.16.840.1.113883.6.96';'Problem';'https://termgit.elga.gv.at/CodeSystem-snomed-ct-auszug';'';'';'';'1';'0';'L';'';'';''
'160245001';'2.16.840.1.113883.6.96';'no current problems or disability';'https://termgit.elga.gv.at/CodeSystem-snomed-ct-auszug';'';'';'';'2';'0';'L';'';'';''
