{
  "resourceType": "CodeSystem",
  "id": "lkf-diagnose-typ",
  "url": "https://termgit.elga.gv.at/CodeSystem-lkf-diagnose-typ",
  "identifier": [
    {
      "use": "official",
      "system": "urn:ietf:rfc:3986",
      "value": "urn:oid:1.2.40.0.34.5.206"
    }
  ],
  "version": "202107",
  "name": "lkf-diagnose-typ",
  "title": "LKF_Diagnose-Typ",
  "status": "active",
  "date": "2021-07-30",
  "content": "complete",
  "count": 2,
  "concept": [
    {
      "code": "H",
      "display": "Hauptdiagnose"
    },
    {
      "code": "Z",
      "display": "Zusatzdiagnose"
    }
  ]
}