'code';'codeSystem';'displayName';'parentCode';'concept_Beschreibung';'meaning';'hints';'level';'type';'relationships'
'T';'2.16.840.1.113883.12.497';'Telephone';;;'Telefonisch';;'0';'L';
'V';'2.16.840.1.113883.12.497';'Verbal';;;'Mündlich';'Gültiger Wert für ELGA-SOO';'0';'L';
'W';'2.16.840.1.113883.12.497';'Written';;;'Schriftlich';'Bevorzugter Wert für ELGA-SOO';'0';'L';
