'code';'codeSystem';'displayName';'parentCode';'concept_Beschreibung';'meaning';'hints';'level';'type';'relationships'
'D';'1.2.40.0.34.5.74';'Durchgeführt';'';'';'';'';'0';'L';''
'ND';'1.2.40.0.34.5.74';'nicht durchgeführt';'';'';'';'';'0';'L';''
