"resource";"url";"version";"name";"title";"status";"description";"identifier";"date";"count"
"ValueSet";"https://termgit.elga.gv.at/ValueSet-elga-diagnosesicherheit";"4.1";"elga-diagnosesicherheit";"ELGA_Diagnosesicherheit";"active";"None";"1.2.40.0.34.10.168";"2017-02-17";"2"

"system";"code";"display";"designation";"designation"
"https://termgit.elga.gv.at/CodeSystem-sciphox-diagnosenzusatz";"G";"Gesichert";"|https://termgit.elga.gv.at/CodeSystem-austrian-designation-use##concept_beschreibung#concept_beschreibung|Gesicherte Diagnose "
"https://termgit.elga.gv.at/CodeSystem-sciphox-diagnosenzusatz";"V";"Verdacht auf";"|https://termgit.elga.gv.at/CodeSystem-austrian-designation-use##concept_beschreibung#concept_beschreibung|Verdachtsdiagnose ";"|https://termgit.elga.gv.at/CodeSystem-austrian-designation-use##hinweise#hinweise|uncertaintyCode = UN"