'code';'codeSystem';'displayName';'parentCodeSystemName';'concept_Beschreibung';'meaning';'hints';'orderNumber';'level';'type';'relationships';'einheit print';'einheit codiert'
'2708-6';'2.16.840.1.113883.6.1';'Oxygen saturation in Arterial blood';'http://loinc.org';'';'Sauerstoffsättigung im arteriellen Blut';'';'1';'0';'L';'';'%';'%'
'3141-9';'2.16.840.1.113883.6.1';'Body weight Measured';'http://loinc.org';'';'Körpergewicht';'';'2';'0';'L';'';'kg';'kg'
'373121007';'2.16.840.1.113883.6.96';'Test not done';'https://termgit.elga.gv.at/CodeSystem-snomed-ct-auszug';'';'Keine Messung durchgeführt';'';'3';'0';'L';'';'';''
'39156-5';'2.16.840.1.113883.6.1';'Body mass index (BMI) [Ratio]';'http://loinc.org';'';'Body-Mass-Index (BMI)';'';'4';'0';'L';'';'kg/m2';'kg/m2'
'8277-6';'2.16.840.1.113883.6.1';'Body surface area';'http://loinc.org';'';'Körperoberfläche';'';'5';'0';'L';'';'m2';'m2'
'8287-5';'2.16.840.1.113883.6.1';'Head Occipital-frontal circumference by Tape measure';'http://loinc.org';'';'Kopfumfang okzipital-frontal';'';'6';'0';'L';'';'cm';'cm'
'8302-2';'2.16.840.1.113883.6.1';'Body height';'http://loinc.org';'';'Körpergröße';'';'7';'0';'L';'';'cm';'cm'
'8306-3';'2.16.840.1.113883.6.1';'Body height --lying';'http://loinc.org';'';'Körpergröße (liegend)';'';'8';'0';'L';'';'cm';'cm'
'8310-5';'2.16.840.1.113883.6.1';'Body temperature';'http://loinc.org';'';'Körpertemperatur';'';'9';'0';'L';'';'°C';'Cel'
'8462-4';'2.16.840.1.113883.6.1';'Diastolic blood pressure';'http://loinc.org';'';'Blutdruck diastolisch';'';'10';'0';'L';'';'mm Hg';'mm[Hg]'
'8478-0';'2.16.840.1.113883.6.1';'Mean blood pressure';'http://loinc.org';'';'Blutdruck, mittel';'';'11';'0';'L';'';'mm Hg';'mm[Hg]'
'8480-6';'2.16.840.1.113883.6.1';'Systolic blood pressure';'http://loinc.org';'';'Blutdruck systolisch';'';'12';'0';'L';'';'mm Hg';'mm[Hg]'
'8867-4';'2.16.840.1.113883.6.1';'Heart rate';'http://loinc.org';'';'Puls';'';'13';'0';'L';'';'/min';'/min'
'9279-1';'2.16.840.1.113883.6.1';'Respiratory rate';'http://loinc.org';'';'Atemfrequenz';'';'14';'0';'L';'';'/min';'/min'
