'code';'codeSystem';'displayName';'parentCodeSystemName';'concept_Beschreibung';'meaning';'hints';'orderNumber';'level';'type';'relationships';'einheit print';'einheit codiert'
'18842-5';'2.16.840.1.113883.6.1';'Discharge summary';'http://loinc.org';;'Entlassungsbrief';'Entlassungsbrief';'1';'0';'S';;;
'11490-0';'2.16.840.1.113883.6.1';'Physician Discharge summary';'http://loinc.org';;'Entlassungsbrief Ärztlich';'Entlassungsbrief aus stationärer Behandlung (Ärztlich)';'2';'1';'L';;;
'34745-0';'2.16.840.1.113883.6.1';'Nurse Discharge summary';'http://loinc.org';;'Entlassungsbrief Pflege';'Entlassungsbrief aus stationärer Behandlung (Pflege)';'3';'1';'L';;;
'28651-8';'2.16.840.1.113883.6.1';'Nurse Transfer note';'http://loinc.org';'Pflegesituationsbericht';'Pflegesituationsbericht';'Pflegedokumentation';'4';'0';'L';;;
'11502-2';'2.16.840.1.113883.6.1';'Laboratory report';'http://loinc.org';;'Laborbefund';'Laborbefund';'5';'0';'S';;;
'18725-2';'2.16.840.1.113883.6.1';'Microbiology studies (set)';'http://loinc.org';'Mikrobiologie';'Mikrobiologie-Befund';'Für direkt aus der Mikrobiologie erstellte Befunde';'6';'1';'L';;;
'18748-4';'2.16.840.1.113883.6.1';'Diagnostic imaging study';'http://loinc.org';;'Befund bildgebende Diagnostik';'Befund bildgebende Diagnostik';'7';'0';'S';;;
'25045-6';'2.16.840.1.113883.6.1';'CT Unspecified body region';'http://loinc.org';;'Computertomographie-Befund';'Computertomographie-Befund';'8';'1';'L';;;
'25056-3';'2.16.840.1.113883.6.1';'MR Unspecified body region';'http://loinc.org';;'Magnetresonanztomographie-Befund';'Magnetresonanztomographie-Befund';'9';'1';'L';;;
'25061-3';'2.16.840.1.113883.6.1';'US Unspecified body region';'http://loinc.org';;'Ultraschall-Befund';'Ultraschall-Befund';'10';'1';'L';;;
'49118-3';'2.16.840.1.113883.6.1';'NM Unspecified body region Views';'http://loinc.org';;'Nuklearmedizinischer Befund';'Nuklearmedizinischer Befund';'11';'1';'L';;;
'44136-0';'2.16.840.1.113883.6.1';'PT Unspecified body region';'http://loinc.org';;'Positronen-Emissions-Tomographie-Befund';'Positronen-Emissions-Tomographie-Befund';'12';'1';'L';;;
'18745-0';'2.16.840.1.113883.6.1';'Cardiac catheterization study';'http://loinc.org';;'Herzkatheter-Befund';'Herzkatheter-Befund';'13';'1';'L';;;
'42148-7';'2.16.840.1.113883.6.1';'US Heart';'http://loinc.org';;'Echokardiographie-Befund';'Echokardiographie-Befund';'14';'1';'L';;;
'18782-3';'2.16.840.1.113883.6.1';'Radiology Study observation (narrative)';'http://loinc.org';;'Radiologie-Befund';'Radiologie-Befund';'15';'1';'L';;;
'18746-8';'2.16.840.1.113883.6.1';'Colonoscopy study';'http://loinc.org';;'Kolonoskopie-Befund';'Kolonoskopie-Befund';'16';'1';'L';;;
'18751-8';'2.16.840.1.113883.6.1';'Endoscopy study';'http://loinc.org';;'Endoskopie-Befund';'Endoskopie-Befund';'17';'1';'L';;;
'11525-3';'2.16.840.1.113883.6.1';'US for pregnancy';'http://loinc.org';;'Geburtshilfliche Ultraschalluntersuchung';'Geburtshilfliche Ultraschalluntersuchung';'18';'1';'L';;;
'55113-5';'2.16.840.1.113883.6.1';'Key images Document Radiology';'http://loinc.org';;'KOS Objekte';'KOS Objekte';'19';'0';'L';;;
'52471-0';'2.16.840.1.113883.6.1';'Medications';'http://loinc.org';;'Medikation';'Dokumente der e-Medikation';'20';'0';'S';;;
'57833-6';'2.16.840.1.113883.6.1';'Prescription for medication';'http://loinc.org';;'Rezept';'Rezept';'21';'1';'L';;;
'60593-1';'2.16.840.1.113883.6.1';'Medication dispensed.extended Document';'http://loinc.org';;'Abgabe';'Abgabe';'22';'1';'L';;;
'56445-0';'2.16.840.1.113883.6.1';'Medication summary Document';'http://loinc.org';;'Medikationsliste';'Medikationsliste';'23';'1';'L';;;
'61356-2';'2.16.840.1.113883.6.1';'Medication pharmaceutical advice.extended Document';'http://loinc.org';;'Pharmazeutische Empfehlung';'Pharmazeutische Empfehlung (Korrekturmeldung)';'24';'1';'L';;;
'11369-6';'2.16.840.1.113883.6.1';'History of Immunization Narrative';'http://loinc.org';;'Immunisierungsstatus';'Immunisierungsstatus';'25';'0';'S';;;
'82593-5';'2.16.840.1.113883.6.1';'Immunization summary report';'http://loinc.org';;'Immunisierungsstatus - Zusammenfassung';'Immunisierungsstatus - Zusammenfassung';'26';'1';'L';;;
'87273-9';'2.16.840.1.113883.6.1';'Immunization note';'http://loinc.org';;'Update Immunisierungsstatus';'Update Immunisierungsstatus';'27';'1';'L';;;
'75496-0';'2.16.840.1.113883.6.1';'Telehealth Note';'http://loinc.org';;'Telegesundheitsdienst Bericht';'Telegesundheitsdienst Bericht';'28';'0';'S';;;
'75497-8';'2.16.840.1.113883.6.1';'Telehealth Progress note';'http://loinc.org';;'Telegesundheitsdienst Zwischenbericht';'Telegesundheitsdienst Zwischenbericht';'29';'1';'L';;;
'75498-6';'2.16.840.1.113883.6.1';'Telehealth Summary note';'http://loinc.org';;'Telegesundheitsdienst Entlassungsbericht';'Telegesundheitsdienst Entlassungsbericht';'30';'1';'L';;;
'42348-3';'2.16.840.1.113883.6.1';'Advance directives';'http://loinc.org';;'Patientenverfügung';'Patientenverfügung';'31';'0';'L';;;
'75476-2';'2.16.840.1.113883.6.1';'Physician Note';'http://loinc.org';;'Ärztlicher Befund';'Ärztlicher Befund';'32';'0';'S';;;
'34764-1';'2.16.840.1.113883.6.1';'General medicine Consult note';'http://loinc.org';;'Befund Allgemeinmedizin';'Befund Allgemeinmedizin';'33';'1';'L';;;
'34131-3';'2.16.840.1.113883.6.1';'Outpatient Progress note';'http://loinc.org';;'Statusbericht';'Statusbericht';'34';'1';'L';;;
'77403-4';'2.16.840.1.113883.6.1';'Anesthesiology Consult note';'http://loinc.org';;'Befund Anästhesiologie und Intensivmedizin';'Befund Anästhesiologie und Intensivmedizin';'35';'1';'L';;;
'34803-7';'2.16.840.1.113883.6.1';'Occupational medicine Consult note';'http://loinc.org';;'Befund Arbeitsmedizin';'Befund Arbeitsmedizin';'36';'1';'L';;;
'34807-8';'2.16.840.1.113883.6.1';'Ophthalmology Consult note';'http://loinc.org';;'Befund Augenheilkunde und Optometrie';'Befund Augenheilkunde und Optometrie';'37';'1';'L';;;
'33720-4';'2.16.840.1.113883.6.1';'Blood bank consult';'http://loinc.org';;'Befund Blutgruppenserologie und Transfusionsmedizin';'Befund Blutgruppenserologie und Transfusionsmedizin';'38';'1';'L';;;
'34847-4';'2.16.840.1.113883.6.1';'Surgery Consult note';'http://loinc.org';;'Befund Chirurgie';'Befund Chirurgie';'39';'1';'L';;;
'34760-9';'2.16.840.1.113883.6.1';'Diabetology Consult note';'http://loinc.org';;'Befund Diabetologie';'Befund Diabetologie';'40';'1';'L';;;
'34879-7';'2.16.840.1.113883.6.1';'Endocrinology Consult note';'http://loinc.org';;'Befund Endokrinologie';'Befund Endokrinologie';'41';'1';'L';;;
'34777-3';'2.16.840.1.113883.6.1';'Obstetrics and Gynecology Consult note';'http://loinc.org';;'Befund Frauenheilkunde und Geburtshilfe';'Befund Frauenheilkunde und Geburtshilfe';'42';'1';'L';;;
'34761-7';'2.16.840.1.113883.6.1';'Gastroenterology Consult note';'http://loinc.org';;'Befund Gastroenterologie';'Befund Gastroenterologie';'43';'1';'L';;;
'34853-2';'2.16.840.1.113883.6.1';'Vascular surgery Consult note';'http://loinc.org';;'Befund Gefäßchirurgie';'Befund Gefäßchirurgie';'44';'1';'L';;;
'34776-5';'2.16.840.1.113883.6.1';'Geriatric medicine Consult note';'http://loinc.org';;'Befund Geriatrie';'Befund Geriatrie';'45';'1';'L';;;
'69438-0';'2.16.840.1.113883.6.1';'Forensic medicine Referral note';'http://loinc.org';;'Befund Gerichtsmedizin';'Befund Gerichtsmedizin';'46';'1';'L';;;
'34816-9';'2.16.840.1.113883.6.1';'Otolaryngology Consult note';'http://loinc.org';;'Befund Hals-, Nasen- und Ohrenkrankheiten';'Befund Hals-, Nasen- und Ohrenkrankheiten';'47';'1';'L';;;
'34779-9';'2.16.840.1.113883.6.1';'Hematology+Medical oncology Consult note';'http://loinc.org';;'Befund Hämatologie';'Befund Hämatologie';'48';'1';'L';;;
'34758-3';'2.16.840.1.113883.6.1';'Dermatology Consult note';'http://loinc.org';;'Befund Haut- und Geschlechtskrankheiten';'Befund Haut- und Geschlechtskrankheiten';'49';'1';'L';;;
'80575-4';'2.16.840.1.113883.6.1';'Cardiac surgery Consult note';'http://loinc.org';;'Befund Herzchirurgie';'Befund Herzchirurgie';'50';'1';'L';;;
'77429-9';'2.16.840.1.113883.6.1';'Allergy and Immunology Consult note';'http://loinc.org';;'Befund Immunologie';'Befund Immunologie';'51';'1';'L';;;
'34781-5';'2.16.840.1.113883.6.1';'Infectious disease Consult note';'http://loinc.org';;'Befund Infektiologie';'Befund Infektiologie';'52';'1';'L';;;
'85238-4';'2.16.840.1.113883.6.1';'Internal medicine Consult note';'http://loinc.org';;'Befund Innere Medizin';'Befund Innere Medizin';'53';'1';'L';;;
'34099-2';'2.16.840.1.113883.6.1';'Cardiology Consult note';'http://loinc.org';;'Befund Kardiologie';'Befund Kardiologie';'54';'1';'L';;;
'68881-2';'2.16.840.1.113883.6.1';'Pediatric surgery Note';'http://loinc.org';;'Befund Kinder- und Jugendchirurgie';'Befund Kinder- und Jugendchirurgie';'55';'1';'L';;;
'78726-7';'2.16.840.1.113883.6.1';'Pediatrics Consult note';'http://loinc.org';;'Befund Kinder- und Jugendheilkunde';'Befund Kinder- und Jugendheilkunde';'56';'1';'L';;;
'68645-1';'2.16.840.1.113883.6.1';'Child and adolescent psychiatry Note';'http://loinc.org';;'Befund Kinder- und Jugendpsychiatrie';'Befund Kinder- und Jugendpsychiatrie';'57';'1';'L';;;
'34103-2';'2.16.840.1.113883.6.1';'Pulmonary Consult note';'http://loinc.org';;'Befund Lungenkrankheiten';'Befund Lungenkrankheiten';'58';'1';'L';;;
'78254-0';'2.16.840.1.113883.6.1';'Clinical genetics Consult note';'http://loinc.org';;'Befund Medizinische Genetik';'Befund Medizinische Genetik';'59';'1';'L';;;
'34812-8';'2.16.840.1.113883.6.1';'Oral and Maxillofacial Surgery Consult note';'http://loinc.org';;'Befund Mund-, Kiefer- und Gesichtschirurgie';'Befund Mund-, Kiefer- und Gesichtschirurgie';'60';'1';'L';;;
'34795-5';'2.16.840.1.113883.6.1';'Nephrology Consult note';'http://loinc.org';;'Befund Nephrologie';'Befund Nephrologie';'61';'1';'L';;;
'34798-9';'2.16.840.1.113883.6.1';'Neurological surgery Consult note';'http://loinc.org';;'Befund Neurochirurgie';'Befund Neurochirurgie';'62';'1';'L';;;
'34797-1';'2.16.840.1.113883.6.1';'Neurology Consult note';'http://loinc.org';;'Befund Neurologie';'Befund Neurologie';'63';'1';'L';;;
'34878-9';'2.16.840.1.113883.6.1';'Emergency medicine Note';'http://loinc.org';;'Befund Notfallmedizin';'Befund Notfallmedizin';'64';'1';'L';;;
'34805-2';'2.16.840.1.113883.6.1';'Oncology Consult note';'http://loinc.org';;'Befund Onkologie';'Befund Onkologie';'65';'1';'L';;;
'34814-4';'2.16.840.1.113883.6.1';'Orthopaedic surgery Consult note';'http://loinc.org';;'Befund Orthopädie und Orthopädische Chirurgie';'Befund Orthopädie und Orthopädische Chirurgie';'66';'1';'L';;;
'78568-3';'2.16.840.1.113883.6.1';'Palliative care Consult note';'http://loinc.org';;'Befund Palliativmedizin';'Befund Palliativmedizin';'67';'1';'L';;;
'34820-1';'2.16.840.1.113883.6.1';'Pharmacology Consult note';'http://loinc.org';;'Befund Pharmakologie und Toxikologie';'Befund Pharmakologie und Toxikologie';'68';'1';'L';;;
'34822-7';'2.16.840.1.113883.6.1';'Physical medicine and rehab Consult note';'http://loinc.org';;'Befund Physikalische Medizin und Allgemeine Rehabilitation';'Befund Physikalische Medizin und Allgemeine Rehabilitation';'69';'1';'L';;;
'34826-8';'2.16.840.1.113883.6.1';'Plastic surgery Consult note';'http://loinc.org';;'Befund Plastische, Ästhetische und Rekonstruktive Chirurgie';'Befund Plastische, Ästhetische und Rekonstruktive Chirurgie';'70';'1';'L';;;
'34788-0';'2.16.840.1.113883.6.1';'Psychiatry Consult note';'http://loinc.org';;'Befund Psychiatrie';'Befund Psychiatrie';'71';'1';'L';;;
'82359-1';'2.16.840.1.113883.6.1';'Reproductive endocrinology and infertility Consult note';'http://loinc.org';;'Befund Reproduktionsmedizin';'Befund Reproduktionsmedizin';'72';'1';'L';;;
'34839-1';'2.16.840.1.113883.6.1';'Rheumatology Consult note';'http://loinc.org';;'Befund Rheumatologie';'Befund Rheumatologie';'73';'1';'L';;;
'85866-2';'2.16.840.1.113883.6.1';'Sleep medicine Consult note';'http://loinc.org';;'Befund Schlafmedizin';'Befund Schlafmedizin';'74';'1';'L';;;
'78738-2';'2.16.840.1.113883.6.1';'Sports medicine Consult note';'http://loinc.org';;'Befund Sportmedizin';'Befund Sportmedizin';'75';'1';'L';;;
'34831-8';'2.16.840.1.113883.6.1';'Radiation oncology Consult note';'http://loinc.org';;'Befund Strahlentherapie-Radioonkologie';'Befund Strahlentherapie-Radioonkologie';'76';'1';'L';;;
'34849-0';'2.16.840.1.113883.6.1';'Cardiothoracic surgery Consult note';'http://loinc.org';;'Befund Thoraxchirurgie';'Befund Thoraxchirurgie';'77';'1';'L';;;
'78732-5';'2.16.840.1.113883.6.1';'Trauma Consult note';'http://loinc.org';;'Befund Unfallchirurgie';'Befund Unfallchirurgie';'78';'1';'L';;;
'34851-6';'2.16.840.1.113883.6.1';'Urology Consult note';'http://loinc.org';;'Befund Urologie';'Befund Urologie';'79';'1';'L';;;
'34756-7';'2.16.840.1.113883.6.1';'Dentistry Consult note';'http://loinc.org';;'Befund Zahn-, Mund- und Kieferheilkunde';'Befund Zahn-, Mund- und Kieferheilkunde';'80';'1';'L';;;
'67862-3';'2.16.840.1.113883.6.1';'Preoperative evaluation and management note';'http://loinc.org';;'Präoperativer Befund';'Präoperativer Befund';'81';'1';'L';;;
'84035-5';'2.16.840.1.113883.6.1';'Transplant surgery Consult note';'http://loinc.org';;'Befund Transplantationsmedizin';'Befund Transplantationsmedizin';'82';'1';'L';;;
'90343-5';'2.16.840.1.113883.6.1';'Nuclear medicine Consult note';'http://loinc.org';;'Befund Nuklearmedizin';'Befund Nuklearmedizin';'83';'1';'L';;;
