{
  "resourceType": "ValueSet",
  "id": "elga-nullflavor",
  "url": "https://termgit.elga.gv.at/ValueSet-elga-nullflavor",
  "identifier": [
    {
      "use": "official",
      "system": "urn:ietf:rfc:3986",
      "value": "urn:oid:1.2.40.0.34.10.2"
    }
  ],
  "version": "202006",
  "name": "elga-nullflavor",
  "title": "ELGA_NullFlavor",
  "status": "active",
  "date": "2020-06-08",
  "contact": [
    {
      "telecom": [
        {
          "system": "url",
          "value": "http://www.hl7.org"
        }
      ]
    }
  ],
  "description": "**Description:** Set of valid codes to use for describing elements, which carry no value (Only allowed for non-mandatory elements)\n\n**Beschreibung:** Das Value Set wird verwendet, um Elemente zu beschreiben, die keinen Wert tragen (nur erlaubt f\u00fcr Non-Mandatory-Elemente)",
  "compose": {
    "include": [
      {
        "system": "https://termgit.elga.gv.at/CodeSystem-hl7-null-flavor",
        "concept": [
          {
            "code": "NI",
            "display": "NoInformation",
            "designation": [
              {
                "language": "de-AT",
                "value": "keine Information vorhanden"
              }
            ]
          },
          {
            "code": "INV",
            "display": "invalid",
            "designation": [
              {
                "use": {
                  "system": "https://termgit.elga.gv.at/CodeSystem-austrian-designation-use",
                  "code": "hinweise",
                  "display": "hinweise"
                },
                "value": "Nur Gruppierung, nicht verwenden (in CDA R2 nicht erlaubt)"
              }
            ]
          },
          {
            "code": "OTH",
            "display": "Other",
            "designation": [
              {
                "language": "de-AT",
                "value": "Andere"
              }
            ]
          },
          {
            "code": "NINF",
            "display": "Negative infinity",
            "designation": [
              {
                "language": "de-AT",
                "value": "negativ unendlich"
              }
            ]
          },
          {
            "code": "PINF",
            "display": "Positive infinity",
            "designation": [
              {
                "language": "de-AT",
                "value": "positiv unendlich"
              }
            ]
          },
          {
            "code": "MSK",
            "display": "Masked",
            "designation": [
              {
                "language": "de-AT",
                "value": "maskiert/vertraulich/ nicht freigegeben"
              }
            ]
          },
          {
            "code": "NA",
            "display": "Not applicable",
            "designation": [
              {
                "language": "de-AT",
                "value": "nicht anwendbar"
              }
            ]
          },
          {
            "code": "UNK",
            "display": "Unknown",
            "designation": [
              {
                "language": "de-AT",
                "value": "unbekannt"
              },
              {
                "use": {
                  "system": "https://termgit.elga.gv.at/CodeSystem-austrian-designation-use",
                  "code": "hinweise",
                  "display": "hinweise"
                },
                "value": "Wert ist unbekannt. Wenn der Wert bekannt ist, aber nicht codiert werden kann, soll UNC oder OTH verwendet werden."
              }
            ]
          },
          {
            "code": "ASKU",
            "display": "Asked, but unknown",
            "designation": [
              {
                "language": "de-AT",
                "value": "erfragt, aber unbekannt"
              }
            ]
          },
          {
            "code": "NAV",
            "display": "Temporarily unavailable",
            "designation": [
              {
                "language": "de-AT",
                "value": "noch nicht bekannt"
              }
            ]
          },
          {
            "code": "NASK",
            "display": "Not asked",
            "designation": [
              {
                "language": "de-AT",
                "value": "nicht erfragt"
              }
            ]
          },
          {
            "code": "TRC",
            "display": "Trace",
            "designation": [
              {
                "language": "de-AT",
                "value": "nur in Spuren vorhanden"
              }
            ]
          }
        ]
      }
    ]
  },
  "expansion": {
    "timestamp": "2022-09-13T14:16:28Z",
    "contains": [
      {
        "system": "https://termgit.elga.gv.at/CodeSystem-hl7-null-flavor",
        "code": "NI",
        "display": "NoInformation",
        "designation": [
          {
            "language": "de-AT",
            "value": "keine Information vorhanden"
          }
        ],
        "contains": [
          {
            "system": "https://termgit.elga.gv.at/CodeSystem-hl7-null-flavor",
            "abstract": true,
            "code": "INV",
            "display": "invalid",
            "designation": [
              {
                "use": {
                  "system": "https://termgit.elga.gv.at/CodeSystem-austrian-designation-use",
                  "code": "hinweise",
                  "display": "hinweise"
                },
                "value": "Nur Gruppierung, nicht verwenden (in CDA R2 nicht erlaubt)"
              }
            ],
            "contains": [
              {
                "system": "https://termgit.elga.gv.at/CodeSystem-hl7-null-flavor",
                "code": "OTH",
                "display": "Other",
                "designation": [
                  {
                    "language": "de-AT",
                    "value": "Andere"
                  }
                ],
                "contains": [
                  {
                    "system": "https://termgit.elga.gv.at/CodeSystem-hl7-null-flavor",
                    "code": "NINF",
                    "display": "Negative infinity",
                    "designation": [
                      {
                        "language": "de-AT",
                        "value": "negativ unendlich"
                      }
                    ]
                  },
                  {
                    "system": "https://termgit.elga.gv.at/CodeSystem-hl7-null-flavor",
                    "code": "PINF",
                    "display": "Positive infinity",
                    "designation": [
                      {
                        "language": "de-AT",
                        "value": "positiv unendlich"
                      }
                    ]
                  }
                ]
              }
            ]
          },
          {
            "system": "https://termgit.elga.gv.at/CodeSystem-hl7-null-flavor",
            "code": "MSK",
            "display": "Masked",
            "designation": [
              {
                "language": "de-AT",
                "value": "maskiert/vertraulich/ nicht freigegeben"
              }
            ]
          },
          {
            "system": "https://termgit.elga.gv.at/CodeSystem-hl7-null-flavor",
            "code": "NA",
            "display": "Not applicable",
            "designation": [
              {
                "language": "de-AT",
                "value": "nicht anwendbar"
              }
            ]
          },
          {
            "system": "https://termgit.elga.gv.at/CodeSystem-hl7-null-flavor",
            "code": "UNK",
            "display": "Unknown",
            "designation": [
              {
                "language": "de-AT",
                "value": "unbekannt"
              },
              {
                "use": {
                  "system": "https://termgit.elga.gv.at/CodeSystem-austrian-designation-use",
                  "code": "hinweise",
                  "display": "hinweise"
                },
                "value": "Wert ist unbekannt. Wenn der Wert bekannt ist, aber nicht codiert werden kann, soll UNC oder OTH verwendet werden."
              }
            ],
            "contains": [
              {
                "system": "https://termgit.elga.gv.at/CodeSystem-hl7-null-flavor",
                "code": "ASKU",
                "display": "Asked, but unknown",
                "designation": [
                  {
                    "language": "de-AT",
                    "value": "erfragt, aber unbekannt"
                  }
                ],
                "contains": [
                  {
                    "system": "https://termgit.elga.gv.at/CodeSystem-hl7-null-flavor",
                    "code": "NAV",
                    "display": "Temporarily unavailable",
                    "designation": [
                      {
                        "language": "de-AT",
                        "value": "noch nicht bekannt"
                      }
                    ]
                  }
                ]
              },
              {
                "system": "https://termgit.elga.gv.at/CodeSystem-hl7-null-flavor",
                "code": "NASK",
                "display": "Not asked",
                "designation": [
                  {
                    "language": "de-AT",
                    "value": "nicht erfragt"
                  }
                ]
              },
              {
                "system": "https://termgit.elga.gv.at/CodeSystem-hl7-null-flavor",
                "code": "TRC",
                "display": "Trace",
                "designation": [
                  {
                    "language": "de-AT",
                    "value": "nur in Spuren vorhanden"
                  }
                ]
              }
            ]
          }
        ]
      }
    ]
  }
}