"resource";"url";"version";"name";"title";"status";"description";"content";"identifier";"date";"contact";"count"
"CodeSystem";"https://termgit.elga.gv.at/CodeSystem-hl7-proficiencylevelcode";"";"hl7-proficiencylevelcode";"HL7 ProficiencyLevelCode";"active";"**Description:** List of codes representing the level of proficiency in a language.

**Beschreibung:** Codes zur Angabe der Sprachfähigkeit von Patienten (Sprachkenntnisse)";"complete";"2.16.840.1.113883.5.61";"2016-11-24";"|url|http://www.hl7.org/documentcenter/public_temp_C0F0C5A1-1C23-BA17-0C878A83AC28B5A7/standards/vocabulary/vocabulary_tables/infrastructure/vocabulary/LanguageAbilityProficiency.html";"4"

"code";"display"
"E";"Excellent"
"F";"Fair"
"G";"Good"
"P";"Poor"