{
  "resourceType": "CodeSystem",
  "id": "ems-orth20probe",
  "url": "https://termgit.elga.gv.at/CodeSystem-ems-orth20probe",
  "identifier": [
    {
      "use": "official",
      "system": "urn:ietf:rfc:3986",
      "value": "urn:oid:1.2.40.0.34.5.95"
    }
  ],
  "version": "1.0.0",
  "name": "ems-orth20probe",
  "title": "EMS_OrtH20Probe",
  "status": "active",
  "date": "2017-01-26",
  "description": "**Beschreibung:** Ort der Probenentnahme (nur beantworten wenn Umweltuntersuchung = ja)",
  "content": "complete",
  "count": 5,
  "concept": [
    {
      "code": "COOLTOWER",
      "display": "K\u00fchlturm"
    },
    {
      "code": "POOL",
      "display": "Whirlpool / Spa pool"
    },
    {
      "code": "WSYS",
      "display": "Wassersytem"
    },
    {
      "code": "WSYS_C",
      "display": "Kaltwassersystem"
    },
    {
      "code": "WSYS_W",
      "display": "Warmwassersytem"
    }
  ]
}