'code';'codeSystem';'displayName';'parentCodeSystemName';'concept_Beschreibung';'meaning';'hints';'orderNumber';'level';'type';'relationships';'einheit print';'einheit codiert'
'BE';'2.16.840.1.113883.5.1052';'bilateral ears';'https://termgit.elga.gv.at/CodeSystem-hl7-act-site';;'Ohren beidseits';;'1';'0';'L';;;
'BN';'2.16.840.1.113883.5.1052';'bilateral nares';'https://termgit.elga.gv.at/CodeSystem-hl7-act-site';;'Nasennebenhöhlen beidseits';;'2';'0';'L';;;
'BU';'2.16.840.1.113883.5.1052';'buttock';'https://termgit.elga.gv.at/CodeSystem-hl7-act-site';;'Gesäß';;'3';'0';'L';;;
'LA';'2.16.840.1.113883.5.1052';'left arm';'https://termgit.elga.gv.at/CodeSystem-hl7-act-site';;'linker Arm';;'4';'0';'L';;;
'LAC';'2.16.840.1.113883.5.1052';'left anterior chest';'https://termgit.elga.gv.at/CodeSystem-hl7-act-site';;'linker Brustkorb anterior';;'5';'0';'L';;;
'LACF';'2.16.840.1.113883.5.1052';'left antecubital fossa';'https://termgit.elga.gv.at/CodeSystem-hl7-act-site';;'Linke Ellenbeuge';;'6';'0';'L';;;
'LD';'2.16.840.1.113883.5.1052';'left deltoid';'https://termgit.elga.gv.at/CodeSystem-hl7-act-site';;'linker Deltoideus';;'7';'0';'L';;;
'LE';'2.16.840.1.113883.5.1052';'left ear';'https://termgit.elga.gv.at/CodeSystem-hl7-act-site';;'linkes Ohr';;'8';'0';'L';;;
'LEJ';'2.16.840.1.113883.5.1052';'left external jugular';'https://termgit.elga.gv.at/CodeSystem-hl7-act-site';;'Vena jugularis externa, links';;'9';'0';'L';;;
'LF';'2.16.840.1.113883.5.1052';'left foot';'https://termgit.elga.gv.at/CodeSystem-hl7-act-site';;'linker Fuß';;'10';'0';'L';;;
'LG';'2.16.840.1.113883.5.1052';'left gluteus medius';'https://termgit.elga.gv.at/CodeSystem-hl7-act-site';;'linker mittlerer Gesäßmuskel';;'11';'0';'L';;;
'LH';'2.16.840.1.113883.5.1052';'left hand';'https://termgit.elga.gv.at/CodeSystem-hl7-act-site';;'linke Hand';;'12';'0';'L';;;
'LIJ';'2.16.840.1.113883.5.1052';'left internal jugular';'https://termgit.elga.gv.at/CodeSystem-hl7-act-site';;'Vena jugularis interna links';;'13';'0';'L';;;
'LLAQ';'2.16.840.1.113883.5.1052';'left lower abd quadrant';'https://termgit.elga.gv.at/CodeSystem-hl7-act-site';;'Abdomen, linker unterer Quadrant';;'14';'0';'L';;;
'LLFA';'2.16.840.1.113883.5.1052';'left lower forearm';'https://termgit.elga.gv.at/CodeSystem-hl7-act-site';;'linker unterer Unterarm';;'15';'0';'L';;;
'LMFA';'2.16.840.1.113883.5.1052';'left mid forearm';'https://termgit.elga.gv.at/CodeSystem-hl7-act-site';;'linker mittlerer Unterarm';;'16';'0';'L';;;
'LN';'2.16.840.1.113883.5.1052';'left naris';'https://termgit.elga.gv.at/CodeSystem-hl7-act-site';;'linkes Nasenloch';;'17';'0';'L';;;
'LPC';'2.16.840.1.113883.5.1052';'left posterior chest';'https://termgit.elga.gv.at/CodeSystem-hl7-act-site';;'linker Brustkorb posterior';;'18';'0';'L';;;
'LSC';'2.16.840.1.113883.5.1052';'left subclavian';'https://termgit.elga.gv.at/CodeSystem-hl7-act-site';;'linke Subklavia';;'19';'0';'L';;;
'LT';'2.16.840.1.113883.5.1052';'left thigh';'https://termgit.elga.gv.at/CodeSystem-hl7-act-site';;'linker Oberschenkel';;'20';'0';'L';;;
'LUA';'2.16.840.1.113883.5.1052';'left upper arm';'https://termgit.elga.gv.at/CodeSystem-hl7-act-site';;'linker Oberarm';;'21';'0';'L';;;
'LUAQ';'2.16.840.1.113883.5.1052';'left upper abd quadrant';'https://termgit.elga.gv.at/CodeSystem-hl7-act-site';;'Abdomen, linker oberer Quadrant';;'22';'0';'L';;;
'LUFA';'2.16.840.1.113883.5.1052';'left upper forearm';'https://termgit.elga.gv.at/CodeSystem-hl7-act-site';;'linker oberer Oberarm';;'23';'0';'L';;;
'LVG';'2.16.840.1.113883.5.1052';'left ventragluteal';'https://termgit.elga.gv.at/CodeSystem-hl7-act-site';;'ventraglutäal links';;'24';'0';'L';;;
'LVL';'2.16.840.1.113883.5.1052';'left vastus lateralis';'https://termgit.elga.gv.at/CodeSystem-hl7-act-site';;'linker Vastus lateralis';;'25';'0';'L';;;
'OD';'2.16.840.1.113883.5.1052';'right eye';'https://termgit.elga.gv.at/CodeSystem-hl7-act-site';;'rechtes Auge';;'26';'0';'L';;;
'OS';'2.16.840.1.113883.5.1052';'left eye';'https://termgit.elga.gv.at/CodeSystem-hl7-act-site';;'linkes Auge';;'27';'0';'L';;;
'OU';'2.16.840.1.113883.5.1052';'bilateral eyes';'https://termgit.elga.gv.at/CodeSystem-hl7-act-site';;'Augen, beidseits';;'28';'0';'L';;;
'PA';'2.16.840.1.113883.5.1052';'perianal';'https://termgit.elga.gv.at/CodeSystem-hl7-act-site';;;;'29';'0';'L';;;
'PERIN';'2.16.840.1.113883.5.1052';'perineal';'https://termgit.elga.gv.at/CodeSystem-hl7-act-site';;;;'30';'0';'L';;;
'RA';'2.16.840.1.113883.5.1052';'right arm';'https://termgit.elga.gv.at/CodeSystem-hl7-act-site';;'rechter Arm';;'31';'0';'L';;;
'RAC';'2.16.840.1.113883.5.1052';'right anterior chest';'https://termgit.elga.gv.at/CodeSystem-hl7-act-site';;'rechter Brustkorb anterior';;'32';'0';'L';;;
'RACF';'2.16.840.1.113883.5.1052';'right antecubital fossa';'https://termgit.elga.gv.at/CodeSystem-hl7-act-site';;'rechte Ellenbeuge';;'33';'0';'L';;;
'RD';'2.16.840.1.113883.5.1052';'right deltoid';'https://termgit.elga.gv.at/CodeSystem-hl7-act-site';;'rechter Deltoideus';;'34';'0';'L';;;
'RE';'2.16.840.1.113883.5.1052';'right ear';'https://termgit.elga.gv.at/CodeSystem-hl7-act-site';;'rechtes Auge';;'35';'0';'L';;;
'REJ';'2.16.840.1.113883.5.1052';'right external jugular';'https://termgit.elga.gv.at/CodeSystem-hl7-act-site';;'Vena jugularis externa, rechts';;'36';'0';'L';;;
'RF';'2.16.840.1.113883.5.1052';'right foot';'https://termgit.elga.gv.at/CodeSystem-hl7-act-site';;'rechter Fuß';;'37';'0';'L';;;
'RG';'2.16.840.1.113883.5.1052';'right gluteus medius';'https://termgit.elga.gv.at/CodeSystem-hl7-act-site';;'rechter mittlerer Gesäßmuskel';;'38';'0';'L';;;
'RH';'2.16.840.1.113883.5.1052';'right hand';'https://termgit.elga.gv.at/CodeSystem-hl7-act-site';;'rechte Hand';;'39';'0';'L';;;
'RIJ';'2.16.840.1.113883.5.1052';'right internal jugular';'https://termgit.elga.gv.at/CodeSystem-hl7-act-site';;'Vena jugularis interna rechts';;'40';'0';'L';;;
'RLAQ';'2.16.840.1.113883.5.1052';'right lower abd quadrant';'https://termgit.elga.gv.at/CodeSystem-hl7-act-site';;'Abdomen, rechter unterer Quadrant';;'41';'0';'L';;;
'RLFA';'2.16.840.1.113883.5.1052';'right lower forearm';'https://termgit.elga.gv.at/CodeSystem-hl7-act-site';;'rechter unterer Unterarm';;'42';'0';'L';;;
'RMFA';'2.16.840.1.113883.5.1052';'right mid forearm';'https://termgit.elga.gv.at/CodeSystem-hl7-act-site';;'rechter mittlerer Unterarm';;'43';'0';'L';;;
'RN';'2.16.840.1.113883.5.1052';'right naris';'https://termgit.elga.gv.at/CodeSystem-hl7-act-site';;'rechtes Nasenloch';;'44';'0';'L';;;
'RPC';'2.16.840.1.113883.5.1052';'right posterior chest';'https://termgit.elga.gv.at/CodeSystem-hl7-act-site';;'rechter Brustkorb posterior';;'45';'0';'L';;;
'RSC';'2.16.840.1.113883.5.1052';'right subclavian';'https://termgit.elga.gv.at/CodeSystem-hl7-act-site';;'rechte Subklavia';;'46';'0';'L';;;
'RT';'2.16.840.1.113883.5.1052';'right thigh';'https://termgit.elga.gv.at/CodeSystem-hl7-act-site';;'rechter Oberschenkel';;'47';'0';'L';;;
'RUA';'2.16.840.1.113883.5.1052';'right upper arm';'https://termgit.elga.gv.at/CodeSystem-hl7-act-site';;'rechter Oberarm';;'48';'0';'L';;;
'RUAQ';'2.16.840.1.113883.5.1052';'right upper abd quadrant';'https://termgit.elga.gv.at/CodeSystem-hl7-act-site';;'Abdomen, rechter oberer Quadrant';;'49';'0';'L';;;
'RUFA';'2.16.840.1.113883.5.1052';'right upper forearm';'https://termgit.elga.gv.at/CodeSystem-hl7-act-site';;'rechter oberer Oberarm';;'50';'0';'L';;;
'RVG';'2.16.840.1.113883.5.1052';'right ventragluteal';'https://termgit.elga.gv.at/CodeSystem-hl7-act-site';;'ventraglutäal rechts';;'51';'0';'L';;;
'RVL';'2.16.840.1.113883.5.1052';'right vastus lateralis';'https://termgit.elga.gv.at/CodeSystem-hl7-act-site';;'rechter Vastus lateralis';;'52';'0';'L';;;
