'code';'codeSystem';'displayName';'parentCode';'concept_Beschreibung';'meaning';'hints';'level';'type';'relationships'
'CLAIM';'2.16.840.1.113883.5.111';'claimant';;;;;'0';'L';
'GT';'2.16.840.1.113883.5.111';'Guarantor';;;;;'0';'L';
'PH';'2.16.840.1.113883.5.111';'Policy Holder';;;;;'0';'L';
'PROG';'2.16.840.1.113883.5.111';'program eligible';;;;;'0';'L';
'PT';'2.16.840.1.113883.5.111';'Patient';;;;;'0';'L';
'_AffiliationRoleType';'2.16.840.1.113883.5.111';'AffiliationRoleType';;;;;'0';'S';
'RESPRSN';'2.16.840.1.113883.5.111';'responsible party';;;;;'1';'S';
'EXCEST';'2.16.840.1.113883.5.111';'executor of estate';;;;;'2';'L';
'GUADLTM';'2.16.840.1.113883.5.111';'guardian ad lidem';;;;;'2';'L';
'GUARD';'2.16.840.1.113883.5.111';'guardian';;;;;'2';'L';
'POWATT';'2.16.840.1.113883.5.111';'power of attorney';;;;;'2';'S';
'DPOWATT';'2.16.840.1.113883.5.111';'durable power of attorney';;;;;'3';'L';
'HPOWATT';'2.16.840.1.113883.5.111';'healthcare power of attorney';;;;;'3';'L';
'SPOWATT';'2.16.840.1.113883.5.111';'special power of attorney';;;;;'3';'L';
'_CoverageSponsorRoleType';'2.16.840.1.113883.5.111';'CoverageSponsorRoleType';;;;;'1';'S';
'FULLINS';'2.16.840.1.113883.5.111';'Fully insured coverage sponsor';;;;;'2';'L';
'SELFINS';'2.16.840.1.113883.5.111';'Self insured coverage sponsor';;;;;'2';'L';
'_PayorRoleType';'2.16.840.1.113883.5.111';'PayorRoleType';;;;;'1';'S';
'ENROLBKR';'2.16.840.1.113883.5.111';'Enrollment Broker';;;;;'2';'L';
'TPA';'2.16.840.1.113883.5.111';'Third party administrator';;;;;'2';'L';
'UMO';'2.16.840.1.113883.5.111';'Utilization management organization';;;;;'2';'L';
'_AssignedRoleType';'2.16.840.1.113883.5.111';'AssignedRoleType';;;;;'0';'S';
'_AssignedNonPersonLivingSubjectRoleType';'2.16.840.1.113883.5.111';'AssignedNonPersonLivingSubjectRoleType';;;;;'1';'S';
'ASSIST';'2.16.840.1.113883.5.111';'Assistive non-person living subject';;;;;'2';'L';
'BIOTH';'2.16.840.1.113883.5.111';'Biotherapeutic non-person living subject';;;;;'2';'S';
'ANTIBIOT';'2.16.840.1.113883.5.111';'Antibiotic';;;;;'3';'L';
'DEBR';'2.16.840.1.113883.5.111';'Debridement';;;;;'3';'L';
'CCO';'2.16.840.1.113883.5.111';'Clinical Companion';;;;;'2';'L';
'SEE';'2.16.840.1.113883.5.111';'Seeing';;;;;'2';'L';
'SNIFF';'2.16.840.1.113883.5.111';'Sniffing';;;;;'2';'L';
'_CertifiedEntityType';'2.16.840.1.113883.5.111';'CertifiedEntityType';;;;;'0';'L';
'_CitizenRoleType';'2.16.840.1.113883.5.111';'CitizenRoleType';;;;;'0';'S';
'CAS';'2.16.840.1.113883.5.111';'asylum seeker';;;;;'1';'S';
'CASM';'2.16.840.1.113883.5.111';'single minor asylum seeker';;;;;'2';'L';
'CN';'2.16.840.1.113883.5.111';'national';;;;;'1';'L';
'CNRP';'2.16.840.1.113883.5.111';'non-country member without residence permit';;;;;'1';'S';
'CNRPM';'2.16.840.1.113883.5.111';'non-country member minor without residence permit';;;;;'2';'L';
'CPCA';'2.16.840.1.113883.5.111';'permit card applicant';;;;;'1';'L';
'CRP';'2.16.840.1.113883.5.111';'non-country member with residence permit';;;;;'1';'S';
'CRPM';'2.16.840.1.113883.5.111';'non-country member minor with residence permit';;;;;'2';'L';
'_ContactRoleType';'2.16.840.1.113883.5.111';'ContactRoleType';;;;;'0';'S';
'ECON';'2.16.840.1.113883.5.111';'emergency contact';;;;;'1';'L';
'NOK';'2.16.840.1.113883.5.111';'next of kin';;;;;'1';'L';
'_AdministrativeContactRoleType';'2.16.840.1.113883.5.111';'AdministrativeContactRoleType';;;;;'1';'S';
'BILL';'2.16.840.1.113883.5.111';'Billing Contact';;;;;'2';'L';
'ORG';'2.16.840.1.113883.5.111';'organizational contact';;;;;'2';'L';
'PAYOR';'2.16.840.1.113883.5.111';'Payor Contact';;;;;'2';'L';
'_IdentifiedEntityType';'2.16.840.1.113883.5.111';'IdentifiedEntityType';;;;;'0';'S';
'_LocationIdentifiedEntityRoleCode';'2.16.840.1.113883.5.111';'LocationIdentifiedEntityRoleCode';;;;;'1';'S';
'ACHFID';'2.16.840.1.113883.5.111';'accreditation identifier';;;;;'2';'L';
'JURID';'2.16.840.1.113883.5.111';'jurisdiction facility identifier';;;;;'2';'L';
'LOCHFID';'2.16.840.1.113883.5.111';'local facility identifier';;;;;'2';'L';
'_LivingSubjectProductionClass';'2.16.840.1.113883.5.111';'LivingSubjectProductionClass';;;;;'0';'S';
'BF';'2.16.840.1.113883.5.111';'Beef';;;;;'1';'L';
'BL';'2.16.840.1.113883.5.111';'Broiler';;;;;'1';'L';
'BR';'2.16.840.1.113883.5.111';'Breeder';;;;;'1';'L';
'CO';'2.16.840.1.113883.5.111';'Companion';;;;;'1';'L';
'DA';'2.16.840.1.113883.5.111';'Dairy';;;;;'1';'L';
'DR';'2.16.840.1.113883.5.111';'Draft';;;;;'1';'L';
'DU';'2.16.840.1.113883.5.111';'Dual';;;;;'1';'L';
'FI';'2.16.840.1.113883.5.111';'Fiber';;;;;'1';'L';
'LY';'2.16.840.1.113883.5.111';'Layer';;;;;'1';'L';
'MT';'2.16.840.1.113883.5.111';'Meat';;;;;'1';'L';
'MU';'2.16.840.1.113883.5.111';'Multiplier';;;;;'1';'L';
'PL';'2.16.840.1.113883.5.111';'Pleasure';;;;;'1';'L';
'RC';'2.16.840.1.113883.5.111';'Racing';;;;;'1';'L';
'SH';'2.16.840.1.113883.5.111';'Show';;;;;'1';'L';
'VL';'2.16.840.1.113883.5.111';'Veal';;;;;'1';'L';
'WL';'2.16.840.1.113883.5.111';'Wool';;;;;'1';'L';
'WO';'2.16.840.1.113883.5.111';'Working';;;;;'1';'L';
'_MedicationGeneralizationRoleType';'2.16.840.1.113883.5.111';'MedicationGeneralizationRoleType';;;;;'0';'S';
'DC';'2.16.840.1.113883.5.111';'therapeutic class';;;;;'1';'L';
'GD';'2.16.840.1.113883.5.111';'generic drug';;;;;'1';'S';
'GDF';'2.16.840.1.113883.5.111';'generic drug form';;;;;'2';'L';
'GDS';'2.16.840.1.113883.5.111';'generic drug strength';;;;;'2';'L';
'GDSF';'2.16.840.1.113883.5.111';'generic drug strength form';;;;;'2';'L';
'MGDSF';'2.16.840.1.113883.5.111';'manufactured drug strength form';;;;;'1';'L';
'_MemberRoleType';'2.16.840.1.113883.5.111';'MemberRoleType';;;;;'0';'S';
'TRB';'2.16.840.1.113883.5.111';'Tribal Member';;;;;'1';'L';
'_PersonalRelationshipRoleType';'2.16.840.1.113883.5.111';'PersonalRelationshipRoleType';;;;;'0';'S';
'FAMMEMB';'2.16.840.1.113883.5.111';'Family Member';;;;;'1';'S';
'CHILD';'2.16.840.1.113883.5.111';'Child';;;;;'2';'S';
'CHLDADOPT';'2.16.840.1.113883.5.111';'adopted child';;;;;'3';'S';
'DAUADOPT';'2.16.840.1.113883.5.111';'adopted daughter';;;;;'4';'L';
'SONADOPT';'2.16.840.1.113883.5.111';'adopted son';;;;;'4';'L';
'CHLDFOST';'2.16.840.1.113883.5.111';'foster child';;;;;'3';'S';
'DAUFOST';'2.16.840.1.113883.5.111';'foster daughter';;;;;'4';'L';
'SONFOST';'2.16.840.1.113883.5.111';'foster son';;;;;'4';'L';
'CHLDINLAW';'2.16.840.1.113883.5.111';'child in-law';;;;;'3';'S';
'DAUINLAW';'2.16.840.1.113883.5.111';'daughter in-law';;;;;'4';'L';
'SONINLAW';'2.16.840.1.113883.5.111';'son in-law';;;;;'4';'L';
'DAUC';'2.16.840.1.113883.5.111';'Daughter';;;;;'3';'S';
'DAU';'2.16.840.1.113883.5.111';'natural daughter';;;;;'4';'L';
'STPDAU';'2.16.840.1.113883.5.111';'stepdaughter';;;;;'4';'L';
'NCHILD';'2.16.840.1.113883.5.111';'natural child';;;;;'3';'S';
'SON';'2.16.840.1.113883.5.111';'natural son';;;;;'4';'L';
'SONC';'2.16.840.1.113883.5.111';'son';;;;;'3';'S';
'STPSON';'2.16.840.1.113883.5.111';'stepson';;;;;'4';'L';
'STPCHLD';'2.16.840.1.113883.5.111';'step child';;;;;'3';'L';
'EXT';'2.16.840.1.113883.5.111';'extended family member';;;;;'2';'S';
'AUNT';'2.16.840.1.113883.5.111';'aunt';;;;;'3';'S';
'MAUNT';'2.16.840.1.113883.5.111';'MaternalAunt';;;;;'4';'L';
'PAUNT';'2.16.840.1.113883.5.111';'PaternalAunt';;;;;'4';'L';
'COUSN';'2.16.840.1.113883.5.111';'cousin';;;;;'3';'S';
'MCOUSN';'2.16.840.1.113883.5.111';'MaternalCousin';;;;;'4';'L';
'PCOUSN';'2.16.840.1.113883.5.111';'PaternalCousin';;;;;'4';'L';
'GGRPRN';'2.16.840.1.113883.5.111';'great grandparent';;;;;'3';'S';
'GGRFTH';'2.16.840.1.113883.5.111';'great grandfather';;;;;'4';'L';
'GGRMTH';'2.16.840.1.113883.5.111';'great grandmother';;;;;'4';'L';
'MGGRFTH';'2.16.840.1.113883.5.111';'MaternalGreatgrandfather';;;;;'4';'L';
'MGGRMTH';'2.16.840.1.113883.5.111';'MaternalGreatgrandmother';;;;;'4';'L';
'MGGRPRN';'2.16.840.1.113883.5.111';'MaternalGreatgrandparent';;;;;'4';'L';
'PGGRFTH';'2.16.840.1.113883.5.111';'PaternalGreatgrandfather';;;;;'4';'L';
'PGGRMTH';'2.16.840.1.113883.5.111';'PaternalGreatgrandmother';;;;;'4';'L';
'PGGRPRN';'2.16.840.1.113883.5.111';'PaternalGreatgrandparent';;;;;'4';'L';
'GRNDCHILD';'2.16.840.1.113883.5.111';'grandchild';;;;;'3';'S';
'GRNDDAU';'2.16.840.1.113883.5.111';'granddaughter';;;;;'4';'L';
'GRNDSON';'2.16.840.1.113883.5.111';'grandson';;;;;'4';'L';
'GRPRN';'2.16.840.1.113883.5.111';'Grandparent';;;;;'3';'S';
'GRFTH';'2.16.840.1.113883.5.111';'Grandfather';;;;;'4';'L';
'GRMTH';'2.16.840.1.113883.5.111';'Grandmother';;;;;'4';'L';
'MGRFTH';'2.16.840.1.113883.5.111';'MaternalGrandfather';;;;;'4';'L';
'MGRMTH';'2.16.840.1.113883.5.111';'MaternalGrandmother';;;;;'4';'L';
'MGRPRN';'2.16.840.1.113883.5.111';'MaternalGrandparent';;;;;'4';'L';
'PGRFTH';'2.16.840.1.113883.5.111';'PaternalGrandfather';;;;;'4';'L';
'PGRMTH';'2.16.840.1.113883.5.111';'PaternalGrandmother';;;;;'4';'L';
'PGRPRN';'2.16.840.1.113883.5.111';'PaternalGrandparent';;;;;'4';'L';
'NIENEPH';'2.16.840.1.113883.5.111';'niece/nephew';;;;;'3';'S';
'NEPHEW';'2.16.840.1.113883.5.111';'nephew';;;;;'4';'L';
'NIECE';'2.16.840.1.113883.5.111';'niece';;;;;'4';'L';
'UNCLE';'2.16.840.1.113883.5.111';'uncle';;;;;'3';'S';
'MUNCLE';'2.16.840.1.113883.5.111';'MaternalUncle';;;;;'4';'L';
'PUNCLE';'2.16.840.1.113883.5.111';'PaternalUncle';;;;;'4';'L';
'PRN';'2.16.840.1.113883.5.111';'Parent';;;;;'2';'S';
'FTH';'2.16.840.1.113883.5.111';'Father';;;;;'3';'L';
'MTH';'2.16.840.1.113883.5.111';'Mother';;;;;'3';'L';
'NPRN';'2.16.840.1.113883.5.111';'natural parent';;;;;'3';'S';
'NFTH';'2.16.840.1.113883.5.111';'natural father';;;;;'4';'S';
'NFTHF';'2.16.840.1.113883.5.111';'natural father of fetus';;;;;'5';'L';
'NMTH';'2.16.840.1.113883.5.111';'natural mother';;;;;'4';'L';
'PRNINLAW';'2.16.840.1.113883.5.111';'parent in-law';;;;;'3';'S';
'FTHINLAW';'2.16.840.1.113883.5.111';'father-in-law';;;;;'4';'L';
'MTHINLAW';'2.16.840.1.113883.5.111';'mother-in-law';;;;;'4';'L';
'STPPRN';'2.16.840.1.113883.5.111';'step parent';;;;;'3';'S';
'STPFTH';'2.16.840.1.113883.5.111';'stepfather';;;;;'4';'L';
'STPMTH';'2.16.840.1.113883.5.111';'stepmother';;;;;'4';'L';
'SIB';'2.16.840.1.113883.5.111';'Sibling';;;;;'2';'S';
'BRO';'2.16.840.1.113883.5.111';'Brother';;;;;'3';'L';
'HSIB';'2.16.840.1.113883.5.111';'half-sibling';;;;;'3';'S';
'HBRO';'2.16.840.1.113883.5.111';'half-brother';;;;;'4';'L';
'HSIS';'2.16.840.1.113883.5.111';'half-sister';;;;;'4';'L';
'NSIB';'2.16.840.1.113883.5.111';'natural sibling';;;;;'3';'S';
'NBRO';'2.16.840.1.113883.5.111';'natural brother';;;;;'4';'L';
'NSIS';'2.16.840.1.113883.5.111';'natural sister';;;;;'4';'L';
'SIBINLAW';'2.16.840.1.113883.5.111';'sibling in-law';;;;;'3';'S';
'BROINLAW';'2.16.840.1.113883.5.111';'brother-in-law';;;;;'4';'L';
'SISINLAW';'2.16.840.1.113883.5.111';'sister-in-law';;;;;'4';'L';
'SIS';'2.16.840.1.113883.5.111';'Sister';;;;;'3';'L';
'STPSIB';'2.16.840.1.113883.5.111';'step sibling';;;;;'3';'S';
'STPBRO';'2.16.840.1.113883.5.111';'stepbrother';;;;;'4';'L';
'STPSIS';'2.16.840.1.113883.5.111';'stepsister';;;;;'4';'L';
'SIGOTHR';'2.16.840.1.113883.5.111';'significant other';;;;;'2';'S';
'DOMPART';'2.16.840.1.113883.5.111';'domestic partner';;;;;'3';'L';
'SPS';'2.16.840.1.113883.5.111';'spouse';;;;;'3';'S';
'HUSB';'2.16.840.1.113883.5.111';'husband';;;;;'4';'L';
'WIFE';'2.16.840.1.113883.5.111';'wife';;;;;'4';'L';
'FRND';'2.16.840.1.113883.5.111';'unrelated friend';;;;;'1';'L';
'NBOR';'2.16.840.1.113883.5.111';'neighbor';;;;;'1';'L';
'ROOM';'2.16.840.1.113883.5.111';'Roommate';;;;;'1';'L';
'_PolicyOrProgramCoverageRoleType';'2.16.840.1.113883.5.111';'PolicyOrProgramCoverageRoleType';;;;;'0';'S';
'_CoverageRoleType';'2.16.840.1.113883.5.111';'CoverageRoleType';;;;;'1';'S';
'FAMDEP';'2.16.840.1.113883.5.111';'family dependent';;;;;'2';'L';
'HANDIC';'2.16.840.1.113883.5.111';'handicapped dependent';;;;;'2';'L';
'INJ';'2.16.840.1.113883.5.111';'injured plaintiff';;;;;'2';'L';
'SELF';'2.16.840.1.113883.5.111';'self';;;;;'2';'L';
'SPON';'2.16.840.1.113883.5.111';'sponsored dependent';;;;;'2';'L';
'STUD';'2.16.840.1.113883.5.111';'student';;;;;'2';'S';
'FSTUD';'2.16.840.1.113883.5.111';'full-time student';;;;;'3';'L';
'PSTUD';'2.16.840.1.113883.5.111';'part-time student';;;;;'3';'L';
'_CoveredPartyRoleType';'2.16.840.1.113883.5.111';'covered party role type';;;;;'1';'S';
'_ClaimantCoveredPartyRoleType';'2.16.840.1.113883.5.111';'ClaimantCoveredPartyRoleType';;;;;'2';'S';
'CRIMEVIC';'2.16.840.1.113883.5.111';'crime victim';;;;;'3';'L';
'INJWKR';'2.16.840.1.113883.5.111';'injured worker';;;;;'3';'L';
'_DependentCoveredPartyRoleType';'2.16.840.1.113883.5.111';'DependentCoveredPartyRoleType';;;;;'2';'S';
'COCBEN';'2.16.840.1.113883.5.111';'continuity of coverage beneficiary';;;;;'3';'L';
'DIFFABL';'2.16.840.1.113883.5.111';'differently abled';;;;;'3';'L';
'WARD';'2.16.840.1.113883.5.111';'ward';;;;;'3';'L';
'_IndividualInsuredPartyRoleType';'2.16.840.1.113883.5.111';'IndividualInsuredPartyRoleType';;;;;'2';'S';
'RETIREE';'2.16.840.1.113883.5.111';'retiree';;;;;'3';'L';
'_ProgramEligiblePartyRoleType';'2.16.840.1.113883.5.111';'ProgramEligiblePartyRoleType';;;;;'2';'S';
'INDIG';'2.16.840.1.113883.5.111';'member of an indigenous people';;;;;'3';'L';
'MIL';'2.16.840.1.113883.5.111';'military';;;;;'3';'S';
'ACTMIL';'2.16.840.1.113883.5.111';'active duty military';;;;;'4';'L';
'RETMIL';'2.16.840.1.113883.5.111';'retired military';;;;;'4';'L';
'VET';'2.16.840.1.113883.5.111';'veteran';;;;;'4';'L';
'_SubscriberCoveredPartyRoleType';'2.16.840.1.113883.5.111';'SubscriberCoveredPartyRoleType';;;;;'2';'L';
'_ResearchSubjectRoleBasis';'2.16.840.1.113883.5.111';'ResearchSubjectRoleBasis';;;;;'0';'S';
'ERL';'2.16.840.1.113883.5.111';'enrollment';;;;;'1';'L';
'SCN';'2.16.840.1.113883.5.111';'screening';;;;;'1';'L';
'_ServiceDeliveryLocationRoleType';'2.16.840.1.113883.5.111';'ServiceDeliveryLocationRoleType';;;;;'0';'S';
'_DedicatedServiceDeliveryLocationRoleType';'2.16.840.1.113883.5.111';'DedicatedServiceDeliveryLocationRoleType';;;;;'1';'S';
'_DedicatedClinicalLocationRoleType';'2.16.840.1.113883.5.111';'DedicatedClinicalLocationRoleType';;;;;'2';'S';
'DX';'2.16.840.1.113883.5.111';'Diagnostics or therapeutics unit';;;;;'3';'S';
'CVDX';'2.16.840.1.113883.5.111';'Cardiovascular diagnostics or therapeutics unit';;;;;'4';'S';
'CATH';'2.16.840.1.113883.5.111';'Cardiac catheterization lab';;;;;'5';'L';
'ECHO';'2.16.840.1.113883.5.111';'Echocardiography lab';;;;;'5';'L';
'GIDX';'2.16.840.1.113883.5.111';'Gastroenterology diagnostics or therapeutics lab';;;;;'4';'S';
'ENDOS';'2.16.840.1.113883.5.111';'Endoscopy lab';;;;;'5';'L';
'RADDX';'2.16.840.1.113883.5.111';'Radiology diagnostics or therapeutics unit';;;;;'4';'S';
'RADO';'2.16.840.1.113883.5.111';'Radiation oncology unit';;;;;'5';'L';
'RNEU';'2.16.840.1.113883.5.111';'Neuroradiology unit';;;;;'5';'L';
'HOSP';'2.16.840.1.113883.5.111';'Hospital';;;;;'3';'S';
'CHR';'2.16.840.1.113883.5.111';'Chronic Care Facility';;;;;'4';'L';
'GACH';'2.16.840.1.113883.5.111';'Hospitals, General Acute Care Hospital';;;;;'4';'L';
'MHSP';'2.16.840.1.113883.5.111';'Military Hospital';;;;;'4';'L';
'PSYCHF';'2.16.840.1.113883.5.111';'Psychatric Care Facility';;;;;'4';'L';
'RH';'2.16.840.1.113883.5.111';'Rehabilitation hospital';;;;;'4';'S';
'RHAT';'2.16.840.1.113883.5.111';'addiction treatment center';;;;;'5';'L';
'RHII';'2.16.840.1.113883.5.111';'intellectual impairment center';;;;;'5';'L';
'RHMAD';'2.16.840.1.113883.5.111';'parents with adjustment difficulties center';;;;;'5';'L';
'RHPI';'2.16.840.1.113883.5.111';'physical impairment center';;;;;'5';'S';
'RHPIH';'2.16.840.1.113883.5.111';'physical impairment - hearing center';;;;;'6';'L';
'RHPIMS';'2.16.840.1.113883.5.111';'physical impairment - motor skills center';;;;;'6';'L';
'RHPIVS';'2.16.840.1.113883.5.111';'physical impairment - visual skills center';;;;;'6';'L';
'RHYAD';'2.16.840.1.113883.5.111';'youths with adjustment difficulties center';;;;;'5';'L';
'HU';'2.16.840.1.113883.5.111';'Hospital unit';;;;;'3';'S';
'BMTU';'2.16.840.1.113883.5.111';'Bone marrow transplant unit';;;;;'4';'L';
'CCU';'2.16.840.1.113883.5.111';'Coronary care unit';;;;;'4';'L';
'CHEST';'2.16.840.1.113883.5.111';'Chest unit';;;;;'4';'L';
'EPIL';'2.16.840.1.113883.5.111';'Epilepsy unit';;;;;'4';'L';
'ER';'2.16.840.1.113883.5.111';'Emergency room';;;;;'4';'S';
'ETU';'2.16.840.1.113883.5.111';'Emergency trauma unit';;;;;'5';'L';
'HD';'2.16.840.1.113883.5.111';'Hemodialysis unit';;;;;'4';'L';
'HLAB';'2.16.840.1.113883.5.111';'hospital laboratory';;;;;'4';'S';
'INLAB';'2.16.840.1.113883.5.111';'inpatient laboratory';;;;;'5';'L';
'OUTLAB';'2.16.840.1.113883.5.111';'outpatient laboratory';;;;;'5';'L';
'HRAD';'2.16.840.1.113883.5.111';'radiology unit';;;;;'4';'L';
'HUSCS';'2.16.840.1.113883.5.111';'specimen collection site';;;;;'4';'L';
'ICU';'2.16.840.1.113883.5.111';'Intensive care unit';;;;;'4';'S';
'PEDICU';'2.16.840.1.113883.5.111';'Pediatric intensive care unit';;;;;'5';'S';
'PEDNICU';'2.16.840.1.113883.5.111';'Pediatric neonatal intensive care unit';;;;;'6';'L';
'INPHARM';'2.16.840.1.113883.5.111';'inpatient pharmacy';;;;;'4';'L';
'MBL';'2.16.840.1.113883.5.111';'medical laboratory';;;;;'4';'L';
'NCCS';'2.16.840.1.113883.5.111';'Neurology critical care and stroke unit';;;;;'4';'L';
'NS';'2.16.840.1.113883.5.111';'Neurosurgery unit';;;;;'4';'L';
'OUTPHARM';'2.16.840.1.113883.5.111';'outpatient pharmacy';;;;;'4';'L';
'PEDU';'2.16.840.1.113883.5.111';'Pediatric unit';;;;;'4';'L';
'PHU';'2.16.840.1.113883.5.111';'Psychiatric hospital unit';;;;;'4';'L';
'RHU';'2.16.840.1.113883.5.111';'Rehabilitation hospital unit';;;;;'4';'L';
'SLEEP';'2.16.840.1.113883.5.111';'Sleep disorders unit';;;;;'4';'L';
'NCCF';'2.16.840.1.113883.5.111';'Nursing or custodial care facility';;;;;'3';'S';
'SNF';'2.16.840.1.113883.5.111';'Skilled nursing facility';;;;;'4';'L';
'OF';'2.16.840.1.113883.5.111';'Outpatient facility';;;;;'3';'S';
'ALL';'2.16.840.1.113883.5.111';'Allergy clinic';;;;;'4';'L';
'AMPUT';'2.16.840.1.113883.5.111';'Amputee clinic';;;;;'4';'L';
'BMTC';'2.16.840.1.113883.5.111';'Bone marrow transplant clinic';;;;;'4';'L';
'BREAST';'2.16.840.1.113883.5.111';'Breast clinic';;;;;'4';'L';
'CANC';'2.16.840.1.113883.5.111';'Child and adolescent neurology clinic';;;;;'4';'L';
'CAPC';'2.16.840.1.113883.5.111';'Child and adolescent psychiatry clinic';;;;;'4';'L';
'CARD';'2.16.840.1.113883.5.111';'Ambulatory Health Care Facilities, Clinic/Center, Rehabilitation: Cardiac Facilities';;;;;'4';'S';
'PEDCARD';'2.16.840.1.113883.5.111';'Pediatric cardiology clinic';;;;;'5';'L';
'COAG';'2.16.840.1.113883.5.111';'Coagulation clinic';;;;;'4';'L';
'CRS';'2.16.840.1.113883.5.111';'Colon and rectal surgery clinic';;;;;'4';'L';
'DERM';'2.16.840.1.113883.5.111';'Dermatology clinic';;;;;'4';'L';
'ENDO';'2.16.840.1.113883.5.111';'Endocrinology clinic';;;;;'4';'S';
'PEDE';'2.16.840.1.113883.5.111';'Pediatric endocrinology clinic';;;;;'5';'L';
'ENT';'2.16.840.1.113883.5.111';'Otorhinolaryngology clinic';;;;;'4';'L';
'FMC';'2.16.840.1.113883.5.111';'Family medicine clinic';;;;;'4';'L';
'GI';'2.16.840.1.113883.5.111';'Gastroenterology clinic';;;;;'4';'S';
'PEDGI';'2.16.840.1.113883.5.111';'Pediatric gastroenterology clinic';;;;;'5';'L';
'GIM';'2.16.840.1.113883.5.111';'General internal medicine clinic';;;;;'4';'L';
'GYN';'2.16.840.1.113883.5.111';'Gynecology clinic';;;;;'4';'L';
'HEM';'2.16.840.1.113883.5.111';'Hematology clinic';;;;;'4';'S';
'PEDHEM';'2.16.840.1.113883.5.111';'Pediatric hematology clinic';;;;;'5';'L';
'HTN';'2.16.840.1.113883.5.111';'Hypertension clinic';;;;;'4';'L';
'IEC';'2.16.840.1.113883.5.111';'Impairment evaluation center';;;;;'4';'L';
'INFD';'2.16.840.1.113883.5.111';'Infectious disease clinic';;;;;'4';'S';
'PEDID';'2.16.840.1.113883.5.111';'Pediatric infectious disease clinic';;;;;'5';'L';
'INV';'2.16.840.1.113883.5.111';'Infertility clinic';;;;;'4';'L';
'LYMPH';'2.16.840.1.113883.5.111';'Lympedema clinic';;;;;'4';'L';
'MGEN';'2.16.840.1.113883.5.111';'Medical genetics clinic';;;;;'4';'L';
'NEPH';'2.16.840.1.113883.5.111';'Nephrology clinic';;;;;'4';'S';
'PEDNEPH';'2.16.840.1.113883.5.111';'Pediatric nephrology clinic';;;;;'5';'L';
'NEUR';'2.16.840.1.113883.5.111';'Neurology clinic';;;;;'4';'L';
'OB';'2.16.840.1.113883.5.111';'Obstetrics clinic';;;;;'4';'L';
'OMS';'2.16.840.1.113883.5.111';'Oral and maxillofacial surgery clinic';;;;;'4';'L';
'ONCL';'2.16.840.1.113883.5.111';'Medical oncology clinic';;;;;'4';'S';
'PEDHO';'2.16.840.1.113883.5.111';'Pediatric oncology clinic';;;;;'5';'L';
'OPH';'2.16.840.1.113883.5.111';'Opthalmology clinic';;;;;'4';'L';
'OPTC';'2.16.840.1.113883.5.111';'optometry clinic';;;;;'4';'L';
'ORTHO';'2.16.840.1.113883.5.111';'Orthopedics clinic';;;;;'4';'S';
'HAND';'2.16.840.1.113883.5.111';'Hand clinic';;;;;'5';'L';
'PAINCL';'2.16.840.1.113883.5.111';'Pain clinic';;;;;'4';'L';
'PC';'2.16.840.1.113883.5.111';'Primary care clinic';;;;;'4';'L';
'PEDC';'2.16.840.1.113883.5.111';'Pediatrics clinic';;;;;'4';'S';
'PEDRHEUM';'2.16.840.1.113883.5.111';'Pediatric rheumatology clinic';;;;;'5';'L';
'POD';'2.16.840.1.113883.5.111';'Podiatry clinic';;;;;'4';'L';
'PREV';'2.16.840.1.113883.5.111';'Preventive medicine clinic';;;;;'4';'L';
'PROCTO';'2.16.840.1.113883.5.111';'Proctology clinic';;;;;'4';'L';
'PROFF';'2.16.840.1.113883.5.111';'Provider´s Office';;;;;'4';'L';
'PROS';'2.16.840.1.113883.5.111';'Prosthodontics clinic';;;;;'4';'L';
'PSI';'2.16.840.1.113883.5.111';'Psychology clinic';;;;;'4';'L';
'PSY';'2.16.840.1.113883.5.111';'Psychiatry clinic';;;;;'4';'L';
'RHEUM';'2.16.840.1.113883.5.111';'Rheumatology clinic';;;;;'4';'L';
'SPMED';'2.16.840.1.113883.5.111';'Sports medicine clinic';;;;;'4';'L';
'SU';'2.16.840.1.113883.5.111';'Surgery clinic';;;;;'4';'S';
'PLS';'2.16.840.1.113883.5.111';'Plastic surgery clinic';;;;;'5';'L';
'URO';'2.16.840.1.113883.5.111';'Urology clinic';;;;;'5';'L';
'TR';'2.16.840.1.113883.5.111';'Transplant clinic';;;;;'4';'L';
'TRAVEL';'2.16.840.1.113883.5.111';'Travel and geographic medicine clinic';;;;;'4';'L';
'WND';'2.16.840.1.113883.5.111';'Wound clinic';;;;;'4';'L';
'RTF';'2.16.840.1.113883.5.111';'Residential treatment facility';;;;;'3';'S';
'PRC';'2.16.840.1.113883.5.111';'Pain rehabilitation center';;;;;'4';'L';
'SURF';'2.16.840.1.113883.5.111';'Substance use rehabilitation facility';;;;;'4';'L';
'_DedicatedNonClinicalLocationRoleType';'2.16.840.1.113883.5.111';'DedicatedNonClinicalLocationRoleType';;;;;'2';'S';
'DADDR';'2.16.840.1.113883.5.111';'Delivery Address';;;;;'3';'L';
'MOBL';'2.16.840.1.113883.5.111';'Mobile Unit';;;;;'3';'S';
'AMB';'2.16.840.1.113883.5.111';'Ambulance';;;;;'4';'L';
'PHARM';'2.16.840.1.113883.5.111';'Pharmacy';;;;;'3';'L';
'_IncidentalServiceDeliveryLocationRoleType';'2.16.840.1.113883.5.111';'IncidentalServiceDeliveryLocationRoleType';;;;;'1';'S';
'ACC';'2.16.840.1.113883.5.111';'accident site';;;;;'2';'L';
'COMM';'2.16.840.1.113883.5.111';'Community Location';;;;;'2';'S';
'CSC';'2.16.840.1.113883.5.111';'community service center';;;;;'3';'L';
'PTRES';'2.16.840.1.113883.5.111';'Patient´s Residence';;;;;'2';'L';
'SCHOOL';'2.16.840.1.113883.5.111';'school';;;;;'2';'L';
'UPC';'2.16.840.1.113883.5.111';'underage protection center';;;;;'2';'L';
'WORK';'2.16.840.1.113883.5.111';'work site';;;;;'2';'L';
'_SpecimenRoleType';'2.16.840.1.113883.5.111';'SpecimenRoleType';;;;;'0';'S';
'C';'2.16.840.1.113883.5.111';'Calibrator';;;;;'1';'L';
'G';'2.16.840.1.113883.5.111';'Group';;;;;'1';'L';
'L';'2.16.840.1.113883.5.111';'Pool';;;;;'1';'L';
'P';'2.16.840.1.113883.5.111';'Patient';;;;;'1';'L';
'Q';'2.16.840.1.113883.5.111';'Quality Control';;;;;'1';'S';
'B';'2.16.840.1.113883.5.111';'Blind';;;;;'2';'L';
'E';'2.16.840.1.113883.5.111';'Electronic QC';;;;;'2';'L';
'F';'2.16.840.1.113883.5.111';'Filler Proficiency';;;;;'2';'L';
'O';'2.16.840.1.113883.5.111';'Operator Proficiency';;;;;'2';'L';
'V';'2.16.840.1.113883.5.111';'Verifying';;;;;'2';'L';
'R';'2.16.840.1.113883.5.111';'Replicate';;;;;'1';'L';
'communityLaboratory';'2.16.840.1.113883.5.111';'Community Laboratory';;;;;'0';'L';
'homeHealth';'2.16.840.1.113883.5.111';'Home Health';;;;;'0';'L';
'laboratory';'2.16.840.1.113883.5.111';'Laboratory';;;;;'0';'L';
'pathologist';'2.16.840.1.113883.5.111';'Pathologist';;;;;'0';'L';
'phlebotomist';'2.16.840.1.113883.5.111';'Phlebotomist';;;;;'0';'L';
'subject';'2.16.840.1.113883.5.111';'Self';;;;;'0';'L';
'thirdParty';'2.16.840.1.113883.5.111';'Third Party';;;;;'0';'L';
