"resource";"url";"version";"name";"title";"status";"description";"content";"identifier";"date";"count";"property";"property"
"CodeSystem";"https://termgit.elga.gv.at/CodeSystem-hl7-null-flavor";"202006";"hl7-null-flavor";"HL7 Null Flavor";"active";"None";"complete";"2.16.840.1.113883.5.1008";"2020-06-08";"14";"child|||code";"parent|||code"

"code";"display";"property";"property";"property";"property";"property"
"NI";"NoInformation";"child|INV|code";"child|MSK|code";"child|NA|code";"child|UNK|code"
"INV";"invalid";"parent|NI|code";"child|DER|code";"child|OTH|code";""
"DER";"derived";"parent|INV|code";"";"";""
"OTH";"Other";"parent|INV|code";"child|NINF|code";"child|PINF|code";""
"NINF";"Negative infinity";"parent|OTH|code";"";"";""
"PINF";"Positive infinity";"parent|OTH|code";"";"";""
"MSK";"Masked";"parent|NI|code";"";"";""
"NA";"Not applicable";"parent|NI|code";"";"";""
"UNK";"Unknown";"parent|NI|code";"child|ASKU|code";"child|NASK|code";"child|QS|code";"child|TRC|code"
"ASKU";"Asked, but unknown";"parent|UNK|code";"child|NAV|code";"";"";""
"NAV";"Temporarily unavailable";"parent|ASKU|code";"";"";"";""
"NASK";"Not asked";"parent|UNK|code";"";"";"";""
"QS";"Sufficient Quantity";"parent|UNK|code";"";"";"";""
"TRC";"Trace";"parent|UNK|code";"";"";"";""