'code';'codeSystem';'displayName';'parentCodeSystemName';'concept_Beschreibung';'meaning';'hints';'orderNumber';'level';'type';'relationships';'einheit print';'einheit codiert'
'{HUB}';'1.2.40.0.10.1.4.3.4.3.2';'Hub';'https://termgit.elga.gv.at/CodeSystem-elga-medikationmengenartalternativ';;;;'1';'0';'L';;;
'{TAB}';'1.2.40.0.10.1.4.3.4.3.2';'Tablette';'https://termgit.elga.gv.at/CodeSystem-elga-medikationmengenartalternativ';;;;'2';'0';'L';;;
