'code';'codeSystem';'displayName';'parentCodeSystemName';'concept_Beschreibung';'meaning';'hints';'orderNumber';'level';'type';'relationships';'einheit print';'einheit codiert'
'SP001';'1.2.40.0.34.5.45';'Adenovirus im Konjunktivalabstrich (*)';'https://termgit.elga.gv.at/CodeSystem-elga-significantpathogens';'';'';'vgl.Falldefinitionen des Robert-Koch-Institutes';'1';'0';'L';'';'';''
'SP002';'1.2.40.0.34.5.45';'HIV';'https://termgit.elga.gv.at/CodeSystem-elga-significantpathogens';'';'';'';'2';'0';'L';'';'';''
'SP003';'1.2.40.0.34.5.45';'Bacillus anthracis';'https://termgit.elga.gv.at/CodeSystem-elga-significantpathogens';'';'';'';'3';'0';'L';'';'';''
'SP004';'1.2.40.0.34.5.45';'Influenza A/H5';'https://termgit.elga.gv.at/CodeSystem-elga-significantpathogens';'';'';'';'4';'0';'L';'';'';''
'SP005';'1.2.40.0.34.5.45';'Influenza A/H5N1';'https://termgit.elga.gv.at/CodeSystem-elga-significantpathogens';'';'';'';'5';'0';'L';'';'';''
'SP006';'1.2.40.0.34.5.45';'Clostridium botulinum';'https://termgit.elga.gv.at/CodeSystem-elga-significantpathogens';'';'';'';'6';'0';'L';'';'';''
'SP007';'1.2.40.0.34.5.45';'Brucella spp.';'https://termgit.elga.gv.at/CodeSystem-elga-significantpathogens';'';'';'';'7';'0';'L';'';'';''
'SP008';'1.2.40.0.34.5.45';'Campylobacter spp.';'https://termgit.elga.gv.at/CodeSystem-elga-significantpathogens';'';'';'';'8';'0';'L';'';'';''
'SP009';'1.2.40.0.34.5.45';'Chlamydia trachomatis';'https://termgit.elga.gv.at/CodeSystem-elga-significantpathogens';'';'';'';'9';'0';'L';'';'';''
'SP010';'1.2.40.0.34.5.45';'Vibrio cholerae';'https://termgit.elga.gv.at/CodeSystem-elga-significantpathogens';'';'';'';'10';'0';'L';'';'';''
'SP011';'1.2.40.0.34.5.45';'Denguevirus';'https://termgit.elga.gv.at/CodeSystem-elga-significantpathogens';'';'';'';'11';'0';'L';'';'';''
'SP012';'1.2.40.0.34.5.45';'Corynebacterium diphtheriae';'https://termgit.elga.gv.at/CodeSystem-elga-significantpathogens';'';'';'';'12';'0';'L';'';'';''
'SP013';'1.2.40.0.34.5.45';'Corynebacterium ulcerans';'https://termgit.elga.gv.at/CodeSystem-elga-significantpathogens';'';'';'';'13';'0';'L';'';'';''
'SP014';'1.2.40.0.34.5.45';'Ebolavirus';'https://termgit.elga.gv.at/CodeSystem-elga-significantpathogens';'';'';'vgl.Falldefinitionen des Robert-Koch-Institutes';'14';'0';'L';'';'';''
'SP015';'1.2.40.0.34.5.45';'Escherichia coli, sonstige darmpathogene Stämme';'https://termgit.elga.gv.at/CodeSystem-elga-significantpathogens';'';'';'vgl.Falldefinitionen des Robert-Koch-Institutes';'15';'0';'L';'';'';''
'SP016';'1.2.40.0.34.5.45';'Echinococcus spp.';'https://termgit.elga.gv.at/CodeSystem-elga-significantpathogens';'';'';'';'16';'0';'L';'';'';''
'SP017';'1.2.40.0.34.5.45';'Rickettsia prowazekii';'https://termgit.elga.gv.at/CodeSystem-elga-significantpathogens';'';'';'vgl.Falldefinitionen des Robert-Koch-Institutes';'17';'0';'L';'';'';''
'SP018';'1.2.40.0.34.5.45';'FSME-Virus';'https://termgit.elga.gv.at/CodeSystem-elga-significantpathogens';'';'';'vgl.Falldefinitionen des Robert-Koch-Institutes';'18';'0';'L';'';'';''
'SP019';'1.2.40.0.34.5.45';'Gelbfieber-Virus';'https://termgit.elga.gv.at/CodeSystem-elga-significantpathogens';'';'';'';'19';'0';'L';'';'';''
'SP020';'1.2.40.0.34.5.45';'Giardia lamblia';'https://termgit.elga.gv.at/CodeSystem-elga-significantpathogens';'';'';'';'20';'0';'L';'';'';''
'SP021';'1.2.40.0.34.5.45';'Neisseria gonorrhoeae';'https://termgit.elga.gv.at/CodeSystem-elga-significantpathogens';'';'';'';'21';'0';'L';'';'';''
'SP022';'1.2.40.0.34.5.45';'Haemophilus influenzae';'https://termgit.elga.gv.at/CodeSystem-elga-significantpathogens';'';'';'';'22';'0';'L';'';'';''
'SP023';'1.2.40.0.34.5.45';'Hantavirus';'https://termgit.elga.gv.at/CodeSystem-elga-significantpathogens';'';'';'vgl.Falldefinitionen des Robert-Koch-Institutes';'23';'0';'L';'';'';''
'SP024';'1.2.40.0.34.5.45';'Hepatitis-A-Virus';'https://termgit.elga.gv.at/CodeSystem-elga-significantpathogens';'';'';'';'24';'0';'L';'';'';''
'SP025';'1.2.40.0.34.5.45';'Hepatitis-B-Virus';'https://termgit.elga.gv.at/CodeSystem-elga-significantpathogens';'';'';'';'25';'0';'L';'';'';''
'SP026';'1.2.40.0.34.5.45';'Hepatitis-C-Virus';'https://termgit.elga.gv.at/CodeSystem-elga-significantpathogens';'';'';'';'26';'0';'L';'';'';''
'SP027';'1.2.40.0.34.5.45';'HDV - Hepatitis-D-Virus akut';'https://termgit.elga.gv.at/CodeSystem-elga-significantpathogens';'';'';'vgl.Falldefinitionen des Robert-Koch-Institutes';'27';'0';'L';'';'';''
'SP028';'1.2.40.0.34.5.45';'HEV - akute Virushepatitis E';'https://termgit.elga.gv.at/CodeSystem-elga-significantpathogens';'';'';'vgl.Falldefinitionen des Robert-Koch-Institutes';'28';'0';'L';'';'';''
'SP029';'1.2.40.0.34.5.45';'Influenzavirus';'https://termgit.elga.gv.at/CodeSystem-elga-significantpathogens';'';'';'';'29';'0';'L';'';'';''
'SP030';'1.2.40.0.34.5.45';'Bordetella pertussis';'https://termgit.elga.gv.at/CodeSystem-elga-significantpathogens';'';'';'';'30';'0';'L';'';'';''
'SP031';'1.2.40.0.34.5.45';'Cryptosporidium spp.';'https://termgit.elga.gv.at/CodeSystem-elga-significantpathogens';'';'';'';'31';'0';'L';'';'';''
'SP032';'1.2.40.0.34.5.45';'Lassavirus';'https://termgit.elga.gv.at/CodeSystem-elga-significantpathogens';'';'';'vgl.Falldefinitionen des Robert-Koch-Institutes';'32';'0';'L';'';'';''
'SP033';'1.2.40.0.34.5.45';'Borrelia recurrentis';'https://termgit.elga.gv.at/CodeSystem-elga-significantpathogens';'';'';'';'33';'0';'L';'';'';''
'SP034';'1.2.40.0.34.5.45';'Legionella spp.';'https://termgit.elga.gv.at/CodeSystem-elga-significantpathogens';'';'';'';'34';'0';'L';'';'';''
'SP035';'1.2.40.0.34.5.45';'Mycobacterium leprae';'https://termgit.elga.gv.at/CodeSystem-elga-significantpathogens';'';'';'vgl.Falldefinitionen des Robert-Koch-Institutes';'35';'0';'L';'';'';''
'SP036';'1.2.40.0.34.5.45';'Leptospira interrogans';'https://termgit.elga.gv.at/CodeSystem-elga-significantpathogens';'';'';'';'36';'0';'L';'';'';''
'SP037';'1.2.40.0.34.5.45';'Listeria monocytogenes';'https://termgit.elga.gv.at/CodeSystem-elga-significantpathogens';'';'';'';'37';'0';'L';'';'';''
'SP038';'1.2.40.0.34.5.45';'Plasmodium spp.';'https://termgit.elga.gv.at/CodeSystem-elga-significantpathogens';'';'';'';'38';'0';'L';'';'';''
'SP039';'1.2.40.0.34.5.45';'Marburgvirus';'https://termgit.elga.gv.at/CodeSystem-elga-significantpathogens';'';'';'vgl.Falldefinitionen des Robert-Koch-Institutes';'39';'0';'L';'';'';''
'SP040';'1.2.40.0.34.5.45';'Masernvirus';'https://termgit.elga.gv.at/CodeSystem-elga-significantpathogens';'';'';'';'40';'0';'L';'';'';''
'SP041';'1.2.40.0.34.5.45';'Neisseria meningitidis';'https://termgit.elga.gv.at/CodeSystem-elga-significantpathogens';'';'';'';'41';'0';'L';'';'';''
'SP042';'1.2.40.0.34.5.45';'Mumpsvirus';'https://termgit.elga.gv.at/CodeSystem-elga-significantpathogens';'';'';'';'42';'0';'L';'';'';''
'SP043';'1.2.40.0.34.5.45';'Norovirus';'https://termgit.elga.gv.at/CodeSystem-elga-significantpathogens';'';'';'vgl.Falldefinitionen des Robert-Koch-Institutes';'43';'0';'L';'';'';''
'SP044';'1.2.40.0.34.5.45';'Chlamydophila psittaci';'https://termgit.elga.gv.at/CodeSystem-elga-significantpathogens';'';'';'vgl.Falldefinitionen des Robert-Koch-Institutes';'44';'0';'L';'';'';''
'SP045';'1.2.40.0.34.5.45';'Yersinia pestis';'https://termgit.elga.gv.at/CodeSystem-elga-significantpathogens';'';'';'';'45';'0';'L';'';'';''
'SP046';'1.2.40.0.34.5.45';'Streptococcus pneumoniae';'https://termgit.elga.gv.at/CodeSystem-elga-significantpathogens';'';'';'';'46';'0';'L';'';'';''
'SP047';'1.2.40.0.34.5.45';'Variola-Virus';'https://termgit.elga.gv.at/CodeSystem-elga-significantpathogens';'';'';'';'47';'0';'L';'';'';''
'SP048';'1.2.40.0.34.5.45';'Poliovirus';'https://termgit.elga.gv.at/CodeSystem-elga-significantpathogens';'';'';'';'48';'0';'L';'';'';''
'SP049';'1.2.40.0.34.5.45';'Coxiella burnetii';'https://termgit.elga.gv.at/CodeSystem-elga-significantpathogens';'';'';'';'49';'0';'L';'';'';''
'SP050';'1.2.40.0.34.5.45';'Rotavirus';'https://termgit.elga.gv.at/CodeSystem-elga-significantpathogens';'';'';'vgl.Falldefinitionen des Robert-Koch-Institutes';'50';'0';'L';'';'';''
'SP051';'1.2.40.0.34.5.45';'Rubella-Virus';'https://termgit.elga.gv.at/CodeSystem-elga-significantpathogens';'';'';'';'51';'0';'L';'';'';''
'SP053';'1.2.40.0.34.5.45';'Salmonella spp. außer S. Typhi und S. Paratyphi';'https://termgit.elga.gv.at/CodeSystem-elga-significantpathogens';'';'';'';'52';'0';'L';'';'';''
'SP054';'1.2.40.0.34.5.45';'SARS-Coronavirus, SARS-CoV';'https://termgit.elga.gv.at/CodeSystem-elga-significantpathogens';'';'';'';'53';'0';'L';'';'';''
'SP055';'1.2.40.0.34.5.45';'Shigella spp.';'https://termgit.elga.gv.at/CodeSystem-elga-significantpathogens';'';'';'';'54';'0';'L';'';'';''
'SP056';'1.2.40.0.34.5.45';'Treponema pallidum';'https://termgit.elga.gv.at/CodeSystem-elga-significantpathogens';'';'';'';'55';'0';'L';'';'';''
'SP057';'1.2.40.0.34.5.45';'Clostridium tetani';'https://termgit.elga.gv.at/CodeSystem-elga-significantpathogens';'';'';'';'56';'0';'L';'';'';''
'SP058';'1.2.40.0.34.5.45';'Lyssa-Virus';'https://termgit.elga.gv.at/CodeSystem-elga-significantpathogens';'';'';'';'57';'0';'L';'';'';''
'SP059';'1.2.40.0.34.5.45';'Toxoplasma gondii';'https://termgit.elga.gv.at/CodeSystem-elga-significantpathogens';'';'';'';'58';'0';'L';'';'';''
'SP060';'1.2.40.0.34.5.45';'Trichinella spp.';'https://termgit.elga.gv.at/CodeSystem-elga-significantpathogens';'';'';'';'59';'0';'L';'';'';''
'SP061';'1.2.40.0.34.5.45';'Mycobacterium-tuberculosis-Komplex';'https://termgit.elga.gv.at/CodeSystem-elga-significantpathogens';'';'';'';'60';'0';'L';'';'';''
'SP062';'1.2.40.0.34.5.45';'Francisella tularensis';'https://termgit.elga.gv.at/CodeSystem-elga-significantpathogens';'';'';'';'61';'0';'L';'';'';''
'SP063';'1.2.40.0.34.5.45';'Salmonella typhi';'https://termgit.elga.gv.at/CodeSystem-elga-significantpathogens';'';'';'';'62';'0';'L';'';'';''
'SP064';'1.2.40.0.34.5.45';'Salmonella paratyphi';'https://termgit.elga.gv.at/CodeSystem-elga-significantpathogens';'';'';'';'63';'0';'L';'';'';''
'SP065';'1.2.40.0.34.5.45';'West-Nil-Virus';'https://termgit.elga.gv.at/CodeSystem-elga-significantpathogens';'';'';'';'64';'0';'L';'';'';''
'SP066';'1.2.40.0.34.5.45';'Yersinia enterocolitica';'https://termgit.elga.gv.at/CodeSystem-elga-significantpathogens';'';'';'';'65';'0';'L';'';'';''
'SP067';'1.2.40.0.34.5.45';'Yersinia pseudotuberculosis';'https://termgit.elga.gv.at/CodeSystem-elga-significantpathogens';'';'';'';'66';'0';'L';'';'';''
