'code';'codeSystem';'displayName';'parentCode';'concept_Beschreibung';'meaning';'hints';'level';'type';'relationships'
'J';'1.2.40.0.34.5.208';'Ja';'';'';'';'';'0';'L';''
'N';'1.2.40.0.34.5.208';'Nein';'';'';'';'';'0';'L';''
