{
  "resourceType": "CodeSystem",
  "id": "ems-durchgefuehrt",
  "url": "https://termgit.elga.gv.at/CodeSystem-ems-durchgefuehrt",
  "identifier": [
    {
      "use": "official",
      "system": "urn:ietf:rfc:3986",
      "value": "urn:oid:1.2.40.0.34.5.74"
    }
  ],
  "version": "1.0.0",
  "name": "ems-durchgefuehrt",
  "title": "EMS_Durchgefuehrt",
  "status": "active",
  "date": "2017-01-26",
  "description": "**Beschreibung:** EMS Liste Durchgef\u00fchrt: Verwendung bei TBC",
  "content": "complete",
  "count": 2,
  "concept": [
    {
      "code": "D",
      "display": "Durchgef\u00fchrt"
    },
    {
      "code": "ND",
      "display": "nicht durchgef\u00fchrt"
    }
  ]
}