'code';'codeSystem';'displayName';'parentCodeSystemName';'concept_Beschreibung';'meaning';'hints';'orderNumber';'level';'type';'relationships';'einheit print';'einheit codiert'
'unconfirmed';'2.16.840.1.113883.4.642.3.115';'unbestätigt';'https://termgit.elga.gv.at/CodeSystem-ips-conditionverificationstatus';'IPSConditionVerificationStatus';;;'1';'0';'S';;;
'provisional';'2.16.840.1.113883.4.642.3.115';'vorläufig';'https://termgit.elga.gv.at/CodeSystem-ips-conditionverificationstatus';'IPSConditionVerificationStatus';;;'2';'1';'L';;;
'differential';'2.16.840.1.113883.4.642.3.115';'alternativ möglich (Differentialdiagnose)';'https://termgit.elga.gv.at/CodeSystem-ips-conditionverificationstatus';'IPSConditionVerificationStatus';;;'3';'1';'L';;;
'confirmed';'2.16.840.1.113883.4.642.3.115';'bestätigt';'https://termgit.elga.gv.at/CodeSystem-ips-conditionverificationstatus';'IPSConditionVerificationStatus';;;'4';'0';'L';;;
'refuted';'2.16.840.1.113883.4.642.3.115';'ausgeschlossen';'https://termgit.elga.gv.at/CodeSystem-ips-conditionverificationstatus';'IPSConditionVerificationStatus';;;'5';'0';'L';;;
'unknown';'2.16.840.1.113883.4.642.3.115';'unbekannt';'https://termgit.elga.gv.at/CodeSystem-ips-conditionverificationstatus';'IPSConditionVerificationStatus';;;'6';'0';'L';;;
