{
  "resourceType": "ValueSet",
  "id": "elga-conditionstatuscode",
  "url": "https://termgit.elga.gv.at/ValueSet-elga-conditionstatuscode",
  "identifier": [
    {
      "use": "official",
      "system": "urn:ietf:rfc:3986",
      "value": "urn:oid:1.2.40.0.34.10.198"
    }
  ],
  "version": "202005",
  "name": "elga-conditionstatuscode",
  "title": "ELGA_ConditionStatusCode",
  "status": "active",
  "date": "2020-05-25",
  "description": "**Description:** Condition or Problem Status Code\n\n**Beschreibung:** Value Set f\u00fcr den Status Code eines Problems",
  "compose": {
    "include": [
      {
        "system": "https://termgit.elga.gv.at/CodeSystem-ips-conditionclinicalstatuscodes",
        "concept": [
          {
            "code": "active",
            "display": "Active",
            "designation": [
              {
                "language": "de-AT",
                "value": "bestehend"
              },
              {
                "use": {
                  "system": "https://termgit.elga.gv.at/CodeSystem-austrian-designation-use",
                  "code": "hinweise",
                  "display": "hinweise"
                },
                "value": "The subject is currently experiencing the symptoms of the condition or there is evidence of the condition"
              }
            ]
          },
          {
            "code": "well-controlled",
            "display": "Well controlled",
            "designation": [
              {
                "language": "de-AT",
                "value": "gut eingestellt"
              },
              {
                "use": {
                  "system": "https://termgit.elga.gv.at/CodeSystem-austrian-designation-use",
                  "code": "hinweise",
                  "display": "hinweise"
                },
                "value": "The subject's condition is adequately or well managed such that the recommended\u00a0 evidence-based clinical outcome targets are met"
              }
            ]
          },
          {
            "code": "poorly-controlled",
            "display": "Poorly controlled",
            "designation": [
              {
                "language": "de-AT",
                "value": "mangelhaft eingestellt"
              },
              {
                "use": {
                  "system": "https://termgit.elga.gv.at/CodeSystem-austrian-designation-use",
                  "code": "hinweise",
                  "display": "hinweise"
                },
                "value": "The\u00a0 subject's condition is inadequately/poorly managed such that the recommended evidence-based clinical outcome targets are not met"
              }
            ]
          },
          {
            "code": "recurrence",
            "display": "Recurrence",
            "designation": [
              {
                "language": "de-AT",
                "value": "Rezidiv"
              },
              {
                "use": {
                  "system": "https://termgit.elga.gv.at/CodeSystem-austrian-designation-use",
                  "code": "hinweise",
                  "display": "hinweise"
                },
                "value": "The subject is experiencing a re-occurrence or repeating of a\u00a0previously\u00a0resolved\u00a0condition. Example: recurrence of (previously resolved) urinary tract infection, pancreatitis, cholangitis, conjunctivitis"
              }
            ]
          },
          {
            "code": "relapse",
            "display": "Relapse",
            "designation": [
              {
                "language": "de-AT",
                "value": "Relaps"
              },
              {
                "use": {
                  "system": "https://termgit.elga.gv.at/CodeSystem-austrian-designation-use",
                  "code": "hinweise",
                  "display": "hinweise"
                },
                "value": "The subject is experiencing a return of a condition, or signs and symptoms after a period of improvement or\u00a0remission. Examples: relapse of cancer,\u00a0multiple sclerosis, rheumatoid arthritis, systemic lupus erythematosus, bipolar disorder, [psychotic relapse of] schizophrenia,\u00a0etc"
              }
            ]
          },
          {
            "code": "inactive",
            "display": "Inactive",
            "designation": [
              {
                "language": "de-AT",
                "value": "nicht mehr bestehend"
              },
              {
                "use": {
                  "system": "https://termgit.elga.gv.at/CodeSystem-austrian-designation-use",
                  "code": "hinweise",
                  "display": "hinweise"
                },
                "value": "The subject is no longer experiencing the symptoms of the condition or there is no longer evidence of the condition"
              }
            ]
          },
          {
            "code": "remission",
            "display": "Remission",
            "designation": [
              {
                "language": "de-AT",
                "value": "in Remission"
              },
              {
                "use": {
                  "system": "https://termgit.elga.gv.at/CodeSystem-austrian-designation-use",
                  "code": "hinweise",
                  "display": "hinweise"
                },
                "value": "The subject is no longer experiencing the symptoms of the condition, but there is a risk of the symptoms or condition returning"
              }
            ]
          },
          {
            "code": "resolved",
            "display": "Resolved",
            "designation": [
              {
                "language": "de-AT",
                "value": "abgeklungen"
              },
              {
                "use": {
                  "system": "https://termgit.elga.gv.at/CodeSystem-austrian-designation-use",
                  "code": "hinweise",
                  "display": "hinweise"
                },
                "value": "The subject is no longer experiencing the symptoms of the condition and there is a negligible perceived risk of the symptoms returning"
              }
            ]
          }
        ]
      }
    ]
  },
  "expansion": {
    "timestamp": "2022-09-13T14:16:36Z",
    "contains": [
      {
        "system": "https://termgit.elga.gv.at/CodeSystem-ips-conditionclinicalstatuscodes",
        "code": "active",
        "display": "Active",
        "designation": [
          {
            "language": "de-AT",
            "value": "bestehend"
          },
          {
            "use": {
              "system": "https://termgit.elga.gv.at/CodeSystem-austrian-designation-use",
              "code": "hinweise",
              "display": "hinweise"
            },
            "value": "The subject is currently experiencing the symptoms of the condition or there is evidence of the condition"
          }
        ],
        "contains": [
          {
            "system": "https://termgit.elga.gv.at/CodeSystem-ips-conditionclinicalstatuscodes",
            "code": "well-controlled",
            "display": "Well controlled",
            "designation": [
              {
                "language": "de-AT",
                "value": "gut eingestellt"
              },
              {
                "use": {
                  "system": "https://termgit.elga.gv.at/CodeSystem-austrian-designation-use",
                  "code": "hinweise",
                  "display": "hinweise"
                },
                "value": "The subject's condition is adequately or well managed such that the recommended\u00a0 evidence-based clinical outcome targets are met"
              }
            ]
          },
          {
            "system": "https://termgit.elga.gv.at/CodeSystem-ips-conditionclinicalstatuscodes",
            "code": "poorly-controlled",
            "display": "Poorly controlled",
            "designation": [
              {
                "language": "de-AT",
                "value": "mangelhaft eingestellt"
              },
              {
                "use": {
                  "system": "https://termgit.elga.gv.at/CodeSystem-austrian-designation-use",
                  "code": "hinweise",
                  "display": "hinweise"
                },
                "value": "The\u00a0 subject's condition is inadequately/poorly managed such that the recommended evidence-based clinical outcome targets are not met"
              }
            ]
          },
          {
            "system": "https://termgit.elga.gv.at/CodeSystem-ips-conditionclinicalstatuscodes",
            "code": "recurrence",
            "display": "Recurrence",
            "designation": [
              {
                "language": "de-AT",
                "value": "Rezidiv"
              },
              {
                "use": {
                  "system": "https://termgit.elga.gv.at/CodeSystem-austrian-designation-use",
                  "code": "hinweise",
                  "display": "hinweise"
                },
                "value": "The subject is experiencing a re-occurrence or repeating of a\u00a0previously\u00a0resolved\u00a0condition. Example: recurrence of (previously resolved) urinary tract infection, pancreatitis, cholangitis, conjunctivitis"
              }
            ]
          },
          {
            "system": "https://termgit.elga.gv.at/CodeSystem-ips-conditionclinicalstatuscodes",
            "code": "relapse",
            "display": "Relapse",
            "designation": [
              {
                "language": "de-AT",
                "value": "Relaps"
              },
              {
                "use": {
                  "system": "https://termgit.elga.gv.at/CodeSystem-austrian-designation-use",
                  "code": "hinweise",
                  "display": "hinweise"
                },
                "value": "The subject is experiencing a return of a condition, or signs and symptoms after a period of improvement or\u00a0remission. Examples: relapse of cancer,\u00a0multiple sclerosis, rheumatoid arthritis, systemic lupus erythematosus, bipolar disorder, [psychotic relapse of] schizophrenia,\u00a0etc"
              }
            ]
          }
        ]
      },
      {
        "system": "https://termgit.elga.gv.at/CodeSystem-ips-conditionclinicalstatuscodes",
        "code": "inactive",
        "display": "Inactive",
        "designation": [
          {
            "language": "de-AT",
            "value": "nicht mehr bestehend"
          },
          {
            "use": {
              "system": "https://termgit.elga.gv.at/CodeSystem-austrian-designation-use",
              "code": "hinweise",
              "display": "hinweise"
            },
            "value": "The subject is no longer experiencing the symptoms of the condition or there is no longer evidence of the condition"
          }
        ],
        "contains": [
          {
            "system": "https://termgit.elga.gv.at/CodeSystem-ips-conditionclinicalstatuscodes",
            "code": "remission",
            "display": "Remission",
            "designation": [
              {
                "language": "de-AT",
                "value": "in Remission"
              },
              {
                "use": {
                  "system": "https://termgit.elga.gv.at/CodeSystem-austrian-designation-use",
                  "code": "hinweise",
                  "display": "hinweise"
                },
                "value": "The subject is no longer experiencing the symptoms of the condition, but there is a risk of the symptoms or condition returning"
              }
            ]
          },
          {
            "system": "https://termgit.elga.gv.at/CodeSystem-ips-conditionclinicalstatuscodes",
            "code": "resolved",
            "display": "Resolved",
            "designation": [
              {
                "language": "de-AT",
                "value": "abgeklungen"
              },
              {
                "use": {
                  "system": "https://termgit.elga.gv.at/CodeSystem-austrian-designation-use",
                  "code": "hinweise",
                  "display": "hinweise"
                },
                "value": "The subject is no longer experiencing the symptoms of the condition and there is a negligible perceived risk of the symptoms returning"
              }
            ]
          }
        ]
      }
    ]
  }
}