{
  "resourceType": "CodeSystem",
  "id": "elga-mammogramassessment",
  "url": "https://termgit.elga.gv.at/CodeSystem-elga-mammogramassessment",
  "identifier": [
    {
      "use": "official",
      "system": "urn:ietf:rfc:3986",
      "value": "urn:oid:1.2.40.0.34.5.49"
    }
  ],
  "version": "3.3",
  "name": "elga-mammogramassessment",
  "title": "ELGA_MammogramAssessment",
  "status": "active",
  "date": "2015-10-05",
  "contact": [
    {
      "telecom": [
        {
          "system": "url",
          "value": "www.elga.gv.at"
        }
      ]
    }
  ],
  "description": "**Description:** Definition of the values for a mammogram according DICOM Coding Scheme 'BI' from 'Digital Imaging and Communications in Medicine (DICOM) Part 16: Content Mapping Resource'\n\n**Beschreibung:** Definition der Werte f\u00fcr ein Mammogramm entsprechend DICOM Coding Scheme 'BI' aus 'Digital Imaging and Communications in Medicine (DICOM) Part 16: Content Mapping Resource'",
  "content": "complete",
  "count": 10,
  "property": [
    {
      "code": "child",
      "type": "code"
    },
    {
      "code": "parent",
      "type": "code"
    }
  ],
  "concept": [
    {
      "code": "II.AC.a",
      "display": "0 - Need additional imaging evaluation",
      "definition": "0 \u0096  braucht zus\u00e4tzliche Bildgebung",
      "designation": [
        {
          "language": "de-AT",
          "value": "0 \u0096 braucht zus\u00e4tzliche Bildgebung"
        }
      ]
    },
    {
      "code": "II.AC.b.1",
      "display": "1 \u0096 Negative",
      "definition": "1 \u0096 negativ (d.h. keine Masse, keine Architekturst\u00f6rung, kein Kalk, keine Hautverdickung etc.)",
      "designation": [
        {
          "language": "de-AT",
          "value": "1 \u0096 Negativ"
        }
      ]
    },
    {
      "code": "II.AC.b.2",
      "display": "2 \u0096 Benign Finding",
      "definition": "2 \u0096 benigne Befunde (z.B. Zysten, intramamm\u00e4re Lymphknoten, Brustimplantate, station\u00e4re postoperative Befunde, station\u00e4re Fibroadenome)",
      "designation": [
        {
          "language": "de-AT",
          "value": "2 \u0096 Benigner Befund"
        }
      ]
    },
    {
      "code": "II.AC.b.3",
      "display": "3 - Probably Benign Finding \u0096 short interval followup",
      "definition": "3 \u0096 Wahrscheinlich benigne Befunde, kurzfristige Verlaufskontrolle empfohlen (L\u00e4sionen mit scharfen R\u00e4ndern, oval\u00e4rer Form, horizontaler Orientierung, Malignit\u00e4tsrisiko unter 2 %.)",
      "designation": [
        {
          "language": "de-AT",
          "value": "3 \u0096 Wahrscheinlich benigner Befund, kurzfristige Verlaufskontrolle empfohlen"
        }
      ]
    },
    {
      "code": "II.AC.b.4",
      "display": "4 - Suspicious abnormality, biopsy should be considered",
      "definition": "4 \u0096 Verd\u00e4chtig, Biopsie sollte erwogen werden (L\u00e4sionen mit intermedi\u00e4rer Wahrscheinlichkeit f\u00fcr Malignit\u00e4t)",
      "designation": [
        {
          "language": "de-AT",
          "value": "4 \u0096 Suspekter Befund, Biopsie sollte erwogen werden"
        }
      ],
      "property": [
        {
          "code": "child",
          "valueCode": "MA.II.A.5.4A"
        },
        {
          "code": "child",
          "valueCode": "MA.II.A.5.4B"
        },
        {
          "code": "child",
          "valueCode": "MA.II.A.5.4C"
        }
      ]
    },
    {
      "code": "MA.II.A.5.4A",
      "display": "4A \u0096 Low suspicion",
      "definition": "4A \u0096 Geringgradig verd\u00e4chtiger Befund, Biopsie sollte erwogen werden",
      "designation": [
        {
          "language": "de-AT",
          "value": "4A \u0096 Geringgradiger Verdacht"
        }
      ],
      "property": [
        {
          "code": "parent",
          "valueCode": "II.AC.b.4"
        }
      ]
    },
    {
      "code": "MA.II.A.5.4B",
      "display": "4B \u0096 Intermediate suspicion",
      "definition": "4B \u0096 Zwischenstuflich verd\u00e4chtiger Befund, Biopsie sollte erwogen werden",
      "designation": [
        {
          "language": "de-AT",
          "value": "4B \u0096 Zwischenstuflicher Verdacht"
        }
      ],
      "property": [
        {
          "code": "parent",
          "valueCode": "II.AC.b.4"
        }
      ]
    },
    {
      "code": "MA.II.A.5.4C",
      "display": "4C \u0096 Moderate suspicion",
      "definition": "4C \u0096 M\u00e4\u00dfig verd\u00e4chtiger Befund, Biopsie sollte erwogen werden",
      "designation": [
        {
          "language": "de-AT",
          "value": "4C \u0096 M\u00e4\u00dfiger Verdacht"
        }
      ],
      "property": [
        {
          "code": "parent",
          "valueCode": "II.AC.b.4"
        }
      ]
    },
    {
      "code": "II.AC.b.5",
      "display": "5 - Highly suggestive of malignancy, take appropriate action",
      "definition": "5 \u0096 hochsuspekt, fast sicher maligne, eine ad\u00e4quate Aktion sollte folgen (Risiko auf Malignit\u00e4t von 95 % oder gr\u00f6\u00dfer)",
      "designation": [
        {
          "language": "de-AT",
          "value": "5 \u0096 Hochsuspekt, fast sicher maligne, eine ad\u00e4quate Aktion sollte folgen"
        }
      ]
    },
    {
      "code": "MA.II.A.5.6",
      "display": "6 - Known biopsy proven malignancy",
      "definition": "6 \u0096 Bekannter maligner Befund, mit Biopsie best\u00e4tigt",
      "designation": [
        {
          "language": "de-AT",
          "value": "6 \u0096 Gesichertes Malignom"
        }
      ]
    }
  ]
}