{
  "resourceType": "CodeSystem",
  "id": "ems-posneg",
  "url": "https://termgit.elga.gv.at/CodeSystem-ems-posneg",
  "identifier": [
    {
      "use": "official",
      "system": "urn:ietf:rfc:3986",
      "value": "urn:oid:1.2.40.0.34.5.88"
    }
  ],
  "version": "1.0.0",
  "name": "ems-posneg",
  "title": "EMS_PosNeg",
  "status": "active",
  "date": "2017-01-26",
  "description": "**Beschreibung:** EMS Positiv, Negativ",
  "content": "complete",
  "count": 8,
  "concept": [
    {
      "code": "GW",
      "display": "grenzwertig"
    },
    {
      "code": "NA",
      "display": "nicht anwendbar"
    },
    {
      "code": "NAW",
      "display": "nicht auswertbar"
    },
    {
      "code": "NEG",
      "display": "negativ"
    },
    {
      "code": "NOTEST",
      "display": "nicht durchgef\u00fchrt"
    },
    {
      "code": "POS",
      "display": "positiv"
    },
    {
      "code": "UB",
      "display": "unbestimmt"
    },
    {
      "code": "UNK",
      "display": "unbekannt"
    }
  ]
}