'code';'codeSystem';'displayName';'parentCodeSystemName';'concept_Beschreibung';'meaning';'hints';'orderNumber';'level';'type';'relationships';'einheit print';'einheit codiert'
'100';'1.2.40.0.34.5.2';'Ärztin/Arzt für Allgemeinmedizin';'https://termgit.elga.gv.at/CodeSystem-elga-gtelvogdarollen';'Arzt/Ärztin f. Allgemeinmed.';'';'';'1';'0';'L';'';'';''
'101';'1.2.40.0.34.5.2';'Approbierte Ärztin/Approbierter Arzt';'https://termgit.elga.gv.at/CodeSystem-elga-gtelvogdarollen';'Approbierter Arzt/Ärztin';'';'';'2';'0';'L';'';'';''
'158';'1.2.40.0.34.5.2';'Fachärztin/Facharzt';'https://termgit.elga.gv.at/CodeSystem-elga-gtelvogdarollen';'Facharzt/-ärztin';'';'';'3';'0';'L';'';'';''
'204';'1.2.40.0.34.5.2';'Hebamme';'https://termgit.elga.gv.at/CodeSystem-elga-gtelvogdarollen';'Hebamme';'';'';'4';'0';'L';'';'';''
'212';'1.2.40.0.34.5.2';'Diplomierte Gesundheits- und Krankenschwester/Diplomierter Gesundheits- und Krankenpfleger';'https://termgit.elga.gv.at/CodeSystem-elga-gtelvogdarollen';'DGKS/DGKP';'';'';'5';'0';'L';'';'';''
'213';'1.2.40.0.34.5.2';'Diplomierte Kinderkrankenschwester/Diplomierter Kinderkrankenpfleger';'https://termgit.elga.gv.at/CodeSystem-elga-gtelvogdarollen';'DKKS/DKKP';'';'';'6';'0';'L';'';'';''
'214';'1.2.40.0.34.5.2';'Diplomierte psychiatrische Gesundheits- und Krankenschwester/Diplomierter psychiatrischer Gesundheits- und Krankenpfleger';'https://termgit.elga.gv.at/CodeSystem-elga-gtelvogdarollen';'DPGKS/DPGKP';'';'';'7';'0';'L';'';'';''
