'code';'codeSystem';'displayName';'parentCode';'concept_Beschreibung';'meaning';'hints';'level';'type';'relationships'
'GDLPUB';'1.2.40.0.34.5.21';'Gesundheitsdienstleistung Pflege und Betreuung';;;'Gesundheitsdienstleistung Pflege und Betreuung';'Verwendung im Pflegesituationsbericht';'0';'L';
'GDLSTATAUF';'1.2.40.0.34.5.21';'Gesundheitsdienstleistung im Rahmen eines stationären Aufenthalts';;;'Gesundheitsdienstleistung im Rahmen eines stationären Aufenthalts';;'0';'L';
