"resource";"url";"version";"name";"title";"status";"description";"content";"identifier";"date";"count"
"CodeSystem";"https://termgit.elga.gv.at/CodeSystem-hl7-marital-status";"HL7:MaritalStatus";"hl7-marital-status";"HL7 Marital Status";"active";"None";"complete";"2.16.840.1.113883.5.2";"2013-01-10";"9"

"code";"display"
"A";"Annulled"
"D";"Divorced"
"I";"Interlocutory"
"L";"Legally Separated"
"M";"Married"
"P";"Polygamous"
"S";"Never Married"
"T";"Domestic partner"
"W";"Widowed"