'code';'codeSystem';'displayName';'parentCode';'concept_Beschreibung';'meaning';'hints';'level';'type';'relationships';'Relationships'
'F001';'1.2.40.0.34.5.12';'Allgemeinmedizin';;'Dokumente aus Allgemeinmedizinischen Organisationen';'Allgemeinmedizin';;'0';'L';;'LKF Funktionscode: 1- 91 11'
'F002';'1.2.40.0.34.5.12';'Anästhesiologie und Intensivmedizin';;'Anästhesiologie und Intensivmedizin';'Anästhesiologie und Intensivmedizin';;'0';'L';;'LKF Funktionscode: 1- 71 --'
'F005';'1.2.40.0.34.5.12';'Augenheilkunde';;'Augenheilkunde';'Augenheilkunde';;'0';'L';;'LKF Funktionscode: 1- 41 --'
'F006';'1.2.40.0.34.5.12';'Blutgruppenserologie und Transfusionsmedizin';;'Blutgruppenserologie und Transfusionsmedizin';'Blutgruppenserologie und Transfusionsmedizin';;'0';'L';;'LKF Funktionscode: 1- 71 12'
'F007';'1.2.40.0.34.5.12';'Chirurgie';;'Chirurgie (inklusive Gefäß- und Transplantationschirugie)';'Chirurgie';;'0';'L';;'LKF Funktionscode: 1- 21 -- (nicht 1- 21 14, 1- 21 16)'
'F010';'1.2.40.0.34.5.12';'Gynäkologie und Geburtshilfe';;'Frauenheilkunde (Gynäkologie), Geburtshilfe, inklusive Hebammentätigkeit, Wochenbettbetreuung, Schwangerenvorsorge';'Gynäkologie und Geburtshilfe';;'0';'L';;'LKF Funktionscode: 1- 31 --             LKF Funktionscode: 1- 32 --             LKF Funktionscode: 1- 33 --'
'F014';'1.2.40.0.34.5.12';'Hals-, Nasen- und Ohrenheilkunde';;'Hals-, Nasen- und Ohrenkrankheiten';'Hals-, Nasen- und Ohrenheilkunde';;'0';'L';;'LKF Funktionscode: 1- 42 --'
'F015';'1.2.40.0.34.5.12';'Dermatologie';;'Haut- und Geschlechtskrankheiten';'Dermatologie';;'0';'L';;'LKF Funktionscode: 1- 45 --'
'F016';'1.2.40.0.34.5.12';'Mikrobiologie';;'Dokumente aus dem Bereich mikrobiologisch-serologische Labordiagnostik';'Mikrobiologie';;'0';'L';;'LKF Funktionscode: 1- 83 --             LKF Funktionscode: 1- -- 79'
'F019';'1.2.40.0.34.5.12';'Innere Medizin';;'Innere Medizin';'Innere Medizin';;'0';'L';;'LKF Funktionscode: 1- 11 --'
'F023';'1.2.40.0.34.5.12';'Interdisziplinärer Bereich';;'Interdisziplinärer Bereich  (Eingeschränkter Geltungsbereich, nur wenn in einem CDA-Leitfaden vorgesehen)';'Interdisziplinärer Bereich';;'0';'L';;'LKF Funktionscode: 1- 91 --'
'F025';'1.2.40.0.34.5.12';'Kinder- und Jugendpsychiatrie';;'Kinder- und Jugendpsychiatrie';'Kinder- und Jugendpsychiatrie';;'0';'L';;'LKF Funktionscode: 1- 64 --'
'F026';'1.2.40.0.34.5.12';'Kinder- und Jugendchirurgie';;'Kinder-Chirurgie';'Kinder- und Jugendchirurgie';;'0';'L';;'LKF Funktionscode: 1- 27 --'
'F027';'1.2.40.0.34.5.12';'Kinder- und Jugendheilkunde';;'Kinderheilkunde';'Kinder- und Jugendheilkunde';;'0';'L';;'LKF Funktionscode: 1- 51 --'
'F028';'1.2.40.0.34.5.12';'Labordiagnostik';;'Dokumente aus dem Bereich medizinisch-chemische Labordiagnostik';'Labordiagnostik';;'0';'L';;'LKF Funktionscode: 1- 82 --'
'F029';'1.2.40.0.34.5.12';'Mund-, Kiefer- und Gesichtschirurgie';;'Mund-, Kiefer- und Gesichtschirurgie';'Mund-, Kiefer- und Gesichtschirurgie';;'0';'L';;'LKF Funktionscode: 1- 24 --'
'F031';'1.2.40.0.34.5.12';'Neurochirurgie';;'Neurochirurgie';'Neurochirurgie';;'0';'L';;'LKF Funktionscode: 1- 25 --'
'F032';'1.2.40.0.34.5.12';'Neurologie';;'Neurologie, Inkl. Stroke Unit sowie Neurologie Phase B, C';'Neurologie';;'0';'L';;'LKF Funktionscode: 1- 63 --'
'F033';'1.2.40.0.34.5.12';'Nuklearmedizin';;'Nuklearmedizin';'Nuklearmedizin';;'0';'L';;'LKF Funktionscode: 1- 75 --'
'F035';'1.2.40.0.34.5.12';'Orthopädie und orthopädische Chirurgie';;'Orthopädie und orthopädische Chirurgie';'Orthopädie und orthopädische Chirurgie';;'0';'L';;'LKF Funktionscode: 1- 23 --'
'F036';'1.2.40.0.34.5.12';'Palliativmedizin';;'Dokumente der palliativ-medizinischen Versorgung';'Palliativmedizin';;'0';'L';;'LKF Funktionscode: 1- 91 37'
'F037';'1.2.40.0.34.5.12';'Pathologie';;'Pathologie';'Pathologie';;'0';'L';;'LKF Funktionscode: 1- 81 --'
'F040';'1.2.40.0.34.5.12';'Physikalische Medizin und Rehabilitation';;'Physikalische Medizin';'Physikalische Medizin und Rehabilitation';;'0';'L';;'LKF Funktionscode: 1- 78 --'
'F041';'1.2.40.0.34.5.12';'Plastische Chirurgie';;'Plastische Chirurgie';'Plastische Chirurgie';;'0';'L';;'LKF Funktionscode: 1- 26 --'
'F042';'1.2.40.0.34.5.12';'Psychiatrie';;'Psychiatrie';'Psychiatrie';;'0';'L';;'LKF Funktionscode: 1- 62 --'
'F043';'1.2.40.0.34.5.12';'Pulmologie';;'Pulmologie (Lungenheilkunde)';'Pulmologie';;'0';'L';;'LKF Funktionscode: 1- 12 --'
'F044';'1.2.40.0.34.5.12';'Radiologie';;'Radiologie';'Radiologie';;'0';'L';;'LKF Funktionscode: 1- 72 --'
'F048';'1.2.40.0.34.5.12';'Remobilisation/Nachsorge';;'Remobilisation/Nachsorge';'Remobilisation/Nachsorge';;'0';'L';;'LKF Funktionscode: 1- 91 35'
'F052';'1.2.40.0.34.5.12';'Unfallchirurgie';;'Unfallchirurgie';'Unfallchirurgie';;'0';'L';;'LKF Funktionscode: 1- 22 --'
'F053';'1.2.40.0.34.5.12';'Urologie';;'Urologie';'Urologie';;'0';'L';;'LKF Funktionscode: 1- 43 --'
'F055';'1.2.40.0.34.5.12';'Zahn-, Mund- und Kieferheilkunde';;'Zahn-, Mund- und Kieferheilkunde';'Zahn-, Mund- und Kieferheilkunde';;'0';'L';;'LKF Funktionscode: 1- 48 --'
'F056';'1.2.40.0.34.5.12';'Akutgeriatrie/Remobilisation';;'Dokumente aus dem Bereich der Akutgeriatrie und Remobilisation';'Akutgeriatrie/Remobilisation';;'0';'L';;'LKF Funktionscode: 1- 11 36             LKF Funktionscode: 1- 63 36'
'F057';'1.2.40.0.34.5.12';'Gesundheits- und Krankenpflege';;'Gesundheits- und Krankenpflegerische Dokumente (nicht zu verwenden für Dokumente aus dem Krankenhausbereich)';'Gesundheits- und Krankenpflege';;'0';'L';
'F058';'1.2.40.0.34.5.12';'Herzchirurgie';;'Herzchirurgie';'Herzchirurgie';;'0';'L';;'LKF Funktionscode: 1- 21 14'
'F059';'1.2.40.0.34.5.12';'Klinische Psychologie';;'Klinische Psychologie';'Klinische Psychologie';;'0';'L';;'LKF Funktionscode: 1- 62 17'
'F060';'1.2.40.0.34.5.12';'Kur- und Prävention';;'Kur- und Prävention';'Kur- und Prävention';;'0';'L';
'F061';'1.2.40.0.34.5.12';'Psychosomatik';;'Psychosomatik';'Psychosomatik';;'0';'L';;'LKF Funktionscode: 1- -- 68'
'F062';'1.2.40.0.34.5.12';'Radioonkologie';;'Dokumente aus Strahlentherapie und Radioonkologie';'Radioonkologie';;'0';'L';;'LKF Funktionscode: 1- 72 12             LKF Funktionscode: 1- 72 58'
'F063';'1.2.40.0.34.5.12';'Rechtliche Dokumente';;'Rechtliche Dokumente wie Patientenverfügungen';'Rechtliche Dokumente';;'0';'L';
'F064';'1.2.40.0.34.5.12';'Thoraxchirurgie';;'Thoraxchirurgie';'Thoraxchirurgie';;'0';'L';;'LKF Funktionscode: 1- 21 16'
'F065';'1.2.40.0.34.5.12';'Patienten Verwaltung';;'Dokumente aus dem Bereich der Patienten Verwaltung (Administration)';'Patienten Verwaltung';;'0';'L';
'F066';'1.2.40.0.34.5.12';'Krankenhauspflege';;'Dokumente aus dem pflegerischen Bereich im Krankenhaus (nur zu verwenden, wenn nicht eine spezifischere Zuordnung zu einem anderen Fachbereich möglich ist)';'Krankenhauspflege';;'0';'L';
'F067';'1.2.40.0.34.5.12';'Orthopädie und Traumatologie';;'Orthopädie und Traumatologie';'Orthopädie und Traumatologie';;'0';'L';;'LKF Funktionscode: 1- 30 --'
