'code';'codeSystem';'displayName';'parentCode';'concept_Beschreibung';'meaning';'hints';'level';'type';'relationships'
'NI';'2.16.840.1.113883.5.1008';'NoInformation';;;;;'0';'S';
'INV';'2.16.840.1.113883.5.1008';'invalid';;;;;'1';'S';
'DER';'2.16.840.1.113883.5.1008';'derived';;;;;'2';'L';
'OTH';'2.16.840.1.113883.5.1008';'Other';;;;;'2';'S';
'NINF';'2.16.840.1.113883.5.1008';'Negative infinity';;;;;'3';'L';
'PINF';'2.16.840.1.113883.5.1008';'Positive infinity';;;;;'3';'L';
'MSK';'2.16.840.1.113883.5.1008';'Masked';;;;;'1';'L';
'NA';'2.16.840.1.113883.5.1008';'Not applicable';;;;;'1';'L';
'UNK';'2.16.840.1.113883.5.1008';'Unknown';;;;;'1';'S';
'ASKU';'2.16.840.1.113883.5.1008';'Asked, but unknown';;;;;'2';'S';
'NAV';'2.16.840.1.113883.5.1008';'Temporarily unavailable';;;;;'3';'L';
'NASK';'2.16.840.1.113883.5.1008';'Not asked';;;;;'2';'L';
'QS';'2.16.840.1.113883.5.1008';'Sufficient Quantity';;;;;'2';'L';
'TRC';'2.16.840.1.113883.5.1008';'Trace';;;;;'2';'L';
