'code';'codeSystem';'displayName';'parentCodeSystemName';'concept_Beschreibung';'meaning';'hints';'orderNumber';'level';'type';'relationships';'einheit print';'einheit codiert'
'303119007';'2.16.840.1.113883.6.96';'Person in the community environment (person)';'https://termgit.elga.gv.at/CodeSystem-snomed-ct-auszug';;;;'1';'0';'A';;;
'Kindergarten';'1.2.40.0.34.5.196';'Kindergarten';'https://termgit.elga.gv.at/CodeSystem-ems-betreuung';;;;'2';'1';'L';;;
'Schule';'1.2.40.0.34.5.196';'Schule';'https://termgit.elga.gv.at/CodeSystem-ems-betreuung';;;;'3';'1';'L';;;
'Seniorenheim';'1.2.40.0.34.5.196';'Seniorenheim';'https://termgit.elga.gv.at/CodeSystem-ems-betreuung';;;;'4';'1';'L';;;
'303118004';'2.16.840.1.113883.6.96';'Person in the healthcare environment (person)';'https://termgit.elga.gv.at/CodeSystem-snomed-ct-auszug';;;;'5';'0';'A';;;
'Pflegeheim';'1.2.40.0.34.5.196';'Pflegeheim';'https://termgit.elga.gv.at/CodeSystem-ems-betreuung';;;;'6';'1';'L';;;
'NA';'1.2.40.0.34.5.81';'nicht anwendbar';'https://termgit.elga.gv.at/CodeSystem-ems-nachweis';;;;'7';'0';'L';;;
