'code';'codeSystem';'displayName';'parentCode';'concept_Beschreibung';'meaning';'hints';'level';'type';'relationships'
'AC';'2.16.840.1.113883.5.139';'AC';;;;;'0';'L';
'ACD';'2.16.840.1.113883.5.139';'ACD';;;;;'0';'L';
'ACM';'2.16.840.1.113883.5.139';'ACM';;;;;'0';'L';
'ACV';'2.16.840.1.113883.5.139';'ACV';;;;;'0';'L';
'C';'2.16.840.1.113883.5.139';'C';;;;;'0';'S';
'CD';'2.16.840.1.113883.5.139';'CD';;;;;'1';'L';
'CM';'2.16.840.1.113883.5.139';'CM';;;;;'1';'L';
'CV';'2.16.840.1.113883.5.139';'CV';;;;;'1';'L';
'HS';'2.16.840.1.113883.5.139';'HS';;;;;'0';'L';
'IC';'2.16.840.1.113883.5.139';'IC';;;;;'0';'L';
'ICD';'2.16.840.1.113883.5.139';'ICD';;;;;'0';'L';
'ICM';'2.16.840.1.113883.5.139';'ICM';;;;;'0';'L';
'ICV';'2.16.840.1.113883.5.139';'ICV';;;;;'0';'L';
'PC';'2.16.840.1.113883.5.139';'PC';;;;;'0';'L';
'PCD';'2.16.840.1.113883.5.139';'PCD';;;;;'0';'L';
'PCM';'2.16.840.1.113883.5.139';'PCM';;;;;'0';'L';
'PCV';'2.16.840.1.113883.5.139';'PCV';;;;;'0';'L';
'WAKE';'2.16.840.1.113883.5.139';'WAKE';;;;;'0';'L';
