'code';'codeSystem';'displayName';'parentCodeSystemName';'concept_Beschreibung';'meaning';'hints';'orderNumber';'level';'type';'relationships';'einheit print';'einheit codiert'
'G';'2.16.840.1.113883.3.7.1.8';'Gesichert';'https://termgit.elga.gv.at/CodeSystem-sciphox-diagnosenzusatz';'Gesicherte Diagnose ';;;'1';'0';'L';;;
'V';'2.16.840.1.113883.3.7.1.8';'Verdacht auf';'https://termgit.elga.gv.at/CodeSystem-sciphox-diagnosenzusatz';'Verdachtsdiagnose ';;'uncertaintyCode = UN';'2';'0';'L';;;
