"resource";"url";"version";"name";"title";"status";"description";"content";"identifier";"date";"count";"property";"property"
"CodeSystem";"https://termgit.elga.gv.at/CodeSystem-hl7-entity-name-part-qualifier";"HL7:EntityNamePartQualifier (OrganizationNamePartQualifier)";"hl7-entity-name-part-qualifier";"HL7 Entity Name Part Qualifier";"active";"None";"complete";"2.16.840.1.113883.5.43";"2013-01-10";"20";"child|||code";"parent|||code"

"code";"display";"property";"property";"property";"property";"property";"property";"property";"property";"property";"property";"property";"property";"property";"property";"property";"property";"property";"property";"property"
"_OrganizationNamePartQualifier";"OrganizationNamePartQualifier";"child|AC|code";"child|AD|code";"child|BR|code";"child|CL|code";"child|CON|code";"child|DEV|code";"child|FRM|code";"child|IN|code";"child|INV|code";"child|LS|code";"child|NB|code";"child|PR|code";"child|SCI|code";"child|SP|code";"child|STR|code";"child|TITLE|code";"child|TMK|code";"child|USE|code";"child|VV|code"
"AC";"academic";"parent|_OrganizationNamePartQualifier|code";"";"";"";"";"";"";"";"";"";"";"";"";"";"";"";"";"";""
"AD";"adopted";"parent|_OrganizationNamePartQualifier|code";"";"";"";"";"";"";"";"";"";"";"";"";"";"";"";"";"";""
"BR";"birth";"parent|_OrganizationNamePartQualifier|code";"";"";"";"";"";"";"";"";"";"";"";"";"";"";"";"";"";""
"CL";"callme";"parent|_OrganizationNamePartQualifier|code";"";"";"";"";"";"";"";"";"";"";"";"";"";"";"";"";"";""
"CON";"container name";"parent|_OrganizationNamePartQualifier|code";"";"";"";"";"";"";"";"";"";"";"";"";"";"";"";"";"";""
"DEV";"device name";"parent|_OrganizationNamePartQualifier|code";"";"";"";"";"";"";"";"";"";"";"";"";"";"";"";"";"";""
"FRM";"form name";"parent|_OrganizationNamePartQualifier|code";"";"";"";"";"";"";"";"";"";"";"";"";"";"";"";"";"";""
"IN";"initial";"parent|_OrganizationNamePartQualifier|code";"";"";"";"";"";"";"";"";"";"";"";"";"";"";"";"";"";""
"INV";"invented name";"parent|_OrganizationNamePartQualifier|code";"";"";"";"";"";"";"";"";"";"";"";"";"";"";"";"";"";""
"LS";"Legal status";"parent|_OrganizationNamePartQualifier|code";"";"";"";"";"";"";"";"";"";"";"";"";"";"";"";"";"";""
"NB";"nobility";"parent|_OrganizationNamePartQualifier|code";"";"";"";"";"";"";"";"";"";"";"";"";"";"";"";"";"";""
"PR";"professional";"parent|_OrganizationNamePartQualifier|code";"";"";"";"";"";"";"";"";"";"";"";"";"";"";"";"";"";""
"SCI";"scientific name";"parent|_OrganizationNamePartQualifier|code";"";"";"";"";"";"";"";"";"";"";"";"";"";"";"";"";"";""
"SP";"spouse";"parent|_OrganizationNamePartQualifier|code";"";"";"";"";"";"";"";"";"";"";"";"";"";"";"";"";"";""
"STR";"strength name";"parent|_OrganizationNamePartQualifier|code";"";"";"";"";"";"";"";"";"";"";"";"";"";"";"";"";"";""
"TITLE";"title";"parent|_OrganizationNamePartQualifier|code";"";"";"";"";"";"";"";"";"";"";"";"";"";"";"";"";"";""
"TMK";"trademark name";"parent|_OrganizationNamePartQualifier|code";"";"";"";"";"";"";"";"";"";"";"";"";"";"";"";"";"";""
"USE";"intended use name";"parent|_OrganizationNamePartQualifier|code";"";"";"";"";"";"";"";"";"";"";"";"";"";"";"";"";"";""
"VV";"voorvoegsel";"parent|_OrganizationNamePartQualifier|code";"";"";"";"";"";"";"";"";"";"";"";"";"";"";"";"";"";""