{
  "resourceType": "ValueSet",
  "id": "elga-formatcode",
  "url": "https://termgit.elga.gv.at/ValueSet-elga-formatcode",
  "identifier": [
    {
      "use": "official",
      "system": "urn:ietf:rfc:3986",
      "value": "urn:oid:1.2.40.0.34.10.61"
    }
  ],
  "version": "202205",
  "name": "elga-formatcode",
  "title": "ELGA_FormatCode",
  "status": "active",
  "date": "2022-05-16",
  "contact": [
    {
      "telecom": [
        {
          "system": "url",
          "value": "www.elga.gv.at"
        }
      ]
    }
  ],
  "description": "**Description:** Allowed values for the FormatCode in the XDS-Matadata, within ELGA.      In case of an ELGA CDA document with the interoperability level ''Enhanced'' or ''Full Support'' and additionally containing self-defined machine readable elements, this needs to be labeled using ''+'' (Plus-Sign) within the Formatcode.      E.g.: ''urn:elga:dissum:2011:EIS_FullSupport+''     \n\n**Beschreibung:** Zur Verwendung in ELGA erlaubte Werte f\u00fcr den FormatCode in den XDS-Metadaten.     Liegt ein CDA Dokument in ELGA Interoperabilit\u00e4tsstufe ''Enhanced'' oder ''Full Support'' vor und enth\u00e4lt das Dokument zus\u00e4tzliche selbst-definierte maschinenlesbare Elemente, so ist dies durch ein ''+'' (Plus-Zeichen) als Zusatz im Formatcode gekennzeichnet werden.      ZB: ''urn:elga:dissum:2011:EIS_FullSupport+''",
  "compose": {
    "include": [
      {
        "system": "https://termgit.elga.gv.at/CodeSystem-elga-formatcode",
        "concept": [
          {
            "code": "urn:elga:2015-v2.06:EIS_Basic",
            "display": "ELGA Dokument v2.06",
            "designation": [
              {
                "use": {
                  "system": "https://termgit.elga.gv.at/CodeSystem-austrian-designation-use",
                  "code": "concept_beschreibung",
                  "display": "concept_beschreibung"
                },
                "value": "CDA Dokument entsprechend den Vorgaben des Allgemeinen Implementierungsleitfadens f\u00fcr ELGA Dokumente (EIS Basic) v2-06"
              }
            ]
          },
          {
            "code": "urn:elga:2015:EIS_Basic",
            "display": "ELGA Dokument",
            "designation": [
              {
                "use": {
                  "system": "https://termgit.elga.gv.at/CodeSystem-austrian-designation-use",
                  "code": "concept_beschreibung",
                  "display": "concept_beschreibung"
                },
                "value": "CDA Dokument entsprechend den Vorgaben des Allgemeinen Implementierungsleitfadens f\u00fcr ELGA Dokumente (EIS Basic)"
              }
            ]
          },
          {
            "code": "urn:elga:2016-v2.06.1:EIS_Basic",
            "display": "ELGA Dokument v2.06.1",
            "designation": [
              {
                "language": "de-AT",
                "value": "ELGA Dokument v2.06"
              },
              {
                "use": {
                  "system": "https://termgit.elga.gv.at/CodeSystem-austrian-designation-use",
                  "code": "concept_beschreibung",
                  "display": "concept_beschreibung"
                },
                "value": "CDA Dokument entsprechend den Vorgaben des Allgemeinen Implementierungsleitfadens f\u00fcr ELGA Dokumente (EIS Basic) v2-06.1"
              }
            ]
          },
          {
            "code": "urn:elga:2017-v2.06.2:EIS_Basic",
            "display": "ELGA Dokument v2.06.2",
            "designation": [
              {
                "language": "de-AT",
                "value": "ELGA Dokument v2.06"
              },
              {
                "use": {
                  "system": "https://termgit.elga.gv.at/CodeSystem-austrian-designation-use",
                  "code": "concept_beschreibung",
                  "display": "concept_beschreibung"
                },
                "value": "CDA Dokument entsprechend den Vorgaben des Allgemeinen Implementierungsleitfadens f\u00fcr ELGA Dokumente (EIS Basic) v2-06.2"
              }
            ]
          },
          {
            "code": "urn:elga:dissum-n:2015-v2.06:EIS_Basic",
            "display": "ELGA Entlassungsbrief Pflege, EIS Basic v2.06",
            "designation": [
              {
                "use": {
                  "system": "https://termgit.elga.gv.at/CodeSystem-austrian-designation-use",
                  "code": "hinweise",
                  "display": "hinweise"
                },
                "value": "Gilt f\u00fcr EIS Basic und Structured"
              }
            ]
          },
          {
            "code": "urn:elga:dissum-n:2015-v2.06:EIS_Enhanced",
            "display": "ELGA Entlassungsbrief Pflege, EIS Enhanced v2.06"
          },
          {
            "code": "urn:elga:dissum-n:2015-v2.06:EIS_FullSupport",
            "display": "ELGA Entlassungsbrief Pflege, EIS Full Support v2.06"
          },
          {
            "code": "urn:elga:dissum-n:2015:EIS_Basic",
            "display": "ELGA Entlassungsbrief Pflege, EIS Basic",
            "designation": [
              {
                "use": {
                  "system": "https://termgit.elga.gv.at/CodeSystem-austrian-designation-use",
                  "code": "hinweise",
                  "display": "hinweise"
                },
                "value": "Gilt f\u00fcr EIS Basic und Structured"
              }
            ]
          },
          {
            "code": "urn:elga:dissum-n:2015:EIS_Enhanced",
            "display": "ELGA Entlassungsbrief Pflege, EIS Enhanced"
          },
          {
            "code": "urn:elga:dissum-n:2015:EIS_FullSupport",
            "display": "ELGA Entlassungsbrief Pflege, EIS Full Support"
          },
          {
            "code": "urn:elga:dissum-n:2017-v2.06.2:EIS_Basic",
            "display": "ELGA Entlassungsbrief Pflege, EIS Basic v2.06.2",
            "designation": [
              {
                "use": {
                  "system": "https://termgit.elga.gv.at/CodeSystem-austrian-designation-use",
                  "code": "hinweise",
                  "display": "hinweise"
                },
                "value": "Gilt f\u00fcr EIS Basic und Structured"
              }
            ]
          },
          {
            "code": "urn:elga:dissum-n:2017-v2.06.2:EIS_Enhanced",
            "display": "ELGA Entlassungsbrief Pflege, EIS Enhanced v2.06.2"
          },
          {
            "code": "urn:elga:dissum-n:2017-v2.06.2:EIS_FullSupport",
            "display": "ELGA Entlassungsbrief Pflege, EIS Full Support v2.06.2"
          },
          {
            "code": "urn:elga:dissum:2015-v2.06:EIS_Basic",
            "display": "ELGA Entlassungsbrief \u00c4rztlich, EIS Basic v2.06",
            "designation": [
              {
                "use": {
                  "system": "https://termgit.elga.gv.at/CodeSystem-austrian-designation-use",
                  "code": "hinweise",
                  "display": "hinweise"
                },
                "value": "Gilt f\u00fcr EIS Basic und Structured"
              }
            ]
          },
          {
            "code": "urn:elga:dissum:2015-v2.06:EIS_Enhanced",
            "display": "ELGA Entlassungsbrief \u00c4rztlich, EIS Enhanced v2.06"
          },
          {
            "code": "urn:elga:dissum:2015-v2.06:EIS_FullSupport",
            "display": "ELGA Entlassungsbrief \u00c4rztlich, EIS Full Support v2.06"
          },
          {
            "code": "urn:elga:dissum:2015:EIS_Basic",
            "display": "ELGA Entlassungsbrief \u00c4rztlich, EIS Basic",
            "designation": [
              {
                "use": {
                  "system": "https://termgit.elga.gv.at/CodeSystem-austrian-designation-use",
                  "code": "hinweise",
                  "display": "hinweise"
                },
                "value": "Gilt f\u00fcr EIS Basic und Structured"
              }
            ]
          },
          {
            "code": "urn:elga:dissum:2015:EIS_Enhanced",
            "display": "ELGA Entlassungsbrief \u00c4rztlich, EIS Enhanced"
          },
          {
            "code": "urn:elga:dissum:2015:EIS_FullSupport",
            "display": "ELGA Entlassungsbrief \u00c4rztlich, EIS Full Support"
          },
          {
            "code": "urn:elga:dissum:2017-v2.06.2:EIS_Basic",
            "display": "ELGA Entlassungsbrief \u00c4rztlich, EIS Basic v2.06.2",
            "designation": [
              {
                "use": {
                  "system": "https://termgit.elga.gv.at/CodeSystem-austrian-designation-use",
                  "code": "hinweise",
                  "display": "hinweise"
                },
                "value": "Gilt f\u00fcr EIS Basic und Structured"
              }
            ]
          },
          {
            "code": "urn:elga:dissum:2017-v2.06.2:EIS_Enhanced",
            "display": "ELGA Entlassungsbrief \u00c4rztlich, EIS Enhanced v2.06.2"
          },
          {
            "code": "urn:elga:dissum:2017-v2.06.2:EIS_FullSupport",
            "display": "ELGA Entlassungsbrief \u00c4rztlich, EIS Full Support v2.06.2"
          },
          {
            "code": "urn:elga:emedat:2015",
            "display": "ELGA e-Medikation",
            "designation": [
              {
                "use": {
                  "system": "https://termgit.elga.gv.at/CodeSystem-austrian-designation-use",
                  "code": "hinweise",
                  "display": "hinweise"
                },
                "value": "CDA f\u00fcr eMedikation sind nur in EIS Full Support zul\u00e4ssig"
              }
            ]
          },
          {
            "code": "urn:elga:emedat:2015-v2.06",
            "display": "ELGA e-Medikation v2.06"
          },
          {
            "code": "urn:elga:lab:2015-v2.06:EIS_Basic",
            "display": "ELGA Laborbefund, EIS Basic v2.06",
            "designation": [
              {
                "use": {
                  "system": "https://termgit.elga.gv.at/CodeSystem-austrian-designation-use",
                  "code": "hinweise",
                  "display": "hinweise"
                },
                "value": "Gilt f\u00fcr EIS Basic und Structured"
              }
            ]
          },
          {
            "code": "urn:elga:lab:2015-v2.06:EIS_Enhanced",
            "display": "ELGA Laborbefund, EIS Enhanced v2.06"
          },
          {
            "code": "urn:elga:lab:2015-v2.06:EIS_FullSupport",
            "display": "ELGA Laborbefund, EIS Full Support v2.06"
          },
          {
            "code": "urn:elga:lab:2015:EIS_Basic",
            "display": "ELGA Laborbefund, EIS Basic",
            "designation": [
              {
                "use": {
                  "system": "https://termgit.elga.gv.at/CodeSystem-austrian-designation-use",
                  "code": "hinweise",
                  "display": "hinweise"
                },
                "value": "Gilt f\u00fcr EIS Basic und Structured"
              }
            ]
          },
          {
            "code": "urn:elga:lab:2015:EIS_Enhanced",
            "display": "ELGA Laborbefund, EIS Enhanced"
          },
          {
            "code": "urn:elga:lab:2015:EIS_FullSupport",
            "display": "ELGA Laborbefund, EIS Full Support"
          },
          {
            "code": "urn:elga:lab:2017-v2.06.2:EIS_Basic",
            "display": "ELGA Laborbefund, EIS Basic v2.06.2",
            "designation": [
              {
                "use": {
                  "system": "https://termgit.elga.gv.at/CodeSystem-austrian-designation-use",
                  "code": "hinweise",
                  "display": "hinweise"
                },
                "value": "Gilt f\u00fcr EIS Basic und Structured"
              }
            ]
          },
          {
            "code": "urn:elga:lab:2017-v2.06.2:EIS_Enhanced",
            "display": "ELGA Laborbefund, EIS Enhanced v2.06.2"
          },
          {
            "code": "urn:elga:lab:2017-v2.06.2:EIS_FullSupport",
            "display": "ELGA Laborbefund, EIS Full Support v2.06.2"
          },
          {
            "code": "urn:elga:nurse-tf:2015-v2.06:EIS_Basic",
            "display": "ELGA Pflegesituationsbericht, EIS Basic v2.06"
          },
          {
            "code": "urn:elga:nurse-tf:2015-v2.06:EIS_Enhanced",
            "display": "ELGA Pflegesituationsbericht, EIS Enhanced v2.06"
          },
          {
            "code": "urn:elga:nurse-tf:2015-v2.06:EIS_FullSupport",
            "display": "ELGA Pflegesituationsbericht, EIS Full Support v2.06"
          },
          {
            "code": "urn:elga:nurse-tf:2017-v2.06.2:EIS_Basic",
            "display": "ELGA Pflegesituationsbericht, EIS Basic v2.06.2"
          },
          {
            "code": "urn:elga:nurse-tf:2017-v2.06.2:EIS_Enhanced",
            "display": "ELGA Pflegesituationsbericht, EIS Enhanced v2.06.2"
          },
          {
            "code": "urn:elga:nurse-tf:2017-v2.06.2:EIS_FullSupport",
            "display": "ELGA Pflegesituationsbericht, EIS Full Support v2.06.2"
          },
          {
            "code": "urn:elga:radio:2015-v2.06:EIS_Basic",
            "display": "ELGA Befund bildgebende Diagnostik, EIS Basic v2.06",
            "designation": [
              {
                "use": {
                  "system": "https://termgit.elga.gv.at/CodeSystem-austrian-designation-use",
                  "code": "hinweise",
                  "display": "hinweise"
                },
                "value": "Gilt f\u00fcr EIS Basic und Structured"
              }
            ]
          },
          {
            "code": "urn:elga:radio:2015-v2.06:EIS_Enhanced",
            "display": "ELGA Befund bildgebende Diagnostik, EIS Enhanced v2.06"
          },
          {
            "code": "urn:elga:radio:2015-v2.06:EIS_FullSupport",
            "display": "ELGA Befund bildgebende Diagnostik, EIS Full Support v2.06"
          },
          {
            "code": "urn:elga:radio:2015:EIS_Basic",
            "display": "ELGA Befund bildgebende Diagnostik, EIS Basic",
            "designation": [
              {
                "use": {
                  "system": "https://termgit.elga.gv.at/CodeSystem-austrian-designation-use",
                  "code": "hinweise",
                  "display": "hinweise"
                },
                "value": "Gilt f\u00fcr EIS Basic und Structured"
              }
            ]
          },
          {
            "code": "urn:elga:radio:2015:EIS_Enhanced",
            "display": "ELGA Befund bildgebende Diagnostik, EIS Enhanced"
          },
          {
            "code": "urn:elga:radio:2015:EIS_FullSupport",
            "display": "ELGA Befund bildgebende Diagnostik,EIS Full Support"
          },
          {
            "code": "urn:elga:radio:2017-v2.06.2:EIS_Basic",
            "display": "ELGA Befund bildgebende Diagnostik, EIS Basic v2.06.2",
            "designation": [
              {
                "use": {
                  "system": "https://termgit.elga.gv.at/CodeSystem-austrian-designation-use",
                  "code": "hinweise",
                  "display": "hinweise"
                },
                "value": "Gilt f\u00fcr EIS Basic und Structured"
              }
            ]
          },
          {
            "code": "urn:elga:radio:2017-v2.06.2:EIS_Enhanced",
            "display": "ELGA Befund bildgebende Diagnostik, EIS Enhanced v2.06.2"
          },
          {
            "code": "urn:elga:radio:2017-v2.06.2:EIS_FullSupport",
            "display": "ELGA Befund bildgebende Diagnostik, EIS Full Support v2.06.2"
          },
          {
            "code": "urn:hl7-at:eImpf:2019",
            "display": "HL7 Austria e-Impfpass 2019"
          },
          {
            "code": "urn:hl7-at:telemon-epi:1.2.0+20210304",
            "display": "HL7 Austria Telemonitoring Episodenbericht 1.2.0+20210304"
          },
          {
            "code": "urn:hl7-at:arztb:1.2.0+20210304:EIS_Enhanced",
            "display": "HL7 Austria Arztbrief 1.2.0+20210304, EIS Enhanced"
          },
          {
            "code": "urn:hl7-at:arztb:1.2.0+20210304:EIS_Enhanced+",
            "display": "HL7 Austria Arztbrief 1.2.0+20210304, EIS Enhanced+"
          },
          {
            "code": "urn:hl7-at:arztb:1.2.0+20210304:EIS_FullSupport",
            "display": "HL7 Austria Arztbrief 1.2.0+20210304, EIS FullSupport"
          },
          {
            "code": "urn:hl7-at:arztb:1.2.0+20210304:EIS_FullSupport+",
            "display": "HL7 Austria Arztbrief 1.2.0+20210304, EIS FullSupport+"
          },
          {
            "code": "urn:hl7-at:lab:3.0.0+20211214",
            "display": "HL7 Austria Labor- und Mikrobiologiebefund 3.0.0+20211214"
          },
          {
            "code": "urn:hl7-at:eImpf:1.3.0+20220127",
            "display": "HL7 Austria e-Impfpass 1.3.0+20220127"
          },
          {
            "code": "urn:hl7-at:eImpf:1.2.0+20220103",
            "display": "HL7 Austria e-Impfpass 1.2.0+20220103"
          },
          {
            "code": "urn:hl7-at:eImpf:1.1.1+20210601",
            "display": "HL7 Austria e-Impfpass 1.1.1+20210601"
          },
          {
            "code": "urn:hl7-at:eImpf:1.1.0+20210512",
            "display": "HL7 Austria e-Impfpass 1.1.0+20210512"
          },
          {
            "code": "urn:hl7-at:arztb:1.3.0+20220209:EIS_Enhanced",
            "display": "HL7 Austria Arztbrief 1.3.0+20220209, EIS Enhanced"
          },
          {
            "code": "urn:hl7-at:arztb:1.3.0+20220209:EIS_Enhanced+",
            "display": "HL7 Austria Arztbrief 1.3.0+20220209, EIS Enhanced+"
          },
          {
            "code": "urn:hl7-at:arztb:1.3.0+20220209:EIS_FullSupport",
            "display": "HL7 Austria Arztbrief 1.3.0+20220209, EIS FullSupport"
          },
          {
            "code": "urn:hl7-at:arztb:1.3.0+20220209:EIS_FullSupport+",
            "display": "HL7 Austria Arztbrief 1.3.0+20220209, EIS FullSupport+"
          }
        ]
      }
    ]
  },
  "expansion": {
    "timestamp": "2022-09-13T14:16:50Z",
    "contains": [
      {
        "system": "https://termgit.elga.gv.at/CodeSystem-elga-formatcode",
        "code": "urn:elga:2015-v2.06:EIS_Basic",
        "display": "ELGA Dokument v2.06",
        "designation": [
          {
            "use": {
              "system": "https://termgit.elga.gv.at/CodeSystem-austrian-designation-use",
              "code": "concept_beschreibung",
              "display": "concept_beschreibung"
            },
            "value": "CDA Dokument entsprechend den Vorgaben des Allgemeinen Implementierungsleitfadens f\u00fcr ELGA Dokumente (EIS Basic) v2-06"
          }
        ]
      },
      {
        "system": "https://termgit.elga.gv.at/CodeSystem-elga-formatcode",
        "code": "urn:elga:2015:EIS_Basic",
        "display": "ELGA Dokument",
        "designation": [
          {
            "use": {
              "system": "https://termgit.elga.gv.at/CodeSystem-austrian-designation-use",
              "code": "concept_beschreibung",
              "display": "concept_beschreibung"
            },
            "value": "CDA Dokument entsprechend den Vorgaben des Allgemeinen Implementierungsleitfadens f\u00fcr ELGA Dokumente (EIS Basic)"
          }
        ]
      },
      {
        "system": "https://termgit.elga.gv.at/CodeSystem-elga-formatcode",
        "code": "urn:elga:2016-v2.06.1:EIS_Basic",
        "display": "ELGA Dokument v2.06.1",
        "designation": [
          {
            "language": "de-AT",
            "value": "ELGA Dokument v2.06"
          },
          {
            "use": {
              "system": "https://termgit.elga.gv.at/CodeSystem-austrian-designation-use",
              "code": "concept_beschreibung",
              "display": "concept_beschreibung"
            },
            "value": "CDA Dokument entsprechend den Vorgaben des Allgemeinen Implementierungsleitfadens f\u00fcr ELGA Dokumente (EIS Basic) v2-06.1"
          }
        ]
      },
      {
        "system": "https://termgit.elga.gv.at/CodeSystem-elga-formatcode",
        "code": "urn:elga:2017-v2.06.2:EIS_Basic",
        "display": "ELGA Dokument v2.06.2",
        "designation": [
          {
            "language": "de-AT",
            "value": "ELGA Dokument v2.06"
          },
          {
            "use": {
              "system": "https://termgit.elga.gv.at/CodeSystem-austrian-designation-use",
              "code": "concept_beschreibung",
              "display": "concept_beschreibung"
            },
            "value": "CDA Dokument entsprechend den Vorgaben des Allgemeinen Implementierungsleitfadens f\u00fcr ELGA Dokumente (EIS Basic) v2-06.2"
          }
        ]
      },
      {
        "system": "https://termgit.elga.gv.at/CodeSystem-elga-formatcode",
        "code": "urn:elga:dissum-n:2015-v2.06:EIS_Basic",
        "display": "ELGA Entlassungsbrief Pflege, EIS Basic v2.06",
        "designation": [
          {
            "use": {
              "system": "https://termgit.elga.gv.at/CodeSystem-austrian-designation-use",
              "code": "hinweise",
              "display": "hinweise"
            },
            "value": "Gilt f\u00fcr EIS Basic und Structured"
          }
        ]
      },
      {
        "system": "https://termgit.elga.gv.at/CodeSystem-elga-formatcode",
        "code": "urn:elga:dissum-n:2015-v2.06:EIS_Enhanced",
        "display": "ELGA Entlassungsbrief Pflege, EIS Enhanced v2.06"
      },
      {
        "system": "https://termgit.elga.gv.at/CodeSystem-elga-formatcode",
        "code": "urn:elga:dissum-n:2015-v2.06:EIS_FullSupport",
        "display": "ELGA Entlassungsbrief Pflege, EIS Full Support v2.06"
      },
      {
        "system": "https://termgit.elga.gv.at/CodeSystem-elga-formatcode",
        "code": "urn:elga:dissum-n:2015:EIS_Basic",
        "display": "ELGA Entlassungsbrief Pflege, EIS Basic",
        "designation": [
          {
            "use": {
              "system": "https://termgit.elga.gv.at/CodeSystem-austrian-designation-use",
              "code": "hinweise",
              "display": "hinweise"
            },
            "value": "Gilt f\u00fcr EIS Basic und Structured"
          }
        ]
      },
      {
        "system": "https://termgit.elga.gv.at/CodeSystem-elga-formatcode",
        "code": "urn:elga:dissum-n:2015:EIS_Enhanced",
        "display": "ELGA Entlassungsbrief Pflege, EIS Enhanced"
      },
      {
        "system": "https://termgit.elga.gv.at/CodeSystem-elga-formatcode",
        "code": "urn:elga:dissum-n:2015:EIS_FullSupport",
        "display": "ELGA Entlassungsbrief Pflege, EIS Full Support"
      },
      {
        "system": "https://termgit.elga.gv.at/CodeSystem-elga-formatcode",
        "code": "urn:elga:dissum-n:2017-v2.06.2:EIS_Basic",
        "display": "ELGA Entlassungsbrief Pflege, EIS Basic v2.06.2",
        "designation": [
          {
            "use": {
              "system": "https://termgit.elga.gv.at/CodeSystem-austrian-designation-use",
              "code": "hinweise",
              "display": "hinweise"
            },
            "value": "Gilt f\u00fcr EIS Basic und Structured"
          }
        ]
      },
      {
        "system": "https://termgit.elga.gv.at/CodeSystem-elga-formatcode",
        "code": "urn:elga:dissum-n:2017-v2.06.2:EIS_Enhanced",
        "display": "ELGA Entlassungsbrief Pflege, EIS Enhanced v2.06.2"
      },
      {
        "system": "https://termgit.elga.gv.at/CodeSystem-elga-formatcode",
        "code": "urn:elga:dissum-n:2017-v2.06.2:EIS_FullSupport",
        "display": "ELGA Entlassungsbrief Pflege, EIS Full Support v2.06.2"
      },
      {
        "system": "https://termgit.elga.gv.at/CodeSystem-elga-formatcode",
        "code": "urn:elga:dissum:2015-v2.06:EIS_Basic",
        "display": "ELGA Entlassungsbrief \u00c4rztlich, EIS Basic v2.06",
        "designation": [
          {
            "use": {
              "system": "https://termgit.elga.gv.at/CodeSystem-austrian-designation-use",
              "code": "hinweise",
              "display": "hinweise"
            },
            "value": "Gilt f\u00fcr EIS Basic und Structured"
          }
        ]
      },
      {
        "system": "https://termgit.elga.gv.at/CodeSystem-elga-formatcode",
        "code": "urn:elga:dissum:2015-v2.06:EIS_Enhanced",
        "display": "ELGA Entlassungsbrief \u00c4rztlich, EIS Enhanced v2.06"
      },
      {
        "system": "https://termgit.elga.gv.at/CodeSystem-elga-formatcode",
        "code": "urn:elga:dissum:2015-v2.06:EIS_FullSupport",
        "display": "ELGA Entlassungsbrief \u00c4rztlich, EIS Full Support v2.06"
      },
      {
        "system": "https://termgit.elga.gv.at/CodeSystem-elga-formatcode",
        "code": "urn:elga:dissum:2015:EIS_Basic",
        "display": "ELGA Entlassungsbrief \u00c4rztlich, EIS Basic",
        "designation": [
          {
            "use": {
              "system": "https://termgit.elga.gv.at/CodeSystem-austrian-designation-use",
              "code": "hinweise",
              "display": "hinweise"
            },
            "value": "Gilt f\u00fcr EIS Basic und Structured"
          }
        ]
      },
      {
        "system": "https://termgit.elga.gv.at/CodeSystem-elga-formatcode",
        "code": "urn:elga:dissum:2015:EIS_Enhanced",
        "display": "ELGA Entlassungsbrief \u00c4rztlich, EIS Enhanced"
      },
      {
        "system": "https://termgit.elga.gv.at/CodeSystem-elga-formatcode",
        "code": "urn:elga:dissum:2015:EIS_FullSupport",
        "display": "ELGA Entlassungsbrief \u00c4rztlich, EIS Full Support"
      },
      {
        "system": "https://termgit.elga.gv.at/CodeSystem-elga-formatcode",
        "code": "urn:elga:dissum:2017-v2.06.2:EIS_Basic",
        "display": "ELGA Entlassungsbrief \u00c4rztlich, EIS Basic v2.06.2",
        "designation": [
          {
            "use": {
              "system": "https://termgit.elga.gv.at/CodeSystem-austrian-designation-use",
              "code": "hinweise",
              "display": "hinweise"
            },
            "value": "Gilt f\u00fcr EIS Basic und Structured"
          }
        ]
      },
      {
        "system": "https://termgit.elga.gv.at/CodeSystem-elga-formatcode",
        "code": "urn:elga:dissum:2017-v2.06.2:EIS_Enhanced",
        "display": "ELGA Entlassungsbrief \u00c4rztlich, EIS Enhanced v2.06.2"
      },
      {
        "system": "https://termgit.elga.gv.at/CodeSystem-elga-formatcode",
        "code": "urn:elga:dissum:2017-v2.06.2:EIS_FullSupport",
        "display": "ELGA Entlassungsbrief \u00c4rztlich, EIS Full Support v2.06.2"
      },
      {
        "system": "https://termgit.elga.gv.at/CodeSystem-elga-formatcode",
        "code": "urn:elga:emedat:2015",
        "display": "ELGA e-Medikation",
        "designation": [
          {
            "use": {
              "system": "https://termgit.elga.gv.at/CodeSystem-austrian-designation-use",
              "code": "hinweise",
              "display": "hinweise"
            },
            "value": "CDA f\u00fcr eMedikation sind nur in EIS Full Support zul\u00e4ssig"
          }
        ]
      },
      {
        "system": "https://termgit.elga.gv.at/CodeSystem-elga-formatcode",
        "code": "urn:elga:emedat:2015-v2.06",
        "display": "ELGA e-Medikation v2.06"
      },
      {
        "system": "https://termgit.elga.gv.at/CodeSystem-elga-formatcode",
        "code": "urn:elga:lab:2015-v2.06:EIS_Basic",
        "display": "ELGA Laborbefund, EIS Basic v2.06",
        "designation": [
          {
            "use": {
              "system": "https://termgit.elga.gv.at/CodeSystem-austrian-designation-use",
              "code": "hinweise",
              "display": "hinweise"
            },
            "value": "Gilt f\u00fcr EIS Basic und Structured"
          }
        ]
      },
      {
        "system": "https://termgit.elga.gv.at/CodeSystem-elga-formatcode",
        "code": "urn:elga:lab:2015-v2.06:EIS_Enhanced",
        "display": "ELGA Laborbefund, EIS Enhanced v2.06"
      },
      {
        "system": "https://termgit.elga.gv.at/CodeSystem-elga-formatcode",
        "code": "urn:elga:lab:2015-v2.06:EIS_FullSupport",
        "display": "ELGA Laborbefund, EIS Full Support v2.06"
      },
      {
        "system": "https://termgit.elga.gv.at/CodeSystem-elga-formatcode",
        "code": "urn:elga:lab:2015:EIS_Basic",
        "display": "ELGA Laborbefund, EIS Basic",
        "designation": [
          {
            "use": {
              "system": "https://termgit.elga.gv.at/CodeSystem-austrian-designation-use",
              "code": "hinweise",
              "display": "hinweise"
            },
            "value": "Gilt f\u00fcr EIS Basic und Structured"
          }
        ]
      },
      {
        "system": "https://termgit.elga.gv.at/CodeSystem-elga-formatcode",
        "code": "urn:elga:lab:2015:EIS_Enhanced",
        "display": "ELGA Laborbefund, EIS Enhanced"
      },
      {
        "system": "https://termgit.elga.gv.at/CodeSystem-elga-formatcode",
        "code": "urn:elga:lab:2015:EIS_FullSupport",
        "display": "ELGA Laborbefund, EIS Full Support"
      },
      {
        "system": "https://termgit.elga.gv.at/CodeSystem-elga-formatcode",
        "code": "urn:elga:lab:2017-v2.06.2:EIS_Basic",
        "display": "ELGA Laborbefund, EIS Basic v2.06.2",
        "designation": [
          {
            "use": {
              "system": "https://termgit.elga.gv.at/CodeSystem-austrian-designation-use",
              "code": "hinweise",
              "display": "hinweise"
            },
            "value": "Gilt f\u00fcr EIS Basic und Structured"
          }
        ]
      },
      {
        "system": "https://termgit.elga.gv.at/CodeSystem-elga-formatcode",
        "code": "urn:elga:lab:2017-v2.06.2:EIS_Enhanced",
        "display": "ELGA Laborbefund, EIS Enhanced v2.06.2"
      },
      {
        "system": "https://termgit.elga.gv.at/CodeSystem-elga-formatcode",
        "code": "urn:elga:lab:2017-v2.06.2:EIS_FullSupport",
        "display": "ELGA Laborbefund, EIS Full Support v2.06.2"
      },
      {
        "system": "https://termgit.elga.gv.at/CodeSystem-elga-formatcode",
        "code": "urn:elga:nurse-tf:2015-v2.06:EIS_Basic",
        "display": "ELGA Pflegesituationsbericht, EIS Basic v2.06"
      },
      {
        "system": "https://termgit.elga.gv.at/CodeSystem-elga-formatcode",
        "code": "urn:elga:nurse-tf:2015-v2.06:EIS_Enhanced",
        "display": "ELGA Pflegesituationsbericht, EIS Enhanced v2.06"
      },
      {
        "system": "https://termgit.elga.gv.at/CodeSystem-elga-formatcode",
        "code": "urn:elga:nurse-tf:2015-v2.06:EIS_FullSupport",
        "display": "ELGA Pflegesituationsbericht, EIS Full Support v2.06"
      },
      {
        "system": "https://termgit.elga.gv.at/CodeSystem-elga-formatcode",
        "code": "urn:elga:nurse-tf:2017-v2.06.2:EIS_Basic",
        "display": "ELGA Pflegesituationsbericht, EIS Basic v2.06.2"
      },
      {
        "system": "https://termgit.elga.gv.at/CodeSystem-elga-formatcode",
        "code": "urn:elga:nurse-tf:2017-v2.06.2:EIS_Enhanced",
        "display": "ELGA Pflegesituationsbericht, EIS Enhanced v2.06.2"
      },
      {
        "system": "https://termgit.elga.gv.at/CodeSystem-elga-formatcode",
        "code": "urn:elga:nurse-tf:2017-v2.06.2:EIS_FullSupport",
        "display": "ELGA Pflegesituationsbericht, EIS Full Support v2.06.2"
      },
      {
        "system": "https://termgit.elga.gv.at/CodeSystem-elga-formatcode",
        "code": "urn:elga:radio:2015-v2.06:EIS_Basic",
        "display": "ELGA Befund bildgebende Diagnostik, EIS Basic v2.06",
        "designation": [
          {
            "use": {
              "system": "https://termgit.elga.gv.at/CodeSystem-austrian-designation-use",
              "code": "hinweise",
              "display": "hinweise"
            },
            "value": "Gilt f\u00fcr EIS Basic und Structured"
          }
        ]
      },
      {
        "system": "https://termgit.elga.gv.at/CodeSystem-elga-formatcode",
        "code": "urn:elga:radio:2015-v2.06:EIS_Enhanced",
        "display": "ELGA Befund bildgebende Diagnostik, EIS Enhanced v2.06"
      },
      {
        "system": "https://termgit.elga.gv.at/CodeSystem-elga-formatcode",
        "code": "urn:elga:radio:2015-v2.06:EIS_FullSupport",
        "display": "ELGA Befund bildgebende Diagnostik, EIS Full Support v2.06"
      },
      {
        "system": "https://termgit.elga.gv.at/CodeSystem-elga-formatcode",
        "code": "urn:elga:radio:2015:EIS_Basic",
        "display": "ELGA Befund bildgebende Diagnostik, EIS Basic",
        "designation": [
          {
            "use": {
              "system": "https://termgit.elga.gv.at/CodeSystem-austrian-designation-use",
              "code": "hinweise",
              "display": "hinweise"
            },
            "value": "Gilt f\u00fcr EIS Basic und Structured"
          }
        ]
      },
      {
        "system": "https://termgit.elga.gv.at/CodeSystem-elga-formatcode",
        "code": "urn:elga:radio:2015:EIS_Enhanced",
        "display": "ELGA Befund bildgebende Diagnostik, EIS Enhanced"
      },
      {
        "system": "https://termgit.elga.gv.at/CodeSystem-elga-formatcode",
        "code": "urn:elga:radio:2015:EIS_FullSupport",
        "display": "ELGA Befund bildgebende Diagnostik,EIS Full Support"
      },
      {
        "system": "https://termgit.elga.gv.at/CodeSystem-elga-formatcode",
        "code": "urn:elga:radio:2017-v2.06.2:EIS_Basic",
        "display": "ELGA Befund bildgebende Diagnostik, EIS Basic v2.06.2",
        "designation": [
          {
            "use": {
              "system": "https://termgit.elga.gv.at/CodeSystem-austrian-designation-use",
              "code": "hinweise",
              "display": "hinweise"
            },
            "value": "Gilt f\u00fcr EIS Basic und Structured"
          }
        ]
      },
      {
        "system": "https://termgit.elga.gv.at/CodeSystem-elga-formatcode",
        "code": "urn:elga:radio:2017-v2.06.2:EIS_Enhanced",
        "display": "ELGA Befund bildgebende Diagnostik, EIS Enhanced v2.06.2"
      },
      {
        "system": "https://termgit.elga.gv.at/CodeSystem-elga-formatcode",
        "code": "urn:elga:radio:2017-v2.06.2:EIS_FullSupport",
        "display": "ELGA Befund bildgebende Diagnostik, EIS Full Support v2.06.2"
      },
      {
        "system": "https://termgit.elga.gv.at/CodeSystem-elga-formatcode",
        "code": "urn:hl7-at:eImpf:2019",
        "display": "HL7 Austria e-Impfpass 2019"
      },
      {
        "system": "https://termgit.elga.gv.at/CodeSystem-elga-formatcode",
        "code": "urn:hl7-at:telemon-epi:1.2.0+20210304",
        "display": "HL7 Austria Telemonitoring Episodenbericht 1.2.0+20210304"
      },
      {
        "system": "https://termgit.elga.gv.at/CodeSystem-elga-formatcode",
        "code": "urn:hl7-at:arztb:1.2.0+20210304:EIS_Enhanced",
        "display": "HL7 Austria Arztbrief 1.2.0+20210304, EIS Enhanced"
      },
      {
        "system": "https://termgit.elga.gv.at/CodeSystem-elga-formatcode",
        "code": "urn:hl7-at:arztb:1.2.0+20210304:EIS_Enhanced+",
        "display": "HL7 Austria Arztbrief 1.2.0+20210304, EIS Enhanced+"
      },
      {
        "system": "https://termgit.elga.gv.at/CodeSystem-elga-formatcode",
        "code": "urn:hl7-at:arztb:1.2.0+20210304:EIS_FullSupport",
        "display": "HL7 Austria Arztbrief 1.2.0+20210304, EIS FullSupport"
      },
      {
        "system": "https://termgit.elga.gv.at/CodeSystem-elga-formatcode",
        "code": "urn:hl7-at:arztb:1.2.0+20210304:EIS_FullSupport+",
        "display": "HL7 Austria Arztbrief 1.2.0+20210304, EIS FullSupport+"
      },
      {
        "system": "https://termgit.elga.gv.at/CodeSystem-elga-formatcode",
        "code": "urn:hl7-at:lab:3.0.0+20211214",
        "display": "HL7 Austria Labor- und Mikrobiologiebefund 3.0.0+20211214"
      },
      {
        "system": "https://termgit.elga.gv.at/CodeSystem-elga-formatcode",
        "code": "urn:hl7-at:eImpf:1.3.0+20220127",
        "display": "HL7 Austria e-Impfpass 1.3.0+20220127"
      },
      {
        "system": "https://termgit.elga.gv.at/CodeSystem-elga-formatcode",
        "code": "urn:hl7-at:eImpf:1.2.0+20220103",
        "display": "HL7 Austria e-Impfpass 1.2.0+20220103"
      },
      {
        "system": "https://termgit.elga.gv.at/CodeSystem-elga-formatcode",
        "code": "urn:hl7-at:eImpf:1.1.1+20210601",
        "display": "HL7 Austria e-Impfpass 1.1.1+20210601"
      },
      {
        "system": "https://termgit.elga.gv.at/CodeSystem-elga-formatcode",
        "code": "urn:hl7-at:eImpf:1.1.0+20210512",
        "display": "HL7 Austria e-Impfpass 1.1.0+20210512"
      },
      {
        "system": "https://termgit.elga.gv.at/CodeSystem-elga-formatcode",
        "code": "urn:hl7-at:arztb:1.3.0+20220209:EIS_Enhanced",
        "display": "HL7 Austria Arztbrief 1.3.0+20220209, EIS Enhanced"
      },
      {
        "system": "https://termgit.elga.gv.at/CodeSystem-elga-formatcode",
        "code": "urn:hl7-at:arztb:1.3.0+20220209:EIS_Enhanced+",
        "display": "HL7 Austria Arztbrief 1.3.0+20220209, EIS Enhanced+"
      },
      {
        "system": "https://termgit.elga.gv.at/CodeSystem-elga-formatcode",
        "code": "urn:hl7-at:arztb:1.3.0+20220209:EIS_FullSupport",
        "display": "HL7 Austria Arztbrief 1.3.0+20220209, EIS FullSupport"
      },
      {
        "system": "https://termgit.elga.gv.at/CodeSystem-elga-formatcode",
        "code": "urn:hl7-at:arztb:1.3.0+20220209:EIS_FullSupport+",
        "display": "HL7 Austria Arztbrief 1.3.0+20220209, EIS FullSupport+"
      }
    ]
  }
}