'code';'codeSystem';'displayName';'parentCodeSystemName';'concept_Beschreibung';'meaning';'hints';'orderNumber';'level';'type';'relationships';'einheit print';'einheit codiert'
'ESP';'2.16.840.1.113883.5.60';'Expressed spoken';'https://termgit.elga.gv.at/CodeSystem-hl7-languageabilitymode';'';'spricht';'';'1';'0';'L';'';'';''
'EWR';'2.16.840.1.113883.5.60';'Expressed written';'https://termgit.elga.gv.at/CodeSystem-hl7-languageabilitymode';'';'schreibt';'';'2';'0';'L';'';'';''
'RSP';'2.16.840.1.113883.5.60';'Received spoken';'https://termgit.elga.gv.at/CodeSystem-hl7-languageabilitymode';'';'versteht gesprochen';'';'3';'0';'L';'';'';''
'RWR';'2.16.840.1.113883.5.60';'Received written';'https://termgit.elga.gv.at/CodeSystem-hl7-languageabilitymode';'';'versteht geschrieben';'';'4';'0';'L';'';'';''
