'code';'codeSystem';'displayName';'parentCode';'concept_Beschreibung';'meaning';'hints';'level';'type';'relationships'
'0';'1.2.40.0.34.5.151';'PAP Transaction';'';'PAP spezifische Audit Events';'';'';'0';'S';''
'1';'1.2.40.0.34.5.151';'Submit Policy';'';'';'Generelle Policy einbringen';'';'1';'L';''
'2';'1.2.40.0.34.5.151';'Access Policy';'';'';'Generelle Policy verwenden';'';'1';'L';''
'3';'1.2.40.0.34.5.151';'Deprecate Policy';'';'';'Generelle Policy ungültig setzen';'';'1';'L';''
'4';'1.2.40.0.34.5.151';'Submit Consent';'';'';'Patientenzustimmung einbringen';'';'1';'L';''
'5';'1.2.40.0.34.5.151';'Query Consent';'';'';'Patientenzustimmung abfragen';'';'1';'L';''
'6';'1.2.40.0.34.5.151';'Consent Submission Failed';'';'';'Patientenzustimmung konnte nicht eingebracht werden';'';'1';'L';''
'10';'1.2.40.0.34.5.151';'KBS';'';'ELGA Kontaktbestätigungsservice Audit Events';'';'';'0';'S';''
'11';'1.2.40.0.34.5.151';'Add Contact';'';'';'Kontaktbestätigung einbringen';'';'1';'L';''
'12';'1.2.40.0.34.5.151';'List Contacts';'';'';'Kontaktbestätigungen anzeigen';'';'1';'L';''
'13';'1.2.40.0.34.5.151';'Get Active Contact';'';'';'Aktive Kontaktbestätigung holen';'';'1';'L';''
'14';'1.2.40.0.34.5.151';'Delegate Contact';'';'';'Kontaktbestätigung delegieren';'';'1';'L';''
'15';'1.2.40.0.34.5.151';'Invalidate Contact';'';'';'Kontaktbestätigung stornieren';'';'1';'L';''
'20';'1.2.40.0.34.5.151';'ETS';'';'ELGA Token Service Audit Events';'';'';'0';'S';''
'21';'1.2.40.0.34.5.151';'Issue Token';'';'';'Token ausstellen';'';'1';'L';''
'22';'1.2.40.0.34.5.151';'Invalidate Token';'';'';'Token ungültig setzen';'';'1';'L';''
'23';'1.2.40.0.34.5.151';'Validate Token';'';'';'Token validieren';'';'1';'L';''
'24';'1.2.40.0.34.5.151';'Renew Token';'';'';'Token erneuern';'';'1';'L';''
'25';'1.2.40.0.34.5.151';'BürgerIn Anmeldung';'';'';'BürgerIn Anmeldung';'';'1';'L';''
'26';'1.2.40.0.34.5.151';'BürgerIn Anmeldung in Vertretung';'';'';'BürgerIn Anmeldung in Vertretung';'';'1';'L';''
'27';'1.2.40.0.34.5.151';'BürgerIn Anmeldung der OBST in Vertretung';'';'';'BürgerIn Anmeldung der OBST in Vertretung';'';'1';'L';''
'30';'1.2.40.0.34.5.151';'Dokumentenverwaltung';'';'';'Dokumentenverwaltung';'';'0';'S';''
'31';'1.2.40.0.34.5.151';'Dokument einbringen';'';'';'Dokument einbringen';'';'1';'L';''
'33';'1.2.40.0.34.5.151';'Dokument Metadaten ändern';'';'';'Dokument Metadaten ändern';'';'1';'L';''
'35';'1.2.40.0.34.5.151';'Dokument suchen';'';'';'Dokument suchen';'';'1';'L';''
'36';'1.2.40.0.34.5.151';'Dokument abrufen';'';'';'Dokument abrufen';'';'1';'L';''
'37';'1.2.40.0.34.5.151';'Löschaufträge abfragen';'';'';'Löschaufträge abfragen';'';'1';'L';''
'38';'1.2.40.0.34.5.151';'Löschauftrag bestätigen';'';'';'Löschauftrag bestätigen';'';'1';'L';''
'40';'1.2.40.0.34.5.151';'eMed';'';'';'';'';'0';'S';''
'42';'1.2.40.0.34.5.151';'Medikationsdaten ändern';'';'';'Medikationsdaten ändern';'';'1';'L';''
'43';'1.2.40.0.34.5.151';'Medikationsdaten lesen';'';'';'Medikationsdaten lesen';'';'1';'L';''
'44';'1.2.40.0.34.5.151';'EMEDAT-1 Request Security Token';'';'';'Anfrage zur Ausstellung einer eMed-ID Assertion';'';'1';'L';''
'45';'1.2.40.0.34.5.151';'EMEDAT-1 Generate DocumentID';'';'';'Anfrage zur Ausstellung einer eMed-ID';'';'1';'L';''
'46';'1.2.40.0.34.5.151';'EMEDAT Bulk Expire Dokuments';'';'Internes Löschen und Invalidieren von Dokumenten entsprechend gesetzlicher / fachlicher Anforderungen';'Internes Löschen und Invalidieren von Dokumenten';'';'1';'L';''
'50';'1.2.40.0.34.5.151';'ELGA allgemein';'';'Allgemeine ELGA Audit Events';'ELGA allgemein';'';'0';'S';''
'51';'1.2.40.0.34.5.151';'Notify ELGA XAD-PID Link Change';'';'Transaktion ELGA-1';'Technische Datenkorrektur';'';'1';'L';''
'52';'1.2.40.0.34.5.151';'Registrieren von Dokumenten im Rahmen eines Clearings';'';'';'Registrieren von Dokumenten im Rahmen eines Clearings';'';'1';'L';''
'53';'1.2.40.0.34.5.151';'Stornieren von Dokumenten im Rahmen eines Clearings';'';'';'Stornieren von Dokumenten im Rahmen eines Clearings';'';'1';'L';''
'54';'1.2.40.0.34.5.151';'Dokumentenbereinigung im Auftrag des GDA';'';'';'Dokumentenbereinigung im Auftrag des GDA';'';'1';'L';''
'60';'1.2.40.0.34.5.151';'e-Impfpass';'';'';'';'';'0';'S';''
'61';'1.2.40.0.34.5.151';'Immunisierungsdaten geändert (e-Impfpass)';'';'';'e-Impfpassdaten geändert';'';'1';'L';''
'62';'1.2.40.0.34.5.151';'Immunisierungsdaten aufgerufen (e-Impfpass)';'';'';'e-Impfpassdaten aufgerufen';'';'1';'L';''
'70';'1.2.40.0.34.5.151';'Benachrichtigungsservice';'';'';'';'';'0';'S';''
'71';'1.2.40.0.34.5.151';'Benachrichtigungsvermerk eingetragen';'';'';'Benachrichtigungsvermerk eingetragen';'';'1';'L';''
'72';'1.2.40.0.34.5.151';'Benachrichtigungsvermerk entfernt';'';'';'Benachrichtigungsvermerk entfernt';'';'1';'L';''
