'code';'codeSystem';'displayName';'parentCode';'concept_Beschreibung';'meaning';'hints';'level';'type';'relationships'
'ABR';'1.2.40.0.34.5.195';'Abrechnungs-Kennzeichen';;;;;'0';'S';
'ABR_k';'1.2.40.0.34.5.195';'Kassen';;;;;'1';'L';
'ABR_o';'1.2.40.0.34.5.195';'offen';;;;;'1';'L';
'ABR_p';'1.2.40.0.34.5.195';'privat';;;;;'1';'L';
'ABR_x';'1.2.40.0.34.5.195';'nicht verrechnen';;;;;'1';'L';
'ABS-Daten';'1.2.40.0.34.5.195';'ABS Daten';;;;;'0';'L';
'ArnMittelAbgabe';'1.2.40.0.34.5.195';'Arzneimittel Abgabeart';;;;;'0';'S';
'ArnMittelAbgabe_B';'1.2.40.0.34.5.195';'Barverkauf';;;;;'1';'L';
'ArnMittelAbgabe_K';'1.2.40.0.34.5.195';'Kasse';;;;;'1';'L';
'ArnMittelAbgabe_oeA';'1.2.40.0.34.5.195';'oeffentliche Apotheke';;;;;'1';'L';
'ArnMittelBez';'1.2.40.0.34.5.195';'Arzneimittel Bezahlt';;;;;'0';'L';
'ArnMittelMagBest';'1.2.40.0.34.5.195';'Bestandteil einer magistralen Zubereiten';;;;;'0';'L';
'ArnMittelMagOrganizer';'1.2.40.0.34.5.195';'Organizer für magistrale Zubereitungen';;;;;'0';'L';
'ArnMittelOrganizer';'1.2.40.0.34.5.195';'Arzneimittel-Organizer';;;;;'0';'L';
'ArnMittelPackArt';'1.2.40.0.34.5.195';'Arzneimittelpackungsart';;;;;'0';'S';
'ArnMittelPackArt_AEM';'1.2.40.0.34.5.195';'Ärztemuster';;;;;'1';'L';
'ArnMittelPackArt_OP';'1.2.40.0.34.5.195';'Originalpackung';;;;;'1';'L';
'ArnMittelRezGebFrei';'1.2.40.0.34.5.195';'Arzneimittel rezeptgebührenbefreit';;;;;'0';'L';
'ArzMittelPreis';'1.2.40.0.34.5.195';'Arzneimittelpreis';;;;;'0';'S';
'ArzMittelPreisApo';'1.2.40.0.34.5.195';'Apotheken-Verkaufspreis des Arzneimittels';;;;;'1';'L';
'ArzMittelPreisTAX';'1.2.40.0.34.5.195';'TAX-Preis des Arzneimittels';;;;;'1';'L';
'Attachment';'1.2.40.0.34.5.195';'Attachment';;;;;'0';'L';
'BER';'1.2.40.0.34.5.195';'Beruf';;;;;'0';'L';
'BLD';'1.2.40.0.34.5.195';'Bundeslandcode';;;;;'0';'S';
'BLD1';'1.2.40.0.34.5.195';'Wien';;;;;'1';'L';
'BLD2';'1.2.40.0.34.5.195';'Niederösterreich';;;;;'1';'L';
'BLD3';'1.2.40.0.34.5.195';'Burgenland';;;;;'1';'L';
'BLD4';'1.2.40.0.34.5.195';'Oberösterreich';;;;;'1';'L';
'BLD5';'1.2.40.0.34.5.195';'Steiermark';;;;;'1';'L';
'BLD6';'1.2.40.0.34.5.195';'Kärnten';;;;;'1';'L';
'BLD7';'1.2.40.0.34.5.195';'Salzburg';;;;;'1';'L';
'BLD8';'1.2.40.0.34.5.195';'Tirol';;;;;'1';'L';
'BLD9';'1.2.40.0.34.5.195';'Vorarlberg';;;;;'1';'L';
'BSART';'1.2.40.0.34.5.195';'Behandlungsschein';;'Art des Behandlungscheins';;;'0';'S';
'BSART1';'1.2.40.0.34.5.195';'Krankenschein';;'Krankenschein, Hebammengebührenrechnung (nur gültig bei Fachgebiet 70), Abrechnungsformular für MKP-Leistungen';;;'1';'L';
'BSART2';'1.2.40.0.34.5.195';'Überweisungsschein';;;;;'1';'L';
'BSART3';'1.2.40.0.34.5.195';'Erste-Hilfe-Schein';;;;;'1';'L';
'BSART4';'1.2.40.0.34.5.195';'Vertretungsschein';;;;;'1';'L';
'BSART5';'1.2.40.0.34.5.195';'Bereitschaftsdienstschein';;;;;'1';'L';
'BSART6';'1.2.40.0.34.5.195';'Vorsorgeuntersuchungsschein';;;;;'1';'L';
'BSART7';'1.2.40.0.34.5.195';'Ambulanzschein';;;;;'1';'L';
'BSART8';'1.2.40.0.34.5.195';'Ersatzbehandlungsschein';;;;;'1';'L';
'BSART9';'1.2.40.0.34.5.195';'Verordnungsschein';;;;;'1';'L';
'BefErstDat';'1.2.40.0.34.5.195';'Befunderstellungsdatum';;;;;'0';'L';
'BefundArt';'1.2.40.0.34.5.195';'Befund Art';;;;;'0';'S';
'BefundDokument';'1.2.40.0.34.5.195';'Befund Dokument';;;;;'1';'L';
'BefundKartEintrag';'1.2.40.0.34.5.195';'Befund Karteieintrages';;;;;'1';'L';
'Behandlungen';'1.2.40.0.34.5.195';'Behandlungen';;;;;'0';'L';
'BesKennzeichenHautfarbe';'1.2.40.0.34.5.195';'Besondere Kennzeichen / Hautfarbe';;;;;'0';'L';
'CHKZ';'1.2.40.0.34.5.195';'Chefarztkennzeichen';;;;;'0';'S';
'CHKZ_J';'1.2.40.0.34.5.195';'ja';;;;;'1';'L';
'CHKZ_N';'1.2.40.0.34.5.195';'nein';;;;;'1';'L';
'CHKZ_blank';'1.2.40.0.34.5.195';'Trägerspezifisch';;;;;'1';'L';
'DatenbankexportEXNDS';'1.2.40.0.34.5.195';'Datenbankexport EXNDS';;;;;'0';'S';
'EXNDS_Patientendaten';'1.2.40.0.34.5.195';'Datenbankexport EXNDS - Patientendaten';;;;;'1';'L';
'EXNDS_SystemdatenONLY';'1.2.40.0.34.5.195';'Datenbankexport EXNDS - Systemdaten ONLY';;;;;'1';'L';
'Dienstgeber';'1.2.40.0.34.5.195';'Dienstgeber';;;;;'0';'L';
'EKM';'1.2.40.0.34.5.195';'EntfernungInKM';;;;;'0';'L';
'ERSTZUW';'1.2.40.0.34.5.195';'Erstzuweiser';;;;;'0';'L';
'FremdStaatKenn';'1.2.40.0.34.5.195';'Fremdstaaten-Kennzeichen';;;;;'0';'L';
'GRUVU';'1.2.40.0.34.5.195';'Grund für Behandlungsschein';;;;;'0';'S';
'GRUVU_Bereitschaftsdienstschein';'1.2.40.0.34.5.195';'Grund für Bereitschaftsdienstschein';;;;;'1';'S';
'GRUVU51';'1.2.40.0.34.5.195';'Wochentagsnachtdienst';;;;;'2';'L';
'GRUVU_Verordnungsschein';'1.2.40.0.34.5.195';'Grund für Verordnungsschein';;;;;'1';'S';
'GRUVU91';'1.2.40.0.34.5.195';'bestimmte Leistungen';;;;;'2';'L';
'GRUVU92';'1.2.40.0.34.5.195';'Röntgenbefund';;;;;'2';'L';
'GRUVU93';'1.2.40.0.34.5.195';'Laborbefund';;;;;'2';'L';
'GRUVU94';'1.2.40.0.34.5.195';'Verordnung zur Therapie';;;;;'2';'L';
'GRUVU95';'1.2.40.0.34.5.195';'Akupunktur';;;;;'2';'L';
'GRUVU_Vertretungsschein';'1.2.40.0.34.5.195';'Grund für Vertretungsschein';;;;;'1';'S';
'GRUVU41';'1.2.40.0.34.5.195';'Krankheit';;;;;'2';'L';
'GRUVU42';'1.2.40.0.34.5.195';'Urlaub';;;;;'2';'L';
'GRUVU43';'1.2.40.0.34.5.195';'Fortbildung';;;;;'2';'L';
'GRUVU44';'1.2.40.0.34.5.195';'Rücküberweisung nach Krankenstandsvertretung';;;;;'2';'L';
'GRUVU45';'1.2.40.0.34.5.195';'Rücküberweisung nach Urlaubsvertretung';;;;;'2';'L';
'GRUVU46';'1.2.40.0.34.5.195';'Rücküberweisung nach Fortbildungsvertretung';;;;;'2';'L';
'GRUVU47';'1.2.40.0.34.5.195';'Nichterreichbarkeit';;;;;'2';'L';
'GRUVU_Vorsorgeunterschungsschein';'1.2.40.0.34.5.195';'Grund für Vorsorgeuntersuchungsschein';;;;;'1';'S';
'GRUVU61';'1.2.40.0.34.5.195';'chefärztlicher Dienst';;;;;'2';'L';
'GRUVU62';'1.2.40.0.34.5.195';'Reihen-, Lehrlingsuntersuchung';;;;;'2';'L';
'GRUVU63';'1.2.40.0.34.5.195';'Gesundenuntersuchung ohne kurativer Behandlung';;;;;'2';'L';
'GRUVU64';'1.2.40.0.34.5.195';'Gesundenuntersuchung mit kurativer Behandlung';;;;;'2';'L';
'GRUVU_Überweisungsschein';'1.2.40.0.34.5.195';'Grund für Überweisungsschein';;;;;'1';'S';
'GRUVU21';'1.2.40.0.34.5.195';'fachärztliche Untersuchung';;;;;'2';'L';
'GRUVU22';'1.2.40.0.34.5.195';'Erste-Hilfe-Leistung wegen Nichterreichbarkeit';;;;;'2';'L';
'GRUVU23';'1.2.40.0.34.5.195';'Erste-Hilfe-Leistung im Bereitschaftsdienst';;;;;'2';'L';
'GRUVU24';'1.2.40.0.34.5.195';'Röntgenbefund';;;;;'2';'L';
'GRUVU25';'1.2.40.0.34.5.195';'Laborbefund';;;;;'2';'L';
'GRUVU26';'1.2.40.0.34.5.195';'Ortswechsel';;;;;'2';'L';
'GRUVU27';'1.2.40.0.34.5.195';'Übeweisung zur Therapie';;;;;'2';'L';
'KOERPERLICHEMERKMALE';'1.2.40.0.34.5.195';'Körperliche Merkmale';;;;;'0';'L';
'Karteieintragungen';'1.2.40.0.34.5.195';'Karteieintragungen';;;;;'0';'L';
'Karteineintrag';'1.2.40.0.34.5.195';'Karteineintrag';;;;;'0';'L';
'Kassenleistung';'1.2.40.0.34.5.195';'Kassenleistung';;;;;'0';'L';
'Krankenstand';'1.2.40.0.34.5.195';'Krankenstand';;;;;'0';'S';
'KrankenstandGrund';'1.2.40.0.34.5.195';'Grund für den Krankenstand';;;;;'1';'L';
'VorausEnde';'1.2.40.0.34.5.195';'Voraussichtliches Ende des Krankenstandes';;;;;'1';'L';
'MWST';'1.2.40.0.34.5.195';'Mehrwertsteuersatz';;;;;'0';'L';
'PatInfoAdOrg';'1.2.40.0.34.5.195';'Patienteninformation Administrativ Organizer';;;;;'0';'L';
'RGZ';'1.2.40.0.34.5.195';'Regiezuschlag';;;;;'0';'L';
'RZG';'1.2.40.0.34.5.195';'Rezeptgebührenbefreit';;;;;'0';'L';
'Saldo';'1.2.40.0.34.5.195';'Saldo';;;;;'0';'L';
'Tarif';'1.2.40.0.34.5.195';'Tarif';;;;;'0';'S';
'MNG';'1.2.40.0.34.5.195';'Tarif Menge';;;;;'1';'L';
'TFG';'1.2.40.0.34.5.195';'Tariffeld';;;;;'1';'L';
'Zusatzkennzeichen';'1.2.40.0.34.5.195';'Zusatzkennzeichen';;;;;'1';'L';
'TherapieMenge';'1.2.40.0.34.5.195';'Therapie Menge';;;;;'0';'L';
'VKT';'1.2.40.0.34.5.195';'Versichertenkategorie';;;;;'0';'S';
'VKT01';'1.2.40.0.34.5.195';'Erwerbstätige, Arbeitslose, Selbstversicherte, Zivildiener, Asylanten, Flüchtlinge, Mindestsicherungsempfänger';;;;;'1';'L';
'VKT05';'1.2.40.0.34.5.195';'Pensionist, Ruhegenussempfänger';;;;;'1';'L';
'VKT07';'1.2.40.0.34.5.195';'Kriegshinterbliebener';;;;;'1';'L';
'VKT20';'1.2.40.0.34.5.195';'Zugeteilte nach OFG';;;;;'1';'L';
'VKT21';'1.2.40.0.34.5.195';'Zugeteilte nach KOVG, HVG';;;;;'1';'L';
'VKT22';'1.2.40.0.34.5.195';'Zugeteilte nach KOVG-D';;;;;'1';'L';
'VKT23';'1.2.40.0.34.5.195';'Zugeteilte nach STVG, Impfschadengesetz';;;;;'1';'L';
'VKT24';'1.2.40.0.34.5.195';'Zugeteilte nach VOG';;;;;'1';'L';
'VKT25';'1.2.40.0.34.5.195';'MKP - Nichtversicherte';;;;;'1';'L';
'VKT26';'1.2.40.0.34.5.195';'VU- Nichtversicherte';;;;;'1';'L';
'VKT29';'1.2.40.0.34.5.195';'Fremdstaaten (De-facto-Versicherte)';;;;;'1';'L';
'VSTRL';'1.2.40.0.34.5.195';'Leistungszuständiger Versicherungsträger';;;;;'0';'S';
'Betriebskrankenkassen';'1.2.40.0.34.5.195';'Betriebskrankenkassen';;;;;'1';'S';
'VSTRL24';'1.2.40.0.34.5.195';'Mondi';;;;;'2';'L';
'VSTRL25';'1.2.40.0.34.5.195';'Voestalpine Bahnsysteme';;;;;'2';'L';
'VSTRL26';'1.2.40.0.34.5.195';'Zeltweg';;;;;'2';'L';
'VSTRL28';'1.2.40.0.34.5.195';'Kapfenberg';;;;;'2';'L';
'Krankenfürsorgeanstalten';'1.2.40.0.34.5.195';'Krankenfürsorgeanstalten';;;;;'1';'S';
'VSTRL1A';'1.2.40.0.34.5.195';'Krankenfürsorgeanstalt der Bediensteten der Stadt Wien';;;;;'2';'L';
'VSTRL2A';'1.2.40.0.34.5.195';'Krankenfürsorgeanstalt der Beamten der Stadtgemeinde Baden';;;;;'2';'L';
'VSTRL4A';'1.2.40.0.34.5.195';'Krankenfürsorge für die Beamten der Landeshauptstadt Linz';;;;;'2';'L';
'VSTRL4B';'1.2.40.0.34.5.195';'Kranken? und Unfallfürsorge für oberösterreichische Gemeindebeamte';;;;;'2';'L';
'VSTRL4C';'1.2.40.0.34.5.195';'Krankenfürsorgeanstalt für oberösterreichische Landesbeamte';;;;;'2';'L';
'VSTRL4D';'1.2.40.0.34.5.195';'Oberösterreichische Lehrer?Kranken? und Unfallfürsorge';;;;;'2';'L';
'VSTRL4E';'1.2.40.0.34.5.195';'Krankenfürsorge für die Beamten des Magistrates Steyr';;;;;'2';'L';
'VSTRL4F';'1.2.40.0.34.5.195';'Krankenfürsorge für oberösterreichische Beamten der Stadt Wels';;;;;'2';'L';
'VSTRL5A';'1.2.40.0.34.5.195';'Krankenfürsorgeanstalt für die Beamten der Landeshauptstadt Graz';;;;;'2';'L';
'VSTRL6A';'1.2.40.0.34.5.195';'Krankenfürsorgeanstalt für die Beamten der Stadt Villach';;;;;'2';'L';
'VSTRL7A';'1.2.40.0.34.5.195';'Krankenfürsorgeanstalt der Magistratsbeamten der Landeshauptstadt Salzburg';;;;;'2';'L';
'VSTRL7B';'1.2.40.0.34.5.195';'Krankenfürsorgeeinrichtung der Beamten der Stadtgemeinde Hallein';;;;;'2';'L';
'VSTRL8B';'1.2.40.0.34.5.195';'Kranken? und Unfallfürsorge der Tiroler Gemeindebeamten';;;;;'2';'L';
'VSTRL8C';'1.2.40.0.34.5.195';'Kranken? und Unfallfürsorge der Tiroler Landesbeamten';;;;;'2';'L';
'VSTRL8D';'1.2.40.0.34.5.195';'Kranken? und Unfallfürsorge der Tiroler Landeslehrer';;;;;'2';'L';
'Pensionsversicherung';'1.2.40.0.34.5.195';'Pensionsversicherung';;;;;'1';'S';
'VSTRL02';'1.2.40.0.34.5.195';'Pensionsversicherung';;;;;'2';'L';
'Sonderversicherungsträger';'1.2.40.0.34.5.195';'Sonderversicherungsträger';;;;;'1';'S';
'VSTRL05';'1.2.40.0.34.5.195';'Versicherungsanstalt öffentlich Bediensteter, Eisenbahnen und Bergbau ? Eisenbahn Bergbau';;;;;'2';'L';
'VSTRL07';'1.2.40.0.34.5.195';'Versicherungsanstalt öffentlich Bediensteter, Eisenbahnen und Bergbau ? Öffentlich Bedienstete';;;;;'2';'L';
'VSTRL40';'1.2.40.0.34.5.195';'Sozialversicherungsanstalt der Selbständigen ? gewerbliche Wirtschaft';;;;;'2';'L';
'VSTRL41';'1.2.40.0.34.5.195';'Sozialversicherungsanstalt der Selbständigen ? gewerbliche Wirtschaft Landesstelle Wien';;;;;'2';'L';
'VSTRL42';'1.2.40.0.34.5.195';'Sozialversicherungsanstalt der Selbständigen ? gewerbliche Wirtschaft Landesstelle Niederösterreich';;;;;'2';'L';
'VSTRL43';'1.2.40.0.34.5.195';'Sozialversicherungsanstalt der Selbständigen ? gewerbliche Wirtschaft Landesstelle Burgenland';;;;;'2';'L';
'VSTRL44';'1.2.40.0.34.5.195';'Sozialversicherungsanstalt der Selbständigen ? gewerbliche Wirtschaft Landesstelle Oberösterreich';;;;;'2';'L';
'VSTRL45';'1.2.40.0.34.5.195';'Sozialversicherungsanstalt der Selbständigen ? gewerbliche Wirtschaft Landesstelle Steiermark';;;;;'2';'L';
'VSTRL46';'1.2.40.0.34.5.195';'Sozialversicherungsanstalt der Selbständigen ? gewerbliche Wirtschaft Landesstelle Kärnten';;;;;'2';'L';
'VSTRL47';'1.2.40.0.34.5.195';'Sozialversicherungsanstalt der Selbständigen ? gewerbliche Wirtschaft Landesstelle Salzburg';;;;;'2';'L';
'VSTRL48';'1.2.40.0.34.5.195';'Sozialversicherungsanstalt der Selbständigen ? gewerbliche Wirtschaft Landesstelle Tirol';;;;;'2';'L';
'VSTRL49';'1.2.40.0.34.5.195';'Sozialversicherungsanstalt der Selbständigen ? gewerbliche Wirtschaft Landesstelle Vorarlberg';;;;;'2';'L';
'VSTRL50';'1.2.40.0.34.5.195';'Sozialversicherungsanstalt der Selbständigen ? Landwirtschaft';;;;;'2';'L';
'VSTRL51';'1.2.40.0.34.5.195';'Sozialversicherungsanstalt der Selbständigen ? Landwirtschaft Landesstelle Wien';;;;;'2';'L';
'VSTRL52';'1.2.40.0.34.5.195';'Sozialversicherungsanstalt der Selbständigen ? Landwirtschaft Landesstelle Niederösterreich';;;;;'2';'L';
'VSTRL53';'1.2.40.0.34.5.195';'Sozialversicherungsanstalt der Selbständigen ? Landwirtschaft Landesstelle Burgenland';;;;;'2';'L';
'VSTRL54';'1.2.40.0.34.5.195';'Sozialversicherungsanstalt der Selbständigen ? Landwirtschaft Landesstelle Oberösterreich';;;;;'2';'L';
'VSTRL55';'1.2.40.0.34.5.195';'Sozialversicherungsanstalt der Selbständigen ? Landwirtschaft Landesstelle Steiermark';;;;;'2';'L';
'VSTRL56';'1.2.40.0.34.5.195';'Sozialversicherungsanstalt der Selbständigen ? Landwirtschaft Landesstelle Kärnten';;;;;'2';'L';
'VSTRL57';'1.2.40.0.34.5.195';'Sozialversicherungsanstalt der Selbständigen ? Landwirtschaft Landesstelle Salzburg';;;;;'2';'L';
'VSTRL58';'1.2.40.0.34.5.195';'Sozialversicherungsanstalt der Selbständigen ? Landwirtschaft Landesstelle Tirol';;;;;'2';'L';
'VSTRL59';'1.2.40.0.34.5.195';'Sozialversicherungsanstalt der Selbständigen ? Landwirtschaft Landesstelle Vorarlberg';;;;;'2';'L';
'Sonstige';'1.2.40.0.34.5.195';'Sonstige';;;;;'1';'S';
'VSTRL1L';'1.2.40.0.34.5.195';'Magistrat der Stadt Wien';;;;;'2';'L';
'VSTRL4G';'1.2.40.0.34.5.195';'Magistrat der Stadt Steyr';;;;;'2';'L';
'VSTRL4L';'1.2.40.0.34.5.195';'Landesregierung Oberösterreich';;;;;'2';'L';
'Österreichische_Gesundheitskasse';'1.2.40.0.34.5.195';'Österreichische Gesundheitskasse';;;;;'1';'S';
'VSTRL11';'1.2.40.0.34.5.195';'Österreichische Gesundheitskasse';;;;;'2';'L';
'VisitenKMTyp';'1.2.40.0.34.5.195';'Visiten KM Typ';;;;;'0';'S';
'KMA';'1.2.40.0.34.5.195';'Visitenadresse-km Alpin';;;;;'1';'L';
'KMB';'1.2.40.0.34.5.195';'Visitenadresse-km Berg';;;;;'1';'L';
'KMN';'1.2.40.0.34.5.195';'Visitenadresse-km Normal';;;;;'1';'L';
'Visitenadresse';'1.2.40.0.34.5.195';'Visitenadresse';;;;;'0';'L';
'Visiteninformation';'1.2.40.0.34.5.195';'Visientinformation';;;;;'0';'L';
'eCardKonsDaten';'1.2.40.0.34.5.195';'eCard Konsultationsdaten';;;;;'0';'L';
