'code';'codeSystem';'displayName';'parentCode';'concept_Beschreibung';'meaning';'hints';'level';'type';'relationships'
'urn:elga:2011:EIS_Basic';'1.2.40.0.34.5.37';'ELGA Dokument';'';'';'ELGA Dokument';'';'0';'L';''
'urn:elga:2013:EIS_Basic';'1.2.40.0.34.5.37';'ELGA Dokument';'';'';'ELGA Dokument';'';'0';'L';''
'urn:elga:2014:EIS_Basic';'1.2.40.0.34.5.37';'ELGA Dokument';'';'CDA Dokument entsprechend den Vorgaben des Allgemeinen Implementierungsleitfadens für ELGA Dokumente (EIS Basic)';'ELGA Dokument';'';'0';'L';''
'urn:elga:2015-v2.06:EIS_Basic';'1.2.40.0.34.5.37';'ELGA Dokument v2.06';'';'CDA Dokument entsprechend den Vorgaben des Allgemeinen Implementierungsleitfadens für ELGA Dokumente (EIS Basic) v2-06';'ELGA Dokument v2.06';'';'0';'L';''
'urn:elga:2015:EIS_Basic';'1.2.40.0.34.5.37';'ELGA Dokument';'';'CDA Dokument entsprechend den Vorgaben des Allgemeinen Implementierungsleitfadens für ELGA Dokumente (EIS Basic)';'ELGA Dokument';'';'0';'L';''
'urn:elga:2016-v2.06.1:EIS_Basic';'1.2.40.0.34.5.37';'ELGA Dokument v2.06.1';'';'CDA Dokument entsprechend den Vorgaben des Allgemeinen Implementierungsleitfadens für ELGA Dokumente (EIS Basic) v2-06.1';'ELGA Dokument v2.06';'';'0';'L';''
'urn:elga:2017-v2.06.2:EIS_Basic';'1.2.40.0.34.5.37';'ELGA Dokument v2.06.2';'';'CDA Dokument entsprechend den Vorgaben des Allgemeinen Implementierungsleitfadens für ELGA Dokumente (EIS Basic) v2-06.2';'ELGA Dokument v2.06';'';'0';'L';''
'urn:elga:dissum-n:2014:EIS_Basic';'1.2.40.0.34.5.37';'ELGA Entlassungsbrief Pflege, EIS Basic';'';'';'ELGA Entlassungsbrief Pflege, EIS Basic';'Gilt für EIS Basic und Structured';'0';'L';''
'urn:elga:dissum-n:2014:EIS_Enhanced';'1.2.40.0.34.5.37';'ELGA Entlassungsbrief Pflege, EIS Enhanced';'';'';'ELGA Entlassungsbrief Pflege, EIS Enhanced';'';'0';'L';''
'urn:elga:dissum-n:2014:EIS_FullSupport';'1.2.40.0.34.5.37';'ELGA Entlassungsbrief Pflege, EIS Full Support';'';'';'ELGA Entlassungsbrief Pflege, EIS Full Support';'';'0';'L';''
'urn:elga:dissum-n:2015-v2.06:EIS_Basic';'1.2.40.0.34.5.37';'ELGA Entlassungsbrief Pflege, EIS Basic v2.06';'';'';'ELGA Entlassungsbrief Pflege, EIS Basic v2.06';'Gilt für EIS Basic und Structured';'0';'L';''
'urn:elga:dissum-n:2015-v2.06:EIS_Enhanced';'1.2.40.0.34.5.37';'ELGA Entlassungsbrief Pflege, EIS Enhanced v2.06';'';'';'ELGA Entlassungsbrief Pflege, EIS Enhanced v2.06';'';'0';'L';''
'urn:elga:dissum-n:2015-v2.06:EIS_FullSupport';'1.2.40.0.34.5.37';'ELGA Entlassungsbrief Pflege, EIS Full Support v2.06';'';'';'ELGA Entlassungsbrief Pflege, EIS Full Support v2.06';'';'0';'L';''
'urn:elga:dissum-n:2015:EIS_Basic';'1.2.40.0.34.5.37';'ELGA Entlassungsbrief Pflege, EIS Basic';'';'';'ELGA Entlassungsbrief Pflege, EIS Basic';'Gilt für EIS Basic und Structured';'0';'L';''
'urn:elga:dissum-n:2015:EIS_Enhanced';'1.2.40.0.34.5.37';'ELGA Entlassungsbrief Pflege, EIS Enhanced';'';'';'ELGA Entlassungsbrief Pflege, EIS Enhanced';'';'0';'L';''
'urn:elga:dissum-n:2015:EIS_FullSupport';'1.2.40.0.34.5.37';'ELGA Entlassungsbrief Pflege, EIS Full Support';'';'';'ELGA Entlassungsbrief Pflege, EIS Full Support';'';'0';'L';''
'urn:elga:dissum-n:2017-v2.06.2:EIS_Basic';'1.2.40.0.34.5.37';'ELGA Entlassungsbrief Pflege, EIS Basic v2.06.2';'';'';'ELGA Entlassungsbrief Pflege, EIS Basic v2.06.2';'Gilt für EIS Basic und Structured';'0';'L';''
'urn:elga:dissum-n:2017-v2.06.2:EIS_Enhanced';'1.2.40.0.34.5.37';'ELGA Entlassungsbrief Pflege, EIS Enhanced v2.06.2';'';'';'ELGA Entlassungsbrief Pflege, EIS Enhanced v2.06.2';'';'0';'L';''
'urn:elga:dissum-n:2017-v2.06.2:EIS_FullSupport';'1.2.40.0.34.5.37';'ELGA Entlassungsbrief Pflege, EIS Full Support v2.06.2';'';'';'ELGA Entlassungsbrief Pflege, EIS Full Support v2.06.2';'';'0';'L';''
'urn:elga:dissum:2011:EIS_Basic';'1.2.40.0.34.5.37';'ELGA Entlassungsbrief';'';'';'ELGA Entlassungsbrief';'Gilt für EIS Basic und Structured';'0';'L';''
'urn:elga:dissum:2011:EIS_Enhanced';'1.2.40.0.34.5.37';'ELGA Entlassungsbrief';'';'';'ELGA Entlassungsbrief';'';'0';'L';''
'urn:elga:dissum:2011:EIS_FullSupport';'1.2.40.0.34.5.37';'ELGA Entlassungsbrief';'';'';'ELGA Entlassungsbrief';'';'0';'L';''
'urn:elga:dissum:2013:EIS_Basic';'1.2.40.0.34.5.37';'ELGA Entlassungsbrief';'';'';'ELGA Entlassungsbrief';'Gilt für EIS Basic und Structured';'0';'L';''
'urn:elga:dissum:2013:EIS_Enhanced';'1.2.40.0.34.5.37';'ELGA Entlassungsbrief';'';'';'ELGA Entlassungsbrief';'';'0';'L';''
'urn:elga:dissum:2013:EIS_FullSupport';'1.2.40.0.34.5.37';'ELGA Entlassungsbrief';'';'';'ELGA Entlassungsbrief';'';'0';'L';''
'urn:elga:dissum:2014:EIS_Basic';'1.2.40.0.34.5.37';'ELGA Entlassungsbrief Ärztlich, EIS Basic';'';'';'ELGA Entlassungsbrief Ärztlich, EIS Basic';'Gilt für EIS Basic und Structured';'0';'L';''
'urn:elga:dissum:2014:EIS_Enhanced';'1.2.40.0.34.5.37';'ELGA Entlassungsbrief Ärztlich, EIS Enhanced';'';'';'ELGA Entlassungsbrief Ärztlich, EIS Enhanced';'';'0';'L';''
'urn:elga:dissum:2014:EIS_FullSupport';'1.2.40.0.34.5.37';'ELGA Entlassungsbrief Ärztlich, EIS Full Support';'';'';'ELGA Entlassungsbrief Ärztlich, EIS Full Support';'';'0';'L';''
'urn:elga:dissum:2015-v2.06:EIS_Basic';'1.2.40.0.34.5.37';'ELGA Entlassungsbrief Ärztlich, EIS Basic v2.06';'';'';'ELGA Entlassungsbrief Ärztlich, EIS Basic v2.06';'Gilt für EIS Basic und Structured';'0';'L';''
'urn:elga:dissum:2015-v2.06:EIS_Enhanced';'1.2.40.0.34.5.37';'ELGA Entlassungsbrief Ärztlich, EIS Enhanced v2.06';'';'';'ELGA Entlassungsbrief Ärztlich, EIS Enhanced v2.06';'';'0';'L';''
'urn:elga:dissum:2015-v2.06:EIS_FullSupport';'1.2.40.0.34.5.37';'ELGA Entlassungsbrief Ärztlich, EIS Full Support v2.06';'';'';'ELGA Entlassungsbrief Ärztlich, EIS Full Support v2.06';'';'0';'L';''
'urn:elga:dissum:2015:EIS_Basic';'1.2.40.0.34.5.37';'ELGA Entlassungsbrief Ärztlich, EIS Basic';'';'';'ELGA Entlassungsbrief Ärztlich, EIS Basic';'Gilt für EIS Basic und Structured';'0';'L';''
'urn:elga:dissum:2015:EIS_Enhanced';'1.2.40.0.34.5.37';'ELGA Entlassungsbrief Ärztlich, EIS Enhanced';'';'';'ELGA Entlassungsbrief Ärztlich, EIS Enhanced';'';'0';'L';''
'urn:elga:dissum:2015:EIS_FullSupport';'1.2.40.0.34.5.37';'ELGA Entlassungsbrief Ärztlich, EIS Full Support';'';'';'ELGA Entlassungsbrief Ärztlich, EIS Full Support';'';'0';'L';''
'urn:elga:dissum:2017-v2.06.2:EIS_Basic';'1.2.40.0.34.5.37';'ELGA Entlassungsbrief Ärztlich, EIS Basic v2.06.2';'';'';'ELGA Entlassungsbrief Ärztlich, EIS Basic v2.06.2';'Gilt für EIS Basic und Structured';'0';'L';''
'urn:elga:dissum:2017-v2.06.2:EIS_Enhanced';'1.2.40.0.34.5.37';'ELGA Entlassungsbrief Ärztlich, EIS Enhanced v2.06.2';'';'';'ELGA Entlassungsbrief Ärztlich, EIS Enhanced v2.06.2';'';'0';'L';''
'urn:elga:dissum:2017-v2.06.2:EIS_FullSupport';'1.2.40.0.34.5.37';'ELGA Entlassungsbrief Ärztlich, EIS Full Support v2.06.2';'';'';'ELGA Entlassungsbrief Ärztlich, EIS Full Support v2.06.2';'';'0';'L';''
'urn:elga:emedat:2014:EIS_FullSupport';'1.2.40.0.34.5.37';'ELGA e-Medikation, EIS Full Support';'';'';'ELGA e-Medikation, EIS Full Support';'';'0';'L';''
'urn:elga:emedat:2015';'1.2.40.0.34.5.37';'ELGA e-Medikation';'';'';'ELGA e-Medikation';'CDA für eMedikation sind nur in EIS Full Support zulässig';'0';'L';''
'urn:elga:emedat:2015-v2.06';'1.2.40.0.34.5.37';'ELGA e-Medikation v2.06';'';'';'ELGA e-Medikation v2.06';'';'0';'L';''
'urn:elga:lab:2011:EIS_Basic';'1.2.40.0.34.5.37';'ELGA Befundbericht Labor';'';'';'ELGA Befundbericht Labor';'Gilt für EIS Basic und Structured';'0';'L';''
'urn:elga:lab:2011:EIS_Enhanced';'1.2.40.0.34.5.37';'ELGA Befundbericht Labor';'';'';'ELGA Befundbericht Labor';'';'0';'L';''
'urn:elga:lab:2011:EIS_FullSupport';'1.2.40.0.34.5.37';'ELGA Befundbericht Labor';'';'';'ELGA Befundbericht Labor';'';'0';'L';''
'urn:elga:lab:2013:EIS_Basic';'1.2.40.0.34.5.37';'ELGA Befundbericht Labor';'';'';'ELGA Befundbericht Labor';'Gilt für EIS Basic und Structured';'0';'L';''
'urn:elga:lab:2013:EIS_Enhanced';'1.2.40.0.34.5.37';'ELGA Befundbericht Labor';'';'';'ELGA Befundbericht Labor';'';'0';'L';''
'urn:elga:lab:2013:EIS_FullSupport';'1.2.40.0.34.5.37';'ELGA Befundbericht Labor';'';'';'ELGA Befundbericht Labor';'';'0';'L';''
'urn:elga:lab:2014:EIS_Basic';'1.2.40.0.34.5.37';'ELGA Laborbefund, EIS Basic';'';'';'ELGA Laborbefund, EIS Basic';'Gilt für EIS Basic und Structured';'0';'L';''
'urn:elga:lab:2014:EIS_Enhanced';'1.2.40.0.34.5.37';'ELGA Laborbefund, EIS Enhanced';'';'';'ELGA Laborbefund, EIS Enhanced';'';'0';'L';''
'urn:elga:lab:2014:EIS_FullSupport';'1.2.40.0.34.5.37';'ELGA Laborbefund, EIS Full Support';'';'';'ELGA Laborbefund, EIS Full Support';'';'0';'L';''
'urn:elga:lab:2015-v2.06:EIS_Basic';'1.2.40.0.34.5.37';'ELGA Laborbefund, EIS Basic v2.06';'';'';'ELGA Laborbefund, EIS Basic v2.06';'Gilt für EIS Basic und Structured';'0';'L';''
'urn:elga:lab:2015-v2.06:EIS_Enhanced';'1.2.40.0.34.5.37';'ELGA Laborbefund, EIS Enhanced v2.06';'';'';'ELGA Laborbefund, EIS Enhanced v2.06';'';'0';'L';''
'urn:elga:lab:2015-v2.06:EIS_FullSupport';'1.2.40.0.34.5.37';'ELGA Laborbefund, EIS Full Support v2.06';'';'';'ELGA Laborbefund, EIS Full Support v2.06';'';'0';'L';''
'urn:elga:lab:2015:EIS_Basic';'1.2.40.0.34.5.37';'ELGA Laborbefund, EIS Basic';'';'';'ELGA Laborbefund, EIS Basic';'Gilt für EIS Basic und Structured';'0';'L';''
'urn:elga:lab:2015:EIS_Enhanced';'1.2.40.0.34.5.37';'ELGA Laborbefund, EIS Enhanced';'';'';'ELGA Laborbefund, EIS Enhanced';'';'0';'L';''
'urn:elga:lab:2015:EIS_FullSupport';'1.2.40.0.34.5.37';'ELGA Laborbefund, EIS Full Support';'';'';'ELGA Laborbefund, EIS Full Support';'';'0';'L';''
'urn:elga:lab:2017-v2.06.2:EIS_Basic';'1.2.40.0.34.5.37';'ELGA Laborbefund, EIS Basic v2.06.2';'';'';'ELGA Laborbefund, EIS Basic v2.06.2';'Gilt für EIS Basic und Structured';'0';'L';''
'urn:elga:lab:2017-v2.06.2:EIS_Enhanced';'1.2.40.0.34.5.37';'ELGA Laborbefund, EIS Enhanced v2.06.2';'';'';'ELGA Laborbefund, EIS Enhanced v2.06.2';'';'0';'L';''
'urn:elga:lab:2017-v2.06.2:EIS_FullSupport';'1.2.40.0.34.5.37';'ELGA Laborbefund, EIS Full Support v2.06.2';'';'';'ELGA Laborbefund, EIS Full Support v2.06.2';'';'0';'L';''
'urn:elga:nurse-tf:2015-v2.06:EIS_Basic';'1.2.40.0.34.5.37';'ELGA Pflegesituationsbericht, EIS Basic v2.06';'';'';'ELGA Pflegesituationsbericht, EIS Basic v2.06';'';'0';'L';''
'urn:elga:nurse-tf:2015-v2.06:EIS_Enhanced';'1.2.40.0.34.5.37';'ELGA Pflegesituationsbericht, EIS Enhanced v2.06';'';'';'ELGA Pflegesituationsbericht, EIS Enhanced v2.06';'';'0';'L';''
'urn:elga:nurse-tf:2015-v2.06:EIS_FullSupport';'1.2.40.0.34.5.37';'ELGA Pflegesituationsbericht, EIS Full Support v2.06';'';'';'ELGA Pflegesituationsbericht, EIS Full Support v2.06';'';'0';'L';''
'urn:elga:nurse-tf:2017-v2.06.2:EIS_Basic';'1.2.40.0.34.5.37';'ELGA Pflegesituationsbericht, EIS Basic v2.06.2';'';'';'ELGA Pflegesituationsbericht, EIS Basic v2.06.2';'';'0';'L';''
'urn:elga:nurse-tf:2017-v2.06.2:EIS_Enhanced';'1.2.40.0.34.5.37';'ELGA Pflegesituationsbericht, EIS Enhanced v2.06.2';'';'';'ELGA Pflegesituationsbericht, EIS Enhanced v2.06.2';'';'0';'L';''
'urn:elga:nurse-tf:2017-v2.06.2:EIS_FullSupport';'1.2.40.0.34.5.37';'ELGA Pflegesituationsbericht, EIS Full Support v2.06.2';'';'';'ELGA Pflegesituationsbericht, EIS Full Support v2.06.2';'';'0';'L';''
'urn:elga:radio:2011:EIS_Basic';'1.2.40.0.34.5.37';'ELGA Befundbericht Radiologie';'';'';'ELGA Befundbericht Radiologie';'Gilt für EIS Basic und Structured';'0';'L';''
'urn:elga:radio:2011:EIS_Enhanced';'1.2.40.0.34.5.37';'ELGA Befundbericht Radiologie';'';'';'ELGA Befundbericht Radiologie';'';'0';'L';''
'urn:elga:radio:2011:EIS_FullSupport';'1.2.40.0.34.5.37';'ELGA Befundbericht Radiologie';'';'';'ELGA Befundbericht Radiologie';'';'0';'L';''
'urn:elga:radio:2013:EIS_Basic';'1.2.40.0.34.5.37';'ELGA Befundbericht Radiologie';'';'';'ELGA Befundbericht Radiologie';'Gilt für EIS Basic und Structured';'0';'L';''
'urn:elga:radio:2013:EIS_Enhanced';'1.2.40.0.34.5.37';'ELGA Befundbericht Radiologie';'';'';'ELGA Befundbericht Radiologie';'';'0';'L';''
'urn:elga:radio:2013:EIS_FullSupport';'1.2.40.0.34.5.37';'ELGA Befundbericht Radiologie';'';'';'ELGA Befundbericht Radiologie';'';'0';'L';''
'urn:elga:radio:2014:EIS_Basic';'1.2.40.0.34.5.37';'ELGA Befund bildgebende Diagnostik, EIS Basic';'';'';'ELGA Befund bildgebende Diagnostik, EIS Basic';'Gilt für EIS Basic und Structured';'0';'L';''
'urn:elga:radio:2014:EIS_Enhanced';'1.2.40.0.34.5.37';'ELGA Befund bildgebende Diagnostik, EIS Enhanced';'';'';'ELGA Befund bildgebende Diagnostik, EIS Enhanced';'';'0';'L';''
'urn:elga:radio:2014:EIS_FullSupport';'1.2.40.0.34.5.37';'ELGA Befund bildgebende Diagnostik,EIS Full Support';'';'';'ELGA Befund bildgebende Diagnostik,EIS Full Support';'';'0';'L';''
'urn:elga:radio:2015-v2.06:EIS_Basic';'1.2.40.0.34.5.37';'ELGA Befund bildgebende Diagnostik, EIS Basic v2.06';'';'';'ELGA Befund bildgebende Diagnostik, EIS Basic v2.06';'Gilt für EIS Basic und Structured';'0';'L';''
'urn:elga:radio:2015-v2.06:EIS_Enhanced';'1.2.40.0.34.5.37';'ELGA Befund bildgebende Diagnostik, EIS Enhanced v2.06';'';'';'ELGA Befund bildgebende Diagnostik, EIS Enhanced v2.06';'';'0';'L';''
'urn:elga:radio:2015-v2.06:EIS_FullSupport';'1.2.40.0.34.5.37';'ELGA Befund bildgebende Diagnostik, EIS Full Support v2.06';'';'';'ELGA Befund bildgebende Diagnostik, EIS Full Support v2.06';'';'0';'L';''
'urn:elga:radio:2015:EIS_Basic';'1.2.40.0.34.5.37';'ELGA Befund bildgebende Diagnostik, EIS Basic';'';'';'ELGA Befund bildgebende Diagnostik, EIS Basic';'Gilt für EIS Basic und Structured';'0';'L';''
'urn:elga:radio:2015:EIS_Enhanced';'1.2.40.0.34.5.37';'ELGA Befund bildgebende Diagnostik, EIS Enhanced';'';'';'ELGA Befund bildgebende Diagnostik, EIS Enhanced';'';'0';'L';''
'urn:elga:radio:2015:EIS_FullSupport';'1.2.40.0.34.5.37';'ELGA Befund bildgebende Diagnostik,EIS Full Support';'';'';'ELGA Befund bildgebende Diagnostik,EIS Full Support';'';'0';'L';''
'urn:elga:radio:2017-v2.06.2:EIS_Basic';'1.2.40.0.34.5.37';'ELGA Befund bildgebende Diagnostik, EIS Basic v2.06.2';'';'';'ELGA Befund bildgebende Diagnostik, EIS Basic v2.06.2';'Gilt für EIS Basic und Structured';'0';'L';''
'urn:elga:radio:2017-v2.06.2:EIS_Enhanced';'1.2.40.0.34.5.37';'ELGA Befund bildgebende Diagnostik, EIS Enhanced v2.06.2';'';'';'ELGA Befund bildgebende Diagnostik, EIS Enhanced v2.06.2';'';'0';'L';''
'urn:elga:radio:2017-v2.06.2:EIS_FullSupport';'1.2.40.0.34.5.37';'ELGA Befund bildgebende Diagnostik, EIS Full Support v2.06.2';'';'';'ELGA Befund bildgebende Diagnostik, EIS Full Support v2.06.2';'';'0';'L';''
'urn:hl7-at:arztb:1.2.0+20210304:EIS_Enhanced';'1.2.40.0.34.5.37';'HL7 Austria Arztbrief 1.2.0+20210304, EIS Enhanced';'';'';'HL7 Austria Arztbrief 1.2.0+20210304, EIS Enhanced';'';'0';'L';''
'urn:hl7-at:arztb:1.2.0+20210304:EIS_Enhanced+';'1.2.40.0.34.5.37';'HL7 Austria Arztbrief 1.2.0+20210304, EIS Enhanced+';'';'';'HL7 Austria Arztbrief 1.2.0+20210304, EIS Enhanced+';'';'0';'L';''
'urn:hl7-at:arztb:1.2.0+20210304:EIS_FullSupport';'1.2.40.0.34.5.37';'HL7 Austria Arztbrief 1.2.0+20210304, EIS FullSupport';'';'';'HL7 Austria Arztbrief 1.2.0+20210304, EIS FullSupport';'';'0';'L';''
'urn:hl7-at:arztb:1.2.0+20210304:EIS_FullSupport+';'1.2.40.0.34.5.37';'HL7 Austria Arztbrief 1.2.0+20210304, EIS FullSupport+';'';'';'HL7 Austria Arztbrief 1.2.0+20210304, EIS FullSupport+';'';'0';'L';''
'urn:hl7-at:arztb:1.3.0+20220209:EIS_Enhanced';'1.2.40.0.34.5.37';'HL7 Austria Arztbrief 1.3.0+20220209, EIS Enhanced';'';'';'HL7 Austria Arztbrief 1.3.0+20220209, EIS Enhanced';'';'0';'L';''
'urn:hl7-at:arztb:1.3.0+20220209:EIS_Enhanced+';'1.2.40.0.34.5.37';'HL7 Austria Arztbrief 1.3.0+20220209, EIS Enhanced+';'';'';'HL7 Austria Arztbrief 1.3.0+20220209, EIS Enhanced+';'';'0';'L';''
'urn:hl7-at:arztb:1.3.0+20220209:EIS_FullSupport';'1.2.40.0.34.5.37';'HL7 Austria Arztbrief 1.3.0+20220209, EIS FullSupport';'';'';'HL7 Austria Arztbrief 1.3.0+20220209, EIS FullSupport';'';'0';'L';''
'urn:hl7-at:arztb:1.3.0+20220209:EIS_FullSupport+';'1.2.40.0.34.5.37';'HL7 Austria Arztbrief 1.3.0+20220209, EIS FullSupport+';'';'';'HL7 Austria Arztbrief 1.3.0+20220209, EIS FullSupport+';'';'0';'L';''
'urn:hl7-at:eImpf:1.1.0+20210512';'1.2.40.0.34.5.37';'HL7 Austria e-Impfpass 1.1.0+20210512';'';'';'HL7 Austria e-Impfpass 1.1.0+20210512';'';'0';'L';''
'urn:hl7-at:eImpf:1.1.1+20210601';'1.2.40.0.34.5.37';'HL7 Austria e-Impfpass 1.1.1+20210601';'';'';'HL7 Austria e-Impfpass 1.1.1+20210601';'';'0';'L';''
'urn:hl7-at:eImpf:1.2.0+20220103';'1.2.40.0.34.5.37';'HL7 Austria e-Impfpass 1.2.0+20220103';'';'';'HL7 Austria e-Impfpass 1.2.0+20220103';'';'0';'L';''
'urn:hl7-at:eImpf:1.3.0+20220127';'1.2.40.0.34.5.37';'HL7 Austria e-Impfpass 1.3.0+20220127';'';'';'HL7 Austria e-Impfpass 1.3.0+20220127';'';'0';'L';''
'urn:hl7-at:eImpf:2019';'1.2.40.0.34.5.37';'HL7 Austria e-Impfpass 2019';'';'';'HL7 Austria e-Impfpass 2019';'';'0';'L';''
'urn:hl7-at:lab:3.0.0+20211214';'1.2.40.0.34.5.37';'HL7 Austria Labor- und Mikrobiologiebefund 3.0.0+20211214';'';'';'HL7 Austria Labor- und Mikrobiologiebefund 3.0.0+20211214';'';'0';'L';''
'urn:hl7-at:telemon-epi:1.2.0+20210304';'1.2.40.0.34.5.37';'HL7 Austria Telemonitoring Episodenbericht 1.2.0+20210304';'';'';'HL7 Austria Telemonitoring Episodenbericht 1.2.0+20210304';'';'0';'L';''
