{
  "resourceType": "ValueSet",
  "id": "elga-religiousaffiliation",
  "url": "https://termgit.elga.gv.at/ValueSet-elga-religiousaffiliation",
  "identifier": [
    {
      "use": "official",
      "system": "urn:ietf:rfc:3986",
      "value": "urn:oid:1.2.40.0.34.10.18"
    }
  ],
  "version": "2.6",
  "name": "elga-religiousaffiliation",
  "title": "ELGA_ReligiousAffiliation",
  "status": "active",
  "date": "2013-01-10",
  "contact": [
    {
      "telecom": [
        {
          "system": "url",
          "value": "http://www.hl7.at/index.php?option=com_docman&task=doc_download&gid=152&&Itemid=48"
        }
      ]
    }
  ],
  "description": "**Description:** Set of Religious Affiliation to be used in ELGA. It is preferred to use entries of the first level hierachy (1-L)\n\n**Beschreibung:** Religionen und Glaubensgemeinschaften in \u00d6sterreich. Vorzugsweise sind Eintr\u00e4ge der 1.Hierarchieebene (1-L) zu verwenden",
  "compose": {
    "include": [
      {
        "system": "https://termgit.elga.gv.at/CodeSystem-hl7-at-religionaustria",
        "concept": [
          {
            "code": "100",
            "display": "Katholische Kirche (o.n.A.)",
            "designation": [
              {
                "language": "de-AT",
                "value": "R\u00f6misch-Katholische Kirchen (mit  23 Teilkirchen, incl Unierte) ohne n\u00e4here Angabe"
              },
              {
                "use": {
                  "system": "https://termgit.elga.gv.at/CodeSystem-austrian-designation-use",
                  "code": "hinweise",
                  "display": "hinweise"
                },
                "value": "In \u00d6sterreich gesetzlich anerkannte Kirche und Religionsgesellschaft"
              }
            ]
          },
          {
            "code": "101",
            "display": "R\u00f6misch-Katholisch",
            "designation": [
              {
                "language": "de-AT",
                "value": "R\u00f6misch-Katholische Kirche (Lateinischer Ritus)"
              },
              {
                "use": {
                  "system": "https://termgit.elga.gv.at/CodeSystem-austrian-designation-use",
                  "code": "hinweise",
                  "display": "hinweise"
                },
                "value": "In \u00d6sterreich gesetzlich anerkannte Kirche und Religionsgesellschaft"
              }
            ]
          },
          {
            "code": "102",
            "display": "Griechisch-Katholische Kirche",
            "designation": [
              {
                "language": "de-AT",
                "value": "Unierte Kirchen nach byzantinischem Ritus"
              },
              {
                "use": {
                  "system": "https://termgit.elga.gv.at/CodeSystem-austrian-designation-use",
                  "code": "hinweise",
                  "display": "hinweise"
                },
                "value": "In \u00d6sterreich gesetzlich anerkannte Kirche und Religionsgesellschaft"
              }
            ]
          },
          {
            "code": "103",
            "display": "Armenisch-Katholische Kirche",
            "designation": [
              {
                "language": "de-AT",
                "value": "Armenisch-Katholische Kirche (Armenischer Ritus, Mechitaristen)"
              },
              {
                "use": {
                  "system": "https://termgit.elga.gv.at/CodeSystem-austrian-designation-use",
                  "code": "hinweise",
                  "display": "hinweise"
                },
                "value": "In \u00d6sterreich gesetzlich anerkannte Kirche und Religionsgesellschaft"
              }
            ]
          },
          {
            "code": "104",
            "display": "Bulgarisch-Katholische Kirche"
          },
          {
            "code": "105",
            "display": "Rum\u00e4nische griechisch-katholische Kirche"
          },
          {
            "code": "106",
            "display": "Russisch-Katholische Kirche"
          },
          {
            "code": "107",
            "display": "Syrisch-Katholische Kirche"
          },
          {
            "code": "108",
            "display": "Ukrainische Griechisch-Katholische Kirche"
          },
          {
            "code": "109",
            "display": "Katholische Ostkirche (ohne n\u00e4here Angabe)",
            "designation": [
              {
                "language": "de-AT",
                "value": "Unierte Katholische Ostkirchen (ohne n\u00e4here Angabe)"
              }
            ]
          },
          {
            "code": "110",
            "display": "Griechisch-Orientalische Kirchen",
            "designation": [
              {
                "language": "de-AT",
                "value": "Griechisch-orientalische (=orthodoxe) Kirchen"
              },
              {
                "use": {
                  "system": "https://termgit.elga.gv.at/CodeSystem-austrian-designation-use",
                  "code": "hinweise",
                  "display": "hinweise"
                },
                "value": "In \u00d6sterreich gesetzlich anerkannte Kirche und Religionsgesellschaft"
              }
            ]
          },
          {
            "code": "111",
            "display": "Orthodoxe Kirchen (o.n.A.)",
            "designation": [
              {
                "language": "de-AT",
                "value": "Orthodoxe Kirche (ohne n\u00e4here Angabe, inkl. andere autokephale K.)"
              }
            ]
          },
          {
            "code": "112",
            "display": "Griechisch-Orthodoxe Kirche (Hl.Dreifaltigkeit)",
            "designation": [
              {
                "language": "de-AT",
                "value": "Griechisch-orientalische Kirchengemeinde zur Hl. Dreifaltigkeit"
              },
              {
                "use": {
                  "system": "https://termgit.elga.gv.at/CodeSystem-austrian-designation-use",
                  "code": "hinweise",
                  "display": "hinweise"
                },
                "value": "In \u00d6sterreich gesetzlich anerkannte Kirche und Religionsgesellschaft"
              }
            ]
          },
          {
            "code": "113",
            "display": "Griechisch-Orthodoxe Kirche (Hl.Georg)",
            "designation": [
              {
                "language": "de-AT",
                "value": "Griechisch-orientalische Kirchengemeinde zum Hl. Georg"
              },
              {
                "use": {
                  "system": "https://termgit.elga.gv.at/CodeSystem-austrian-designation-use",
                  "code": "hinweise",
                  "display": "hinweise"
                },
                "value": "In \u00d6sterreich gesetzlich anerkannte Kirche und Religionsgesellschaft"
              }
            ]
          },
          {
            "code": "114",
            "display": "Bulgarisch-Orthodoxe Kirche",
            "designation": [
              {
                "language": "de-AT",
                "value": "Bulgarisch-orthodoxe Kirchengemeinde zum Hl. Iwan Rilski"
              },
              {
                "use": {
                  "system": "https://termgit.elga.gv.at/CodeSystem-austrian-designation-use",
                  "code": "hinweise",
                  "display": "hinweise"
                },
                "value": "In \u00d6sterreich gesetzlich anerkannte Kirche und Religionsgesellschaft"
              }
            ]
          },
          {
            "code": "115",
            "display": "Rum\u00e4nisch-griechisch-orientalische Kirche",
            "designation": [
              {
                "language": "de-AT",
                "value": "Rum\u00e4nisch-griechisch-orientalische Kirchengemeinde zur Hl. Auferstehung"
              },
              {
                "use": {
                  "system": "https://termgit.elga.gv.at/CodeSystem-austrian-designation-use",
                  "code": "hinweise",
                  "display": "hinweise"
                },
                "value": "In \u00d6sterreich gesetzlich anerkannte Kirche und Religionsgesellschaft"
              }
            ]
          },
          {
            "code": "116",
            "display": "Russisch-Orthodoxe Kirche",
            "designation": [
              {
                "language": "de-AT",
                "value": "Russisch-orthodoxe Kirchengemeinde zum Hl. Nikolaus"
              },
              {
                "use": {
                  "system": "https://termgit.elga.gv.at/CodeSystem-austrian-designation-use",
                  "code": "hinweise",
                  "display": "hinweise"
                },
                "value": "In \u00d6sterreich gesetzlich anerkannte Kirche und Religionsgesellschaft"
              }
            ]
          },
          {
            "code": "117",
            "display": "Serbisch-griechisch-Orthodoxe Kirche",
            "designation": [
              {
                "language": "de-AT",
                "value": "Serbisch-griechisch-orientalische Kirchengemeinde zum Hl. Sava"
              },
              {
                "use": {
                  "system": "https://termgit.elga.gv.at/CodeSystem-austrian-designation-use",
                  "code": "hinweise",
                  "display": "hinweise"
                },
                "value": "In \u00d6sterreich gesetzlich anerkannte Kirche und Religionsgesellschaft"
              }
            ]
          },
          {
            "code": "118",
            "display": "Ukrainisch-Orthodoxe Kirche"
          },
          {
            "code": "119",
            "display": "Orientalisch-Orthodoxe Kirchen",
            "designation": [
              {
                "language": "de-AT",
                "value": "Altorientalische Kirchen (Alte Ostkirchen)"
              },
              {
                "use": {
                  "system": "https://termgit.elga.gv.at/CodeSystem-austrian-designation-use",
                  "code": "hinweise",
                  "display": "hinweise"
                },
                "value": "In \u00d6sterreich gesetzlich anerkannte Kirche und Religionsgesellschaft"
              }
            ]
          },
          {
            "code": "120",
            "display": "Armenisch-apostolische Kirche",
            "designation": [
              {
                "language": "de-AT",
                "value": "Armenisch-apostolische Kirche (Synonym)"
              },
              {
                "use": {
                  "system": "https://termgit.elga.gv.at/CodeSystem-austrian-designation-use",
                  "code": "hinweise",
                  "display": "hinweise"
                },
                "value": "In \u00d6sterreich gesetzlich anerkannte Kirche und Religionsgesellschaft"
              }
            ]
          },
          {
            "code": "121",
            "display": "Syrisch-orthodoxe Kirche",
            "designation": [
              {
                "use": {
                  "system": "https://termgit.elga.gv.at/CodeSystem-austrian-designation-use",
                  "code": "hinweise",
                  "display": "hinweise"
                },
                "value": "In \u00d6sterreich gesetzlich anerkannte Kirche und Religionsgesellschaft"
              }
            ]
          },
          {
            "code": "122",
            "display": "Syrisch-orthodoxe Kirche",
            "designation": [
              {
                "language": "de-AT",
                "value": "Syrisch-orthodoxe Kirche (Synonym)"
              },
              {
                "use": {
                  "system": "https://termgit.elga.gv.at/CodeSystem-austrian-designation-use",
                  "code": "hinweise",
                  "display": "hinweise"
                },
                "value": "In \u00d6sterreich gesetzlich anerkannte Kirche und Religionsgesellschaft"
              }
            ]
          },
          {
            "code": "123",
            "display": "Koptisch-orthodoxe Kirche",
            "designation": [
              {
                "use": {
                  "system": "https://termgit.elga.gv.at/CodeSystem-austrian-designation-use",
                  "code": "hinweise",
                  "display": "hinweise"
                },
                "value": "In \u00d6sterreich gesetzlich anerkannte Kirche und Religionsgesellschaft"
              }
            ]
          },
          {
            "code": "124",
            "display": "Armenisch-apostolische Kirche",
            "designation": [
              {
                "use": {
                  "system": "https://termgit.elga.gv.at/CodeSystem-austrian-designation-use",
                  "code": "hinweise",
                  "display": "hinweise"
                },
                "value": "In \u00d6sterreich gesetzlich anerkannte Kirche und Religionsgesellschaft"
              }
            ]
          },
          {
            "code": "125",
            "display": "\u00c4thiopisch-Orthodoxe Kirche",
            "designation": [
              {
                "language": "de-AT",
                "value": "\u00c4thiopisch-Orthodoxe Tewahedo-Kirche"
              }
            ]
          },
          {
            "code": "126",
            "display": "Evangelische Kirchen \u00d6sterreich",
            "designation": [
              {
                "language": "de-AT",
                "value": "Evangelische Kirchen A.u.H.B. \u00d6sterreich"
              },
              {
                "use": {
                  "system": "https://termgit.elga.gv.at/CodeSystem-austrian-designation-use",
                  "code": "hinweise",
                  "display": "hinweise"
                },
                "value": "In \u00d6sterreich gesetzlich anerkannte Kirche und Religionsgesellschaft"
              }
            ]
          },
          {
            "code": "127",
            "display": "Evangelische Kirche (o.n.A.)",
            "designation": [
              {
                "language": "de-AT",
                "value": "evangelisch (ohne n\u00e4here Angabe)"
              }
            ]
          },
          {
            "code": "128",
            "display": "Evangelische Kirche A.B.",
            "designation": [
              {
                "language": "de-AT",
                "value": "Evangelische Kirche Augsburger Bekenntnis (evangelisch-lutherische Kirche)"
              },
              {
                "use": {
                  "system": "https://termgit.elga.gv.at/CodeSystem-austrian-designation-use",
                  "code": "hinweise",
                  "display": "hinweise"
                },
                "value": "In \u00d6sterreich gesetzlich anerkannte Kirche und Religionsgesellschaft"
              }
            ]
          },
          {
            "code": "129",
            "display": "Evangelische Kirche H.B.",
            "designation": [
              {
                "language": "de-AT",
                "value": "Evangelische Kirche Helvetisches Bekenntnis (evangelisch-reformierte Kirche)"
              },
              {
                "use": {
                  "system": "https://termgit.elga.gv.at/CodeSystem-austrian-designation-use",
                  "code": "hinweise",
                  "display": "hinweise"
                },
                "value": "In \u00d6sterreich gesetzlich anerkannte Kirche und Religionsgesellschaft"
              }
            ]
          },
          {
            "code": "130",
            "display": "Andere Christliche Kirchen",
            "designation": [
              {
                "language": "de-AT",
                "value": "Andere christliche und christlich orientiere Kirchen u. Gemeinschaften (im \u00d6kumenischen Rat)"
              }
            ]
          },
          {
            "code": "131",
            "display": "Altkatholische Kirche \u00d6sterreichs",
            "designation": [
              {
                "use": {
                  "system": "https://termgit.elga.gv.at/CodeSystem-austrian-designation-use",
                  "code": "hinweise",
                  "display": "hinweise"
                },
                "value": "In \u00d6sterreich gesetzlich anerkannte Kirche und Religionsgesellschaft"
              }
            ]
          },
          {
            "code": "132",
            "display": "Anglikanische Kirche"
          },
          {
            "code": "133",
            "display": "Evangelisch-methodistische Kirche (EmK)",
            "designation": [
              {
                "use": {
                  "system": "https://termgit.elga.gv.at/CodeSystem-austrian-designation-use",
                  "code": "hinweise",
                  "display": "hinweise"
                },
                "value": "In \u00d6sterreich gesetzlich anerkannte Kirche und Religionsgesellschaft"
              }
            ]
          },
          {
            "code": "134",
            "display": "Sonstige Christliche Gemeinschaften",
            "designation": [
              {
                "language": "de-AT",
                "value": "Sonstige christliche (christlich orientierte) Gemeinschaften"
              }
            ]
          },
          {
            "code": "135",
            "display": "Baptisten",
            "designation": [
              {
                "language": "de-AT",
                "value": "Bund der Baptistengemeinden in \u00d6sterreich"
              },
              {
                "use": {
                  "system": "https://termgit.elga.gv.at/CodeSystem-austrian-designation-use",
                  "code": "hinweise",
                  "display": "hinweise"
                },
                "value": "Staatlich eingetragene religi\u00f6se Bekenntnisgemeinschaft"
              }
            ]
          },
          {
            "code": "136",
            "display": "Bund evangelikaler Gemeinden in \u00d6sterreich ",
            "designation": [
              {
                "language": "de-AT",
                "value": "Bund evangelikaler Gemeinden in \u00d6sterreich"
              },
              {
                "use": {
                  "system": "https://termgit.elga.gv.at/CodeSystem-austrian-designation-use",
                  "code": "hinweise",
                  "display": "hinweise"
                },
                "value": "Staatlich eingetragene religi\u00f6se Bekenntnisgemeinschaft"
              }
            ]
          },
          {
            "code": "137",
            "display": "Freie Christengemeinde/Pfingstgemeinde ",
            "designation": [
              {
                "language": "de-AT",
                "value": "Freie Christengemeinde/Pfingstgemeinde (FCG\u00d6)"
              },
              {
                "use": {
                  "system": "https://termgit.elga.gv.at/CodeSystem-austrian-designation-use",
                  "code": "hinweise",
                  "display": "hinweise"
                },
                "value": "Staatlich eingetragene religi\u00f6se Bekenntnisgemeinschaft"
              }
            ]
          },
          {
            "code": "138",
            "display": "Mennonitische Freikirche",
            "designation": [
              {
                "language": "de-AT",
                "value": "Mennonitische Freikirche \u00d6sterreichs (MF\u00d6)"
              },
              {
                "use": {
                  "system": "https://termgit.elga.gv.at/CodeSystem-austrian-designation-use",
                  "code": "hinweise",
                  "display": "hinweise"
                },
                "value": "Staatlich eingetragene religi\u00f6se Bekenntnisgemeinschaft"
              }
            ]
          },
          {
            "code": "139",
            "display": "Kirche der Siebenten-Tags-Adventisten ",
            "designation": [
              {
                "language": "de-AT",
                "value": "Kirche der Siebenten-Tags-Adventisten"
              },
              {
                "use": {
                  "system": "https://termgit.elga.gv.at/CodeSystem-austrian-designation-use",
                  "code": "hinweise",
                  "display": "hinweise"
                },
                "value": "Staatlich eingetragene religi\u00f6se Bekenntnisgemeinschaft"
              }
            ]
          },
          {
            "code": "140",
            "display": "Christengemeinschaft",
            "designation": [
              {
                "language": "de-AT",
                "value": "Die Christengemeinschaft - Bewegung f\u00fcr religi\u00f6se Erneuerung in \u00d6sterreich"
              },
              {
                "use": {
                  "system": "https://termgit.elga.gv.at/CodeSystem-austrian-designation-use",
                  "code": "hinweise",
                  "display": "hinweise"
                },
                "value": "Staatlich eingetragene religi\u00f6se Bekenntnisgemeinschaft"
              }
            ]
          },
          {
            "code": "141",
            "display": "Jehovas Zeugen",
            "designation": [
              {
                "use": {
                  "system": "https://termgit.elga.gv.at/CodeSystem-austrian-designation-use",
                  "code": "hinweise",
                  "display": "hinweise"
                },
                "value": "In \u00d6sterreich gesetzlich anerkannte Kirche und Religionsgesellschaft"
              }
            ]
          },
          {
            "code": "142",
            "display": "Neuapostolische Kirche",
            "designation": [
              {
                "use": {
                  "system": "https://termgit.elga.gv.at/CodeSystem-austrian-designation-use",
                  "code": "hinweise",
                  "display": "hinweise"
                },
                "value": "In \u00d6sterreich gesetzlich anerkannte Kirche und Religionsgesellschaft"
              }
            ]
          },
          {
            "code": "143",
            "display": "Mormonen",
            "designation": [
              {
                "language": "de-AT",
                "value": "Kirche Jesu Christi der Heiligen der Letzten Tage (Mormonen) in \u00d6sterreich"
              },
              {
                "use": {
                  "system": "https://termgit.elga.gv.at/CodeSystem-austrian-designation-use",
                  "code": "hinweise",
                  "display": "hinweise"
                },
                "value": "In \u00d6sterreich gesetzlich anerkannte Kirche und Religionsgesellschaft"
              }
            ]
          },
          {
            "code": "144",
            "display": "Sonstige Christliche Gemeinschaften (O.n.A.)",
            "designation": [
              {
                "language": "de-AT",
                "value": "Sonstige christliche (christlich orientierte) Gemeinschaften (ohne n\u00e4here Angabe)"
              }
            ]
          },
          {
            "code": "145",
            "display": "ELAIA Christengemeinden",
            "designation": [
              {
                "language": "de-AT",
                "value": "Bekenntnisgemeinschaft \u0084ELAIA Christengemeinden\u0093"
              },
              {
                "use": {
                  "system": "https://termgit.elga.gv.at/CodeSystem-austrian-designation-use",
                  "code": "hinweise",
                  "display": "hinweise"
                },
                "value": "Staatlich eingetragene religi\u00f6se Bekenntnisgemeinschaft"
              }
            ]
          },
          {
            "code": "146",
            "display": "Pfingstkirche Gemeinde Gottes",
            "designation": [
              {
                "language": "de-AT",
                "value": "Pfingstkirche Gemeinde Gottes in \u00d6sterreich"
              },
              {
                "use": {
                  "system": "https://termgit.elga.gv.at/CodeSystem-austrian-designation-use",
                  "code": "hinweise",
                  "display": "hinweise"
                },
                "value": "Staatlich eingetragene religi\u00f6se Bekenntnisgemeinschaft"
              }
            ]
          },
          {
            "code": "148",
            "display": "Nicht-christliche Gemeinschaften"
          },
          {
            "code": "149",
            "display": "Israelitische Religionsgesellschaft",
            "designation": [
              {
                "use": {
                  "system": "https://termgit.elga.gv.at/CodeSystem-austrian-designation-use",
                  "code": "hinweise",
                  "display": "hinweise"
                },
                "value": "In \u00d6sterreich gesetzlich anerkannte Kirche und Religionsgesellschaft"
              }
            ]
          },
          {
            "code": "150",
            "display": "Islamische Glaubensgemeinschaft ",
            "designation": [
              {
                "language": "de-AT",
                "value": "Islamische Glaubensgemeinschaft"
              },
              {
                "use": {
                  "system": "https://termgit.elga.gv.at/CodeSystem-austrian-designation-use",
                  "code": "hinweise",
                  "display": "hinweise"
                },
                "value": "In \u00d6sterreich gesetzlich anerkannte Kirche und Religionsgesellschaft"
              }
            ]
          },
          {
            "code": "151",
            "display": "Alevitische Religionsgesellschaft",
            "designation": [
              {
                "language": "de-AT",
                "value": "Alevitische Religionsgesellschaft in \u00d6sterreich"
              },
              {
                "use": {
                  "system": "https://termgit.elga.gv.at/CodeSystem-austrian-designation-use",
                  "code": "hinweise",
                  "display": "hinweise"
                },
                "value": "Staatlich eingetragene religi\u00f6se Bekenntnisgemeinschaft"
              }
            ]
          },
          {
            "code": "152",
            "display": "Buddhistische Religionsgesellschaft",
            "designation": [
              {
                "language": "de-AT",
                "value": "\u00d6sterreichische Buddhistische Religionsgesellschaft"
              },
              {
                "use": {
                  "system": "https://termgit.elga.gv.at/CodeSystem-austrian-designation-use",
                  "code": "hinweise",
                  "display": "hinweise"
                },
                "value": "In \u00d6sterreich gesetzlich anerkannte Kirche und Religionsgesellschaft"
              }
            ]
          },
          {
            "code": "153",
            "display": "Baha` i ",
            "designation": [
              {
                "language": "de-AT",
                "value": "Baha\u0091 i Religionsgemeinschaft \u00d6sterreich"
              },
              {
                "use": {
                  "system": "https://termgit.elga.gv.at/CodeSystem-austrian-designation-use",
                  "code": "hinweise",
                  "display": "hinweise"
                },
                "value": "Staatlich eingetragene religi\u00f6se Bekenntnisgemeinschaft"
              }
            ]
          },
          {
            "code": "154",
            "display": "Hinduistische Religionsgesellschaft",
            "designation": [
              {
                "language": "de-AT",
                "value": "Hinduistische Religionsgesellschaft in \u00d6sterreich"
              },
              {
                "use": {
                  "system": "https://termgit.elga.gv.at/CodeSystem-austrian-designation-use",
                  "code": "hinweise",
                  "display": "hinweise"
                },
                "value": "Staatlich eingetragene religi\u00f6se Bekenntnisgemeinschaft"
              }
            ]
          },
          {
            "code": "155",
            "display": "Sikh",
            "designation": [
              {
                "language": "de-AT",
                "value": "Sikh-Religion"
              }
            ]
          },
          {
            "code": "156",
            "display": "Shintoismus"
          },
          {
            "code": "157",
            "display": "Vereinigungskirche",
            "designation": [
              {
                "language": "de-AT",
                "value": "Vereinigungskirche (The Holy Spirit Association for the Unification of World Christianity - Moon)"
              }
            ]
          },
          {
            "code": "162",
            "display": "Pastafarianismus",
            "designation": [
              {
                "language": "de-AT",
                "value": "Vereinigte Kirche des Fliegenden Spaghettimonsters"
              }
            ]
          },
          {
            "code": "158",
            "display": "Andere religi\u00f6se Bekenntnisgemeinschaften",
            "designation": [
              {
                "language": "de-AT",
                "value": "Andere, nicht staatlich anerkannte Religion oder eingetragene religi\u00f6se Bekenntnisgemeinschaft"
              },
              {
                "use": {
                  "system": "https://termgit.elga.gv.at/CodeSystem-austrian-designation-use",
                  "code": "hinweise",
                  "display": "hinweise"
                },
                "value": "Mit NullFlavor 'OTH' ausdr\u00fccken!"
              }
            ]
          },
          {
            "code": "159",
            "display": "Konfessionslos; ohne Angabe",
            "designation": [
              {
                "use": {
                  "system": "https://termgit.elga.gv.at/CodeSystem-austrian-designation-use",
                  "code": "hinweise",
                  "display": "hinweise"
                },
                "value": "Mit NullFlavor 'NI' ausdr\u00fccken!"
              }
            ]
          },
          {
            "code": "160",
            "display": "Konfessionslos",
            "designation": [
              {
                "use": {
                  "system": "https://termgit.elga.gv.at/CodeSystem-austrian-designation-use",
                  "code": "hinweise",
                  "display": "hinweise"
                },
                "value": "Mit NullFlavor 'NA' ausdr\u00fccken!"
              }
            ]
          },
          {
            "code": "161",
            "display": "Ohne Angabe",
            "designation": [
              {
                "use": {
                  "system": "https://termgit.elga.gv.at/CodeSystem-austrian-designation-use",
                  "code": "hinweise",
                  "display": "hinweise"
                },
                "value": "Mit NullFlavor 'UNK' ausdr\u00fccken!"
              }
            ]
          }
        ]
      }
    ]
  },
  "expansion": {
    "timestamp": "2022-09-13T14:15:21Z",
    "contains": [
      {
        "system": "https://termgit.elga.gv.at/CodeSystem-hl7-at-religionaustria",
        "code": "100",
        "display": "Katholische Kirche (o.n.A.)",
        "designation": [
          {
            "language": "de-AT",
            "value": "R\u00f6misch-Katholische Kirchen (mit  23 Teilkirchen, incl Unierte) ohne n\u00e4here Angabe"
          },
          {
            "use": {
              "system": "https://termgit.elga.gv.at/CodeSystem-austrian-designation-use",
              "code": "hinweise",
              "display": "hinweise"
            },
            "value": "In \u00d6sterreich gesetzlich anerkannte Kirche und Religionsgesellschaft"
          }
        ],
        "contains": [
          {
            "system": "https://termgit.elga.gv.at/CodeSystem-hl7-at-religionaustria",
            "code": "101",
            "display": "R\u00f6misch-Katholisch",
            "designation": [
              {
                "language": "de-AT",
                "value": "R\u00f6misch-Katholische Kirche (Lateinischer Ritus)"
              },
              {
                "use": {
                  "system": "https://termgit.elga.gv.at/CodeSystem-austrian-designation-use",
                  "code": "hinweise",
                  "display": "hinweise"
                },
                "value": "In \u00d6sterreich gesetzlich anerkannte Kirche und Religionsgesellschaft"
              }
            ]
          },
          {
            "system": "https://termgit.elga.gv.at/CodeSystem-hl7-at-religionaustria",
            "code": "102",
            "display": "Griechisch-Katholische Kirche",
            "designation": [
              {
                "language": "de-AT",
                "value": "Unierte Kirchen nach byzantinischem Ritus"
              },
              {
                "use": {
                  "system": "https://termgit.elga.gv.at/CodeSystem-austrian-designation-use",
                  "code": "hinweise",
                  "display": "hinweise"
                },
                "value": "In \u00d6sterreich gesetzlich anerkannte Kirche und Religionsgesellschaft"
              }
            ]
          },
          {
            "system": "https://termgit.elga.gv.at/CodeSystem-hl7-at-religionaustria",
            "code": "103",
            "display": "Armenisch-Katholische Kirche",
            "designation": [
              {
                "language": "de-AT",
                "value": "Armenisch-Katholische Kirche (Armenischer Ritus, Mechitaristen)"
              },
              {
                "use": {
                  "system": "https://termgit.elga.gv.at/CodeSystem-austrian-designation-use",
                  "code": "hinweise",
                  "display": "hinweise"
                },
                "value": "In \u00d6sterreich gesetzlich anerkannte Kirche und Religionsgesellschaft"
              }
            ]
          },
          {
            "system": "https://termgit.elga.gv.at/CodeSystem-hl7-at-religionaustria",
            "code": "104",
            "display": "Bulgarisch-Katholische Kirche"
          },
          {
            "system": "https://termgit.elga.gv.at/CodeSystem-hl7-at-religionaustria",
            "code": "105",
            "display": "Rum\u00e4nische griechisch-katholische Kirche"
          },
          {
            "system": "https://termgit.elga.gv.at/CodeSystem-hl7-at-religionaustria",
            "code": "106",
            "display": "Russisch-Katholische Kirche"
          },
          {
            "system": "https://termgit.elga.gv.at/CodeSystem-hl7-at-religionaustria",
            "code": "107",
            "display": "Syrisch-Katholische Kirche"
          },
          {
            "system": "https://termgit.elga.gv.at/CodeSystem-hl7-at-religionaustria",
            "code": "108",
            "display": "Ukrainische Griechisch-Katholische Kirche"
          },
          {
            "system": "https://termgit.elga.gv.at/CodeSystem-hl7-at-religionaustria",
            "code": "109",
            "display": "Katholische Ostkirche (ohne n\u00e4here Angabe)",
            "designation": [
              {
                "language": "de-AT",
                "value": "Unierte Katholische Ostkirchen (ohne n\u00e4here Angabe)"
              }
            ]
          }
        ]
      },
      {
        "system": "https://termgit.elga.gv.at/CodeSystem-hl7-at-religionaustria",
        "code": "110",
        "display": "Griechisch-Orientalische Kirchen",
        "designation": [
          {
            "language": "de-AT",
            "value": "Griechisch-orientalische (=orthodoxe) Kirchen"
          },
          {
            "use": {
              "system": "https://termgit.elga.gv.at/CodeSystem-austrian-designation-use",
              "code": "hinweise",
              "display": "hinweise"
            },
            "value": "In \u00d6sterreich gesetzlich anerkannte Kirche und Religionsgesellschaft"
          }
        ],
        "contains": [
          {
            "system": "https://termgit.elga.gv.at/CodeSystem-hl7-at-religionaustria",
            "code": "111",
            "display": "Orthodoxe Kirchen (o.n.A.)",
            "designation": [
              {
                "language": "de-AT",
                "value": "Orthodoxe Kirche (ohne n\u00e4here Angabe, inkl. andere autokephale K.)"
              }
            ]
          },
          {
            "system": "https://termgit.elga.gv.at/CodeSystem-hl7-at-religionaustria",
            "code": "112",
            "display": "Griechisch-Orthodoxe Kirche (Hl.Dreifaltigkeit)",
            "designation": [
              {
                "language": "de-AT",
                "value": "Griechisch-orientalische Kirchengemeinde zur Hl. Dreifaltigkeit"
              },
              {
                "use": {
                  "system": "https://termgit.elga.gv.at/CodeSystem-austrian-designation-use",
                  "code": "hinweise",
                  "display": "hinweise"
                },
                "value": "In \u00d6sterreich gesetzlich anerkannte Kirche und Religionsgesellschaft"
              }
            ]
          },
          {
            "system": "https://termgit.elga.gv.at/CodeSystem-hl7-at-religionaustria",
            "code": "113",
            "display": "Griechisch-Orthodoxe Kirche (Hl.Georg)",
            "designation": [
              {
                "language": "de-AT",
                "value": "Griechisch-orientalische Kirchengemeinde zum Hl. Georg"
              },
              {
                "use": {
                  "system": "https://termgit.elga.gv.at/CodeSystem-austrian-designation-use",
                  "code": "hinweise",
                  "display": "hinweise"
                },
                "value": "In \u00d6sterreich gesetzlich anerkannte Kirche und Religionsgesellschaft"
              }
            ]
          },
          {
            "system": "https://termgit.elga.gv.at/CodeSystem-hl7-at-religionaustria",
            "code": "114",
            "display": "Bulgarisch-Orthodoxe Kirche",
            "designation": [
              {
                "language": "de-AT",
                "value": "Bulgarisch-orthodoxe Kirchengemeinde zum Hl. Iwan Rilski"
              },
              {
                "use": {
                  "system": "https://termgit.elga.gv.at/CodeSystem-austrian-designation-use",
                  "code": "hinweise",
                  "display": "hinweise"
                },
                "value": "In \u00d6sterreich gesetzlich anerkannte Kirche und Religionsgesellschaft"
              }
            ]
          },
          {
            "system": "https://termgit.elga.gv.at/CodeSystem-hl7-at-religionaustria",
            "code": "115",
            "display": "Rum\u00e4nisch-griechisch-orientalische Kirche",
            "designation": [
              {
                "language": "de-AT",
                "value": "Rum\u00e4nisch-griechisch-orientalische Kirchengemeinde zur Hl. Auferstehung"
              },
              {
                "use": {
                  "system": "https://termgit.elga.gv.at/CodeSystem-austrian-designation-use",
                  "code": "hinweise",
                  "display": "hinweise"
                },
                "value": "In \u00d6sterreich gesetzlich anerkannte Kirche und Religionsgesellschaft"
              }
            ]
          },
          {
            "system": "https://termgit.elga.gv.at/CodeSystem-hl7-at-religionaustria",
            "code": "116",
            "display": "Russisch-Orthodoxe Kirche",
            "designation": [
              {
                "language": "de-AT",
                "value": "Russisch-orthodoxe Kirchengemeinde zum Hl. Nikolaus"
              },
              {
                "use": {
                  "system": "https://termgit.elga.gv.at/CodeSystem-austrian-designation-use",
                  "code": "hinweise",
                  "display": "hinweise"
                },
                "value": "In \u00d6sterreich gesetzlich anerkannte Kirche und Religionsgesellschaft"
              }
            ]
          },
          {
            "system": "https://termgit.elga.gv.at/CodeSystem-hl7-at-religionaustria",
            "code": "117",
            "display": "Serbisch-griechisch-Orthodoxe Kirche",
            "designation": [
              {
                "language": "de-AT",
                "value": "Serbisch-griechisch-orientalische Kirchengemeinde zum Hl. Sava"
              },
              {
                "use": {
                  "system": "https://termgit.elga.gv.at/CodeSystem-austrian-designation-use",
                  "code": "hinweise",
                  "display": "hinweise"
                },
                "value": "In \u00d6sterreich gesetzlich anerkannte Kirche und Religionsgesellschaft"
              }
            ]
          },
          {
            "system": "https://termgit.elga.gv.at/CodeSystem-hl7-at-religionaustria",
            "code": "118",
            "display": "Ukrainisch-Orthodoxe Kirche"
          }
        ]
      },
      {
        "system": "https://termgit.elga.gv.at/CodeSystem-hl7-at-religionaustria",
        "code": "119",
        "display": "Orientalisch-Orthodoxe Kirchen",
        "designation": [
          {
            "language": "de-AT",
            "value": "Altorientalische Kirchen (Alte Ostkirchen)"
          },
          {
            "use": {
              "system": "https://termgit.elga.gv.at/CodeSystem-austrian-designation-use",
              "code": "hinweise",
              "display": "hinweise"
            },
            "value": "In \u00d6sterreich gesetzlich anerkannte Kirche und Religionsgesellschaft"
          }
        ],
        "contains": [
          {
            "system": "https://termgit.elga.gv.at/CodeSystem-hl7-at-religionaustria",
            "code": "120",
            "display": "Armenisch-apostolische Kirche",
            "designation": [
              {
                "language": "de-AT",
                "value": "Armenisch-apostolische Kirche (Synonym)"
              },
              {
                "use": {
                  "system": "https://termgit.elga.gv.at/CodeSystem-austrian-designation-use",
                  "code": "hinweise",
                  "display": "hinweise"
                },
                "value": "In \u00d6sterreich gesetzlich anerkannte Kirche und Religionsgesellschaft"
              }
            ]
          },
          {
            "system": "https://termgit.elga.gv.at/CodeSystem-hl7-at-religionaustria",
            "code": "121",
            "display": "Syrisch-orthodoxe Kirche",
            "designation": [
              {
                "use": {
                  "system": "https://termgit.elga.gv.at/CodeSystem-austrian-designation-use",
                  "code": "hinweise",
                  "display": "hinweise"
                },
                "value": "In \u00d6sterreich gesetzlich anerkannte Kirche und Religionsgesellschaft"
              }
            ]
          },
          {
            "system": "https://termgit.elga.gv.at/CodeSystem-hl7-at-religionaustria",
            "code": "122",
            "display": "Syrisch-orthodoxe Kirche",
            "designation": [
              {
                "language": "de-AT",
                "value": "Syrisch-orthodoxe Kirche (Synonym)"
              },
              {
                "use": {
                  "system": "https://termgit.elga.gv.at/CodeSystem-austrian-designation-use",
                  "code": "hinweise",
                  "display": "hinweise"
                },
                "value": "In \u00d6sterreich gesetzlich anerkannte Kirche und Religionsgesellschaft"
              }
            ]
          },
          {
            "system": "https://termgit.elga.gv.at/CodeSystem-hl7-at-religionaustria",
            "code": "123",
            "display": "Koptisch-orthodoxe Kirche",
            "designation": [
              {
                "use": {
                  "system": "https://termgit.elga.gv.at/CodeSystem-austrian-designation-use",
                  "code": "hinweise",
                  "display": "hinweise"
                },
                "value": "In \u00d6sterreich gesetzlich anerkannte Kirche und Religionsgesellschaft"
              }
            ]
          },
          {
            "system": "https://termgit.elga.gv.at/CodeSystem-hl7-at-religionaustria",
            "code": "124",
            "display": "Armenisch-apostolische Kirche",
            "designation": [
              {
                "use": {
                  "system": "https://termgit.elga.gv.at/CodeSystem-austrian-designation-use",
                  "code": "hinweise",
                  "display": "hinweise"
                },
                "value": "In \u00d6sterreich gesetzlich anerkannte Kirche und Religionsgesellschaft"
              }
            ]
          },
          {
            "system": "https://termgit.elga.gv.at/CodeSystem-hl7-at-religionaustria",
            "code": "125",
            "display": "\u00c4thiopisch-Orthodoxe Kirche",
            "designation": [
              {
                "language": "de-AT",
                "value": "\u00c4thiopisch-Orthodoxe Tewahedo-Kirche"
              }
            ]
          }
        ]
      },
      {
        "system": "https://termgit.elga.gv.at/CodeSystem-hl7-at-religionaustria",
        "code": "126",
        "display": "Evangelische Kirchen \u00d6sterreich",
        "designation": [
          {
            "language": "de-AT",
            "value": "Evangelische Kirchen A.u.H.B. \u00d6sterreich"
          },
          {
            "use": {
              "system": "https://termgit.elga.gv.at/CodeSystem-austrian-designation-use",
              "code": "hinweise",
              "display": "hinweise"
            },
            "value": "In \u00d6sterreich gesetzlich anerkannte Kirche und Religionsgesellschaft"
          }
        ],
        "contains": [
          {
            "system": "https://termgit.elga.gv.at/CodeSystem-hl7-at-religionaustria",
            "code": "127",
            "display": "Evangelische Kirche (o.n.A.)",
            "designation": [
              {
                "language": "de-AT",
                "value": "evangelisch (ohne n\u00e4here Angabe)"
              }
            ]
          },
          {
            "system": "https://termgit.elga.gv.at/CodeSystem-hl7-at-religionaustria",
            "code": "128",
            "display": "Evangelische Kirche A.B.",
            "designation": [
              {
                "language": "de-AT",
                "value": "Evangelische Kirche Augsburger Bekenntnis (evangelisch-lutherische Kirche)"
              },
              {
                "use": {
                  "system": "https://termgit.elga.gv.at/CodeSystem-austrian-designation-use",
                  "code": "hinweise",
                  "display": "hinweise"
                },
                "value": "In \u00d6sterreich gesetzlich anerkannte Kirche und Religionsgesellschaft"
              }
            ]
          },
          {
            "system": "https://termgit.elga.gv.at/CodeSystem-hl7-at-religionaustria",
            "code": "129",
            "display": "Evangelische Kirche H.B.",
            "designation": [
              {
                "language": "de-AT",
                "value": "Evangelische Kirche Helvetisches Bekenntnis (evangelisch-reformierte Kirche)"
              },
              {
                "use": {
                  "system": "https://termgit.elga.gv.at/CodeSystem-austrian-designation-use",
                  "code": "hinweise",
                  "display": "hinweise"
                },
                "value": "In \u00d6sterreich gesetzlich anerkannte Kirche und Religionsgesellschaft"
              }
            ]
          }
        ]
      },
      {
        "system": "https://termgit.elga.gv.at/CodeSystem-hl7-at-religionaustria",
        "code": "130",
        "display": "Andere Christliche Kirchen",
        "designation": [
          {
            "language": "de-AT",
            "value": "Andere christliche und christlich orientiere Kirchen u. Gemeinschaften (im \u00d6kumenischen Rat)"
          }
        ],
        "contains": [
          {
            "system": "https://termgit.elga.gv.at/CodeSystem-hl7-at-religionaustria",
            "code": "131",
            "display": "Altkatholische Kirche \u00d6sterreichs",
            "designation": [
              {
                "use": {
                  "system": "https://termgit.elga.gv.at/CodeSystem-austrian-designation-use",
                  "code": "hinweise",
                  "display": "hinweise"
                },
                "value": "In \u00d6sterreich gesetzlich anerkannte Kirche und Religionsgesellschaft"
              }
            ]
          },
          {
            "system": "https://termgit.elga.gv.at/CodeSystem-hl7-at-religionaustria",
            "code": "132",
            "display": "Anglikanische Kirche"
          },
          {
            "system": "https://termgit.elga.gv.at/CodeSystem-hl7-at-religionaustria",
            "code": "133",
            "display": "Evangelisch-methodistische Kirche (EmK)",
            "designation": [
              {
                "use": {
                  "system": "https://termgit.elga.gv.at/CodeSystem-austrian-designation-use",
                  "code": "hinweise",
                  "display": "hinweise"
                },
                "value": "In \u00d6sterreich gesetzlich anerkannte Kirche und Religionsgesellschaft"
              }
            ]
          }
        ]
      },
      {
        "system": "https://termgit.elga.gv.at/CodeSystem-hl7-at-religionaustria",
        "code": "134",
        "display": "Sonstige Christliche Gemeinschaften",
        "designation": [
          {
            "language": "de-AT",
            "value": "Sonstige christliche (christlich orientierte) Gemeinschaften"
          }
        ],
        "contains": [
          {
            "system": "https://termgit.elga.gv.at/CodeSystem-hl7-at-religionaustria",
            "code": "135",
            "display": "Baptisten",
            "designation": [
              {
                "language": "de-AT",
                "value": "Bund der Baptistengemeinden in \u00d6sterreich"
              },
              {
                "use": {
                  "system": "https://termgit.elga.gv.at/CodeSystem-austrian-designation-use",
                  "code": "hinweise",
                  "display": "hinweise"
                },
                "value": "Staatlich eingetragene religi\u00f6se Bekenntnisgemeinschaft"
              }
            ]
          },
          {
            "system": "https://termgit.elga.gv.at/CodeSystem-hl7-at-religionaustria",
            "code": "136",
            "display": "Bund evangelikaler Gemeinden in \u00d6sterreich ",
            "designation": [
              {
                "language": "de-AT",
                "value": "Bund evangelikaler Gemeinden in \u00d6sterreich"
              },
              {
                "use": {
                  "system": "https://termgit.elga.gv.at/CodeSystem-austrian-designation-use",
                  "code": "hinweise",
                  "display": "hinweise"
                },
                "value": "Staatlich eingetragene religi\u00f6se Bekenntnisgemeinschaft"
              }
            ]
          },
          {
            "system": "https://termgit.elga.gv.at/CodeSystem-hl7-at-religionaustria",
            "code": "137",
            "display": "Freie Christengemeinde/Pfingstgemeinde ",
            "designation": [
              {
                "language": "de-AT",
                "value": "Freie Christengemeinde/Pfingstgemeinde (FCG\u00d6)"
              },
              {
                "use": {
                  "system": "https://termgit.elga.gv.at/CodeSystem-austrian-designation-use",
                  "code": "hinweise",
                  "display": "hinweise"
                },
                "value": "Staatlich eingetragene religi\u00f6se Bekenntnisgemeinschaft"
              }
            ]
          },
          {
            "system": "https://termgit.elga.gv.at/CodeSystem-hl7-at-religionaustria",
            "code": "138",
            "display": "Mennonitische Freikirche",
            "designation": [
              {
                "language": "de-AT",
                "value": "Mennonitische Freikirche \u00d6sterreichs (MF\u00d6)"
              },
              {
                "use": {
                  "system": "https://termgit.elga.gv.at/CodeSystem-austrian-designation-use",
                  "code": "hinweise",
                  "display": "hinweise"
                },
                "value": "Staatlich eingetragene religi\u00f6se Bekenntnisgemeinschaft"
              }
            ]
          },
          {
            "system": "https://termgit.elga.gv.at/CodeSystem-hl7-at-religionaustria",
            "code": "139",
            "display": "Kirche der Siebenten-Tags-Adventisten ",
            "designation": [
              {
                "language": "de-AT",
                "value": "Kirche der Siebenten-Tags-Adventisten"
              },
              {
                "use": {
                  "system": "https://termgit.elga.gv.at/CodeSystem-austrian-designation-use",
                  "code": "hinweise",
                  "display": "hinweise"
                },
                "value": "Staatlich eingetragene religi\u00f6se Bekenntnisgemeinschaft"
              }
            ]
          },
          {
            "system": "https://termgit.elga.gv.at/CodeSystem-hl7-at-religionaustria",
            "code": "140",
            "display": "Christengemeinschaft",
            "designation": [
              {
                "language": "de-AT",
                "value": "Die Christengemeinschaft - Bewegung f\u00fcr religi\u00f6se Erneuerung in \u00d6sterreich"
              },
              {
                "use": {
                  "system": "https://termgit.elga.gv.at/CodeSystem-austrian-designation-use",
                  "code": "hinweise",
                  "display": "hinweise"
                },
                "value": "Staatlich eingetragene religi\u00f6se Bekenntnisgemeinschaft"
              }
            ]
          },
          {
            "system": "https://termgit.elga.gv.at/CodeSystem-hl7-at-religionaustria",
            "code": "141",
            "display": "Jehovas Zeugen",
            "designation": [
              {
                "use": {
                  "system": "https://termgit.elga.gv.at/CodeSystem-austrian-designation-use",
                  "code": "hinweise",
                  "display": "hinweise"
                },
                "value": "In \u00d6sterreich gesetzlich anerkannte Kirche und Religionsgesellschaft"
              }
            ]
          },
          {
            "system": "https://termgit.elga.gv.at/CodeSystem-hl7-at-religionaustria",
            "code": "142",
            "display": "Neuapostolische Kirche",
            "designation": [
              {
                "use": {
                  "system": "https://termgit.elga.gv.at/CodeSystem-austrian-designation-use",
                  "code": "hinweise",
                  "display": "hinweise"
                },
                "value": "In \u00d6sterreich gesetzlich anerkannte Kirche und Religionsgesellschaft"
              }
            ]
          },
          {
            "system": "https://termgit.elga.gv.at/CodeSystem-hl7-at-religionaustria",
            "code": "143",
            "display": "Mormonen",
            "designation": [
              {
                "language": "de-AT",
                "value": "Kirche Jesu Christi der Heiligen der Letzten Tage (Mormonen) in \u00d6sterreich"
              },
              {
                "use": {
                  "system": "https://termgit.elga.gv.at/CodeSystem-austrian-designation-use",
                  "code": "hinweise",
                  "display": "hinweise"
                },
                "value": "In \u00d6sterreich gesetzlich anerkannte Kirche und Religionsgesellschaft"
              }
            ]
          },
          {
            "system": "https://termgit.elga.gv.at/CodeSystem-hl7-at-religionaustria",
            "code": "144",
            "display": "Sonstige Christliche Gemeinschaften (O.n.A.)",
            "designation": [
              {
                "language": "de-AT",
                "value": "Sonstige christliche (christlich orientierte) Gemeinschaften (ohne n\u00e4here Angabe)"
              }
            ]
          },
          {
            "system": "https://termgit.elga.gv.at/CodeSystem-hl7-at-religionaustria",
            "code": "145",
            "display": "ELAIA Christengemeinden",
            "designation": [
              {
                "language": "de-AT",
                "value": "Bekenntnisgemeinschaft \u0084ELAIA Christengemeinden\u0093"
              },
              {
                "use": {
                  "system": "https://termgit.elga.gv.at/CodeSystem-austrian-designation-use",
                  "code": "hinweise",
                  "display": "hinweise"
                },
                "value": "Staatlich eingetragene religi\u00f6se Bekenntnisgemeinschaft"
              }
            ]
          },
          {
            "system": "https://termgit.elga.gv.at/CodeSystem-hl7-at-religionaustria",
            "code": "146",
            "display": "Pfingstkirche Gemeinde Gottes",
            "designation": [
              {
                "language": "de-AT",
                "value": "Pfingstkirche Gemeinde Gottes in \u00d6sterreich"
              },
              {
                "use": {
                  "system": "https://termgit.elga.gv.at/CodeSystem-austrian-designation-use",
                  "code": "hinweise",
                  "display": "hinweise"
                },
                "value": "Staatlich eingetragene religi\u00f6se Bekenntnisgemeinschaft"
              }
            ]
          }
        ]
      },
      {
        "system": "https://termgit.elga.gv.at/CodeSystem-hl7-at-religionaustria",
        "code": "148",
        "display": "Nicht-christliche Gemeinschaften",
        "contains": [
          {
            "system": "https://termgit.elga.gv.at/CodeSystem-hl7-at-religionaustria",
            "code": "149",
            "display": "Israelitische Religionsgesellschaft",
            "designation": [
              {
                "use": {
                  "system": "https://termgit.elga.gv.at/CodeSystem-austrian-designation-use",
                  "code": "hinweise",
                  "display": "hinweise"
                },
                "value": "In \u00d6sterreich gesetzlich anerkannte Kirche und Religionsgesellschaft"
              }
            ]
          },
          {
            "system": "https://termgit.elga.gv.at/CodeSystem-hl7-at-religionaustria",
            "code": "150",
            "display": "Islamische Glaubensgemeinschaft ",
            "designation": [
              {
                "language": "de-AT",
                "value": "Islamische Glaubensgemeinschaft"
              },
              {
                "use": {
                  "system": "https://termgit.elga.gv.at/CodeSystem-austrian-designation-use",
                  "code": "hinweise",
                  "display": "hinweise"
                },
                "value": "In \u00d6sterreich gesetzlich anerkannte Kirche und Religionsgesellschaft"
              }
            ]
          },
          {
            "system": "https://termgit.elga.gv.at/CodeSystem-hl7-at-religionaustria",
            "code": "151",
            "display": "Alevitische Religionsgesellschaft",
            "designation": [
              {
                "language": "de-AT",
                "value": "Alevitische Religionsgesellschaft in \u00d6sterreich"
              },
              {
                "use": {
                  "system": "https://termgit.elga.gv.at/CodeSystem-austrian-designation-use",
                  "code": "hinweise",
                  "display": "hinweise"
                },
                "value": "Staatlich eingetragene religi\u00f6se Bekenntnisgemeinschaft"
              }
            ]
          },
          {
            "system": "https://termgit.elga.gv.at/CodeSystem-hl7-at-religionaustria",
            "code": "152",
            "display": "Buddhistische Religionsgesellschaft",
            "designation": [
              {
                "language": "de-AT",
                "value": "\u00d6sterreichische Buddhistische Religionsgesellschaft"
              },
              {
                "use": {
                  "system": "https://termgit.elga.gv.at/CodeSystem-austrian-designation-use",
                  "code": "hinweise",
                  "display": "hinweise"
                },
                "value": "In \u00d6sterreich gesetzlich anerkannte Kirche und Religionsgesellschaft"
              }
            ]
          },
          {
            "system": "https://termgit.elga.gv.at/CodeSystem-hl7-at-religionaustria",
            "code": "153",
            "display": "Baha` i ",
            "designation": [
              {
                "language": "de-AT",
                "value": "Baha\u0091 i Religionsgemeinschaft \u00d6sterreich"
              },
              {
                "use": {
                  "system": "https://termgit.elga.gv.at/CodeSystem-austrian-designation-use",
                  "code": "hinweise",
                  "display": "hinweise"
                },
                "value": "Staatlich eingetragene religi\u00f6se Bekenntnisgemeinschaft"
              }
            ]
          },
          {
            "system": "https://termgit.elga.gv.at/CodeSystem-hl7-at-religionaustria",
            "code": "154",
            "display": "Hinduistische Religionsgesellschaft",
            "designation": [
              {
                "language": "de-AT",
                "value": "Hinduistische Religionsgesellschaft in \u00d6sterreich"
              },
              {
                "use": {
                  "system": "https://termgit.elga.gv.at/CodeSystem-austrian-designation-use",
                  "code": "hinweise",
                  "display": "hinweise"
                },
                "value": "Staatlich eingetragene religi\u00f6se Bekenntnisgemeinschaft"
              }
            ]
          },
          {
            "system": "https://termgit.elga.gv.at/CodeSystem-hl7-at-religionaustria",
            "code": "155",
            "display": "Sikh",
            "designation": [
              {
                "language": "de-AT",
                "value": "Sikh-Religion"
              }
            ]
          },
          {
            "system": "https://termgit.elga.gv.at/CodeSystem-hl7-at-religionaustria",
            "code": "156",
            "display": "Shintoismus"
          },
          {
            "system": "https://termgit.elga.gv.at/CodeSystem-hl7-at-religionaustria",
            "code": "157",
            "display": "Vereinigungskirche",
            "designation": [
              {
                "language": "de-AT",
                "value": "Vereinigungskirche (The Holy Spirit Association for the Unification of World Christianity - Moon)"
              }
            ]
          },
          {
            "system": "https://termgit.elga.gv.at/CodeSystem-hl7-at-religionaustria",
            "code": "162",
            "display": "Pastafarianismus",
            "designation": [
              {
                "language": "de-AT",
                "value": "Vereinigte Kirche des Fliegenden Spaghettimonsters"
              }
            ]
          },
          {
            "system": "https://termgit.elga.gv.at/CodeSystem-hl7-at-religionaustria",
            "abstract": true,
            "code": "158",
            "display": "Andere religi\u00f6se Bekenntnisgemeinschaften",
            "designation": [
              {
                "language": "de-AT",
                "value": "Andere, nicht staatlich anerkannte Religion oder eingetragene religi\u00f6se Bekenntnisgemeinschaft"
              },
              {
                "use": {
                  "system": "https://termgit.elga.gv.at/CodeSystem-austrian-designation-use",
                  "code": "hinweise",
                  "display": "hinweise"
                },
                "value": "Mit NullFlavor 'OTH' ausdr\u00fccken!"
              }
            ]
          }
        ]
      },
      {
        "system": "https://termgit.elga.gv.at/CodeSystem-hl7-at-religionaustria",
        "abstract": true,
        "code": "159",
        "display": "Konfessionslos; ohne Angabe",
        "designation": [
          {
            "use": {
              "system": "https://termgit.elga.gv.at/CodeSystem-austrian-designation-use",
              "code": "hinweise",
              "display": "hinweise"
            },
            "value": "Mit NullFlavor 'NI' ausdr\u00fccken!"
          }
        ],
        "contains": [
          {
            "system": "https://termgit.elga.gv.at/CodeSystem-hl7-at-religionaustria",
            "abstract": true,
            "code": "160",
            "display": "Konfessionslos",
            "designation": [
              {
                "use": {
                  "system": "https://termgit.elga.gv.at/CodeSystem-austrian-designation-use",
                  "code": "hinweise",
                  "display": "hinweise"
                },
                "value": "Mit NullFlavor 'NA' ausdr\u00fccken!"
              }
            ]
          },
          {
            "system": "https://termgit.elga.gv.at/CodeSystem-hl7-at-religionaustria",
            "abstract": true,
            "code": "161",
            "display": "Ohne Angabe",
            "designation": [
              {
                "use": {
                  "system": "https://termgit.elga.gv.at/CodeSystem-austrian-designation-use",
                  "code": "hinweise",
                  "display": "hinweise"
                },
                "value": "Mit NullFlavor 'UNK' ausdr\u00fccken!"
              }
            ]
          }
        ]
      }
    ]
  }
}