'code';'codeSystem';'displayName';'parentCodeSystemName';'concept_Beschreibung';'meaning';'hints';'orderNumber';'level';'type';'relationships';'einheit print';'einheit codiert'
'Verstorben';'1.2.40.0.34.5.105';'Verstorben';'https://termgit.elga.gv.at/CodeSystem-ems-krankheitsmerkmale';;;;'1';'0';'A';;;
'TOD';'1.2.40.0.34.5.105';'Tod';'https://termgit.elga.gv.at/CodeSystem-ems-krankheitsmerkmale';;;;'2';'1';'L';;;
'TOD_KRANKHEIT';'1.2.40.0.34.5.105';'Krankheitsbezogener Tod';'https://termgit.elga.gv.at/CodeSystem-ems-krankheitsmerkmale';;;;'3';'1';'L';;;
'AUSSCHEIDER';'1.2.40.0.34.5.105';'Ausscheider';'https://termgit.elga.gv.at/CodeSystem-ems-krankheitsmerkmale';;;;'4';'0';'L';;;
'ASYMPTOMATISCH';'1.2.40.0.34.5.105';'Asymptomatisch';'https://termgit.elga.gv.at/CodeSystem-ems-krankheitsmerkmale';;;;'5';'0';'L';;;
