'code';'codeSystem';'displayName';'parentCodeSystemName';'concept_Beschreibung';'meaning';'hints';'orderNumber';'level';'type';'relationships';'einheit print';'einheit codiert'
'IG1';'1.2.40.0.34.5.183';'Indikationsimpfung für Risikogruppe';'https://termgit.elga.gv.at/CodeSystem-eimpf-ergaenzung';'';'';'';'1';'0';'L';'';'';''
'IG2';'1.2.40.0.34.5.183';'Wiederholungsimpfung aufgrund medizinischer Indikation';'https://termgit.elga.gv.at/CodeSystem-eimpf-ergaenzung';'';'';'';'2';'0';'L';'';'';''
