'code';'codeSystem';'displayName';'parentCode';'concept_Beschreibung';'meaning';'hints';'level';'type';'relationships'
'A';'1.2.40.0.34.5.60';'Serotyp A';;;;;'0';'L';
'B';'1.2.40.0.34.5.60';'Serotyp B';;;;;'0';'L';
'BRUCELLOSE';'1.2.40.0.34.5.60';'Brucellose';;;;;'0';'S';
'BRUABO';'1.2.40.0.34.5.60';'Brucella abortus';;;;;'1';'L';
'BRUCAN';'1.2.40.0.34.5.60';'Brucella canis';;;;;'1';'L';
'BRUMEL';'1.2.40.0.34.5.60';'Brucella melitensis';;;;;'1';'L';
'BRUOTHER';'1.2.40.0.34.5.60';'andere Brucelloseart';;;;;'1';'L';
'BRUSPP';'1.2.40.0.34.5.60';'Brucelloseart nicht spezifiziert';;;;;'1';'L';
'BRUSUI';'1.2.40.0.34.5.60';'Brucella suis';;;;;'1';'L';
'CAMPYLOBAKTER';'1.2.40.0.34.5.60';'Campylobakter';;;;;'0';'S';
'CAMCOL';'1.2.40.0.34.5.60';'C.coli';;;;;'1';'L';
'CAMCON';'1.2.40.0.34.5.60';'C.concisus';;;;;'1';'L';
'CAMCURV';'1.2.40.0.34.5.60';'C.curvus';;;;;'1';'L';
'CAMFET';'1.2.40.0.34.5.60';'C.fetus';;;;;'1';'L';
'CAMGRAC';'1.2.40.0.34.5.60';'C.gracilis';;;;;'1';'L';
'CAMHELV';'1.2.40.0.34.5.60';'C.helveticus';;;;;'1';'L';
'CAMHOM';'1.2.40.0.34.5.60';'C.hominis';;;;;'1';'L';
'CAMHYO';'1.2.40.0.34.5.60';'C.hyointestinalis';;;;;'1';'L';
'CAMJEJ';'1.2.40.0.34.5.60';'C.jejuni';;;;;'1';'L';
'CAMLAN';'1.2.40.0.34.5.60';'C.lanienae';;;;;'1';'L';
'CAMLAR';'1.2.40.0.34.5.60';'C.lari';;;;;'1';'L';
'CAMMUCO';'1.2.40.0.34.5.60';'C.mucosalis';;;;;'1';'L';
'CAMRECT';'1.2.40.0.34.5.60';'C.rectus';;;;;'1';'L';
'CAMSHOW';'1.2.40.0.34.5.60';'C.showae';;;;;'1';'L';
'CAMSPP';'1.2.40.0.34.5.60';'Campylobactererreger nicht spezifiziert';;;;;'1';'L';
'CAMSPUT';'1.2.40.0.34.5.60';'C.sputorum';;;;;'1';'L';
'CAMUPS';'1.2.40.0.34.5.60';'C.upsaliensis';;;;;'1';'L';
'CLOSTRIDIUM';'1.2.40.0.34.5.60';'Clostridium';;;;;'0';'S';
'RIBO_001';'1.2.40.0.34.5.60';'Ribotyp 001';;;;;'1';'L';
'RIBO_002';'1.2.40.0.34.5.60';'Ribotyp 002';;;;;'1';'L';
'RIBO_003';'1.2.40.0.34.5.60';'Ribotyp 003';;;;;'1';'L';
'RIBO_012';'1.2.40.0.34.5.60';'Ribotyp 012';;;;;'1';'L';
'RIBO_014';'1.2.40.0.34.5.60';'Ribotyp 014';;;;;'1';'L';
'RIBO_015';'1.2.40.0.34.5.60';'Ribotyp 015';;;;;'1';'L';
'RIBO_017';'1.2.40.0.34.5.60';'Ribotyp 017';;;;;'1';'L';
'RIBO_020';'1.2.40.0.34.5.60';'Ribotyp 020';;;;;'1';'L';
'RIBO_023';'1.2.40.0.34.5.60';'Ribotyp 023';;;;;'1';'L';
'RIBO_027';'1.2.40.0.34.5.60';'Ribotyp 027';;;;;'1';'L';
'RIBO_029';'1.2.40.0.34.5.60';'Ribotyp 029';;;;;'1';'L';
'RIBO_046';'1.2.40.0.34.5.60';'Ribotyp 046';;;;;'1';'L';
'RIBO_053';'1.2.40.0.34.5.60';'Ribotyp 053';;;;;'1';'L';
'RIBO_056';'1.2.40.0.34.5.60';'Ribotyp 056';;;;;'1';'L';
'RIBO_066';'1.2.40.0.34.5.60';'Ribotyp 066';;;;;'1';'L';
'RIBO_070';'1.2.40.0.34.5.60';'Ribotyp 070';;;;;'1';'L';
'RIBO_075';'1.2.40.0.34.5.60';'Ribotyp 075';;;;;'1';'L';
'RIBO_077';'1.2.40.0.34.5.60';'Ribotyp 077';;;;;'1';'L';
'RIBO_078';'1.2.40.0.34.5.60';'Ribotyp 078';;;;;'1';'L';
'RIBO_081';'1.2.40.0.34.5.60';'Ribotyp 081';;;;;'1';'L';
'RIBO_087';'1.2.40.0.34.5.60';'Ribotyp 087';;;;;'1';'L';
'RIBO_095';'1.2.40.0.34.5.60';'Ribotyp 095';;;;;'1';'L';
'RIBO_106';'1.2.40.0.34.5.60';'Ribotyp 106';;;;;'1';'L';
'RIBO_117';'1.2.40.0.34.5.60';'Ribotyp 117';;;;;'1';'L';
'RIBO_126';'1.2.40.0.34.5.60';'Ribotyp 126';;;;;'1';'L';
'RIBO_131';'1.2.40.0.34.5.60';'Ribotyp 131';;;;;'1';'L';
'RIBO_AI_1';'1.2.40.0.34.5.60';'Ribotyp AI-1';;;;;'1';'L';
'RIBO_AI_10';'1.2.40.0.34.5.60';'Ribotyp AI-10';;;;;'1';'L';
'RIBO_AI_12';'1.2.40.0.34.5.60';'Ribotyp AI-12';;;;;'1';'L';
'RIBO_AI_14';'1.2.40.0.34.5.60';'Ribotyp AI-14';;;;;'1';'L';
'RIBO_AI_17';'1.2.40.0.34.5.60';'Ribotyp AI-17';;;;;'1';'L';
'RIBO_AI_19';'1.2.40.0.34.5.60';'Ribotyp AI-19';;;;;'1';'L';
'RIBO_AI_2';'1.2.40.0.34.5.60';'Ribotyp AI-2';;;;;'1';'L';
'RIBO_AI_20';'1.2.40.0.34.5.60';'Ribotyp AI-20';;;;;'1';'L';
'RIBO_AI_23';'1.2.40.0.34.5.60';'Ribotyp AI-23';;;;;'1';'L';
'RIBO_AI_27';'1.2.40.0.34.5.60';'Ribotyp AI-27';;;;;'1';'L';
'RIBO_AI_29';'1.2.40.0.34.5.60';'Ribotyp AI-29';;;;;'1';'L';
'RIBO_AI_3';'1.2.40.0.34.5.60';'Ribotyp AI-3';;;;;'1';'L';
'RIBO_AI_50';'1.2.40.0.34.5.60';'Ribotyp AI-50';;;;;'1';'L';
'RIBO_AI_52';'1.2.40.0.34.5.60';'Ribotyp AI-52';;;;;'1';'L';
'RIBO_AI_6';'1.2.40.0.34.5.60';'Ribotyp AI-6';;;;;'1';'L';
'RIBO_AI_8';'1.2.40.0.34.5.60';'Ribotyp AI-8';;;;;'1';'L';
'RIBO_AI_9';'1.2.40.0.34.5.60';'Ribotyp AI-9';;;;;'1';'L';
'RIBO_IHMT_EL_1';'1.2.40.0.34.5.60';'Ribotyp IHMT-EL 1';;;;;'1';'L';
'RIBO_IHMT_EL_10';'1.2.40.0.34.5.60';'Ribotyp IHMT-EL 10';;;;;'1';'L';
'RIBO_IHMT_EL_11';'1.2.40.0.34.5.60';'Ribotyp IHMT-EL 11';;;;;'1';'L';
'RIBO_IHMT_EL_12';'1.2.40.0.34.5.60';'Ribotyp IHMT-EL 12';;;;;'1';'L';
'RIBO_IHMT_EL_13';'1.2.40.0.34.5.60';'Ribotyp IHMT-EL 13';;;;;'1';'L';
'RIBO_IHMT_EL_2';'1.2.40.0.34.5.60';'Ribotyp IHMT-EL 2';;;;;'1';'L';
'RIBO_IHMT_EL_3';'1.2.40.0.34.5.60';'Ribotyp IHMT-EL 3';;;;;'1';'L';
'RIBO_IHMT_EL_4';'1.2.40.0.34.5.60';'Ribotyp IHMT-EL 4';;;;;'1';'L';
'RIBO_IHMT_EL_5';'1.2.40.0.34.5.60';'Ribotyp IHMT-EL 5';;;;;'1';'L';
'RIBO_IHMT_EL_6';'1.2.40.0.34.5.60';'Ribotyp IHMT-EL 6';;;;;'1';'L';
'RIBO_IHMT_EL_7';'1.2.40.0.34.5.60';'Ribotyp IHMT-EL 7';;;;;'1';'L';
'RIBO_IHMT_EL_8';'1.2.40.0.34.5.60';'Ribotyp IHMT-EL 8';;;;;'1';'L';
'RIBO_IHMT_EL_9';'1.2.40.0.34.5.60';'Ribotyp IHMT-EL 9';;;;;'1';'L';
'DENGUEFIEBER';'1.2.40.0.34.5.60';'Denguefieber';;;;;'0';'S';
'DEN1';'1.2.40.0.34.5.60';'DEN-1';;;;;'1';'L';
'DEN2';'1.2.40.0.34.5.60';'DEN-2';;;;;'1';'L';
'DEN3';'1.2.40.0.34.5.60';'DEN-3';;;;;'1';'L';
'DEN4';'1.2.40.0.34.5.60';'DEN-4';;;;;'1';'L';
'DIPHTHERIE';'1.2.40.0.34.5.60';'Diphtherie';;;;;'0';'S';
'DIP';'1.2.40.0.34.5.60';'C.diphtheriae';;;;;'1';'L';
'PTBC';'1.2.40.0.34.5.60';'C.pseudotuberculosis';;;;;'1';'L';
'ULC';'1.2.40.0.34.5.60';'C.ulcerans';;;;;'1';'L';
'E';'1.2.40.0.34.5.60';'Serotyp E';;;;;'0';'L';
'ECOLI';'1.2.40.0.34.5.60';'E.-coli-Enteritits';;;;;'0';'S';
'DAEC';'1.2.40.0.34.5.60';'diffus-adhärente E. coli (DAEC)';;;;;'1';'L';
'EAGGEC';'1.2.40.0.34.5.60';'enteroaggregative E. coli (EAggEC)';;;;;'1';'L';
'EIEC';'1.2.40.0.34.5.60';'enteroinvasive E. coli (EIEC)';;;;;'1';'L';
'EPEC';'1.2.40.0.34.5.60';'enteropathogene E. coli (EPEC)';;;;;'1';'L';
'ETEC';'1.2.40.0.34.5.60';'enterotoxische E. coli (ETEC)';;;;;'1';'L';
'F';'1.2.40.0.34.5.60';'Serotyp F';;;;;'0';'L';
'HANTAVIRUS';'1.2.40.0.34.5.60';'Hantavirus';;;;;'0';'S';
'ANDV';'1.2.40.0.34.5.60';'Andes-Virus';;;;;'1';'L';
'DOBV';'1.2.40.0.34.5.60';'Dobrava-Belgrad-Virus';;;;;'1';'L';
'HTNV';'1.2.40.0.34.5.60';'Hantaan-Virus';;;;;'1';'L';
'KORV';'1.2.40.0.34.5.60';'Korea-Fieber-Virus';;;;;'1';'L';
'PUUV';'1.2.40.0.34.5.60';'Puumala-Virus';;;;;'1';'L';
'SAAV';'1.2.40.0.34.5.60';'Saaremaa-Virus';;;;;'1';'L';
'SEOV';'1.2.40.0.34.5.60';'Seoul-Virus';;;;;'1';'L';
'SINNV';'1.2.40.0.34.5.60';'Sin-Nombre-Virus';;;;;'1';'L';
'LASSAFIEBER';'1.2.40.0.34.5.60';'Lassafieber';;;;;'0';'S';
'CF';'1.2.40.0.34.5.60';'Zentralafrikanische Republik';;;;;'1';'L';
'LR';'1.2.40.0.34.5.60';'Liberia';;;;;'1';'L';
'NG';'1.2.40.0.34.5.60';'Nigeria';;;;;'1';'L';
'SL';'1.2.40.0.34.5.60';'Sierra Leone';;;;;'1';'L';
'LEGIONELLOSE';'1.2.40.0.34.5.60';'Legionellose';;;;;'0';'S';
'LANISA';'1.2.40.0.34.5.60';'L. anisa';;;;;'1';'L';
'LBOZ';'1.2.40.0.34.5.60';'L. bozemanii';;;;;'1';'L';
'LBRU';'1.2.40.0.34.5.60';'L. brunensis';;;;;'1';'L';
'LCIN';'1.2.40.0.34.5.60';'L. cincinnatiensis';;;;;'1';'L';
'LDUM';'1.2.40.0.34.5.60';'L. dumoffii';;;;;'1';'L';
'LFEE';'1.2.40.0.34.5.60';'L. feeleii';;;;;'1';'L';
'LGOR';'1.2.40.0.34.5.60';'L. gormanii';;;;;'1';'L';
'LJOR';'1.2.40.0.34.5.60';'L. jordanis';;;;;'1';'L';
'LLONG';'1.2.40.0.34.5.60';'L. longbeachae';;;;;'1';'L';
'LMAC';'1.2.40.0.34.5.60';'L. macaechernii';;;;;'1';'L';
'LMIC';'1.2.40.0.34.5.60';'L. micdadei';;;;;'1';'L';
'LO';'1.2.40.0.34.5.60';'L. other species';;;;;'1';'L';
'LSG1';'1.2.40.0.34.5.60';'L. pneumophila serogroup 1';;;;;'1';'L';
'LSG10';'1.2.40.0.34.5.60';'L. pneumophila serogroup 10';;;;;'1';'L';
'LSG11';'1.2.40.0.34.5.60';'L. pneumophila serogroup 11';;;;;'1';'L';
'LSG12';'1.2.40.0.34.5.60';'L. pneumophila serogroup 12';;;;;'1';'L';
'LSG13';'1.2.40.0.34.5.60';'L. pneumophila serogroup 13';;;;;'1';'L';
'LSG14';'1.2.40.0.34.5.60';'L. pneumophila serogroup 14';;;;;'1';'L';
'LSG15';'1.2.40.0.34.5.60';'L. pneumophila serogroup 15';;;;;'1';'L';
'LSG16';'1.2.40.0.34.5.60';'L. pneumophila serogroup 16';;;;;'1';'L';
'LSG2';'1.2.40.0.34.5.60';'L. pneumophila serogroup 2';;;;;'1';'L';
'LSG3';'1.2.40.0.34.5.60';'L. pneumophila serogroup 3';;;;;'1';'L';
'LSG4';'1.2.40.0.34.5.60';'L. pneumophila serogroup 4';;;;;'1';'L';
'LSG5';'1.2.40.0.34.5.60';'L. pneumophila serogroup 5';;;;;'1';'L';
'LSG6';'1.2.40.0.34.5.60';'L. pneumophila serogroup 6';;;;;'1';'L';
'LSG7';'1.2.40.0.34.5.60';'L. pneumophila serogroup 7';;;;;'1';'L';
'LSG8';'1.2.40.0.34.5.60';'L. pneumophila serogroup 8';;;;;'1';'L';
'LSG9';'1.2.40.0.34.5.60';'L. pneumophila serogroup 9';;;;;'1';'L';
'LSGMIX';'1.2.40.0.34.5.60';'L. pneumophila serogroup mixed';;;;;'1';'L';
'LSGUNK';'1.2.40.0.34.5.60';'L. pneumophila serogroup unknown';;;;;'1';'L';
'LWAD';'1.2.40.0.34.5.60';'L. wadsworthii';;;;;'1';'L';
'LEPTOSPIROSE';'1.2.40.0.34.5.60';'Leptospirose';;;;;'0';'S';
'LAUS';'1.2.40.0.34.5.60';'L. australis ballico';;;;;'1';'L';
'LAUT';'1.2.40.0.34.5.60';'L. autumnalis Akyani';;;;;'1';'L';
'LBALL';'1.2.40.0.34.5.60';'L. ballum';;;;;'1';'L';
'LBAT';'1.2.40.0.34.5.60';'L. bataviae';;;;;'1';'L';
'LBRAT';'1.2.40.0.34.5.60';'L. bratislava';;;;;'1';'L';
'LCAN';'1.2.40.0.34.5.60';'L. canicola';;;;;'1';'L';
'LCOP';'1.2.40.0.34.5.60';'L. copenhageni';;;;;'1';'L';
'LGRIP';'1.2.40.0.34.5.60';'L. grippotyphosa';;;;;'1';'L';
'LHAR';'1.2.40.0.34.5.60';'L. hardjö';;;;;'1';'L';
'LHEB';'1.2.40.0.34.5.60';'L. hebdomadis';;;;;'1';'L';
'LPOM';'1.2.40.0.34.5.60';'L. pomona';;;;;'1';'L';
'LPYRO';'1.2.40.0.34.5.60';'L. pyrogenes';;;;;'1';'L';
'LSAX';'1.2.40.0.34.5.60';'L. saxköbing';;;;;'1';'L';
'LSEJ';'1.2.40.0.34.5.60';'L. sejrö';;;;;'1';'L';
'LTAR';'1.2.40.0.34.5.60';'L. tarrasovi';;;;;'1';'L';
'LWOLF';'1.2.40.0.34.5.60';'L. wolfii';;;;;'1';'L';
'PERTUSSIS';'1.2.40.0.34.5.60';'Pertussis';;;;;'0';'S';
'BBRONCH';'1.2.40.0.34.5.60';'Bordetella bronchiseptica';;;;;'1';'L';
'BPARA';'1.2.40.0.34.5.60';'Bordetella parapertussis';;;;;'1';'L';
'BPERT';'1.2.40.0.34.5.60';'Bordetella pertussis';;;;;'1';'L';
'POLIOMYELITIS';'1.2.40.0.34.5.60';'Poliomyelitis';;;;;'0';'S';
'I';'1.2.40.0.34.5.60';'Typ I (Brunhilde)';;;;;'1';'L';
'II';'1.2.40.0.34.5.60';'Typ II (Lansing)';;;;;'1';'L';
'III';'1.2.40.0.34.5.60';'Typ III (Leon)';;;;;'1';'L';
'SHIGELLOSE';'1.2.40.0.34.5.60';'Shigellose';;;;;'0';'S';
'SHIBOY';'1.2.40.0.34.5.60';'Shigella boydii';;;;;'1';'L';
'SHIDYS';'1.2.40.0.34.5.60';'Shigella dysenteriae';;;;;'1';'L';
'SHIFLE';'1.2.40.0.34.5.60';'Shigella flexneri';;;;;'1';'L';
'SHISON';'1.2.40.0.34.5.60';'Shigella sonnei';;;;;'1';'L';
'SHISPP';'1.2.40.0.34.5.60';'Shigella nicht spezifiziert';;;;;'1';'L';
'TRICHINELLOSE';'1.2.40.0.34.5.60';'Trichinellose';;;;;'0';'S';
'TRCOTHER';'1.2.40.0.34.5.60';'andere Trichinellose';;;;;'1';'L';
'TRCPSE';'1.2.40.0.34.5.60';'Trichinella pseudospiralis';;;;;'1';'L';
'TRCSPI';'1.2.40.0.34.5.60';'Trichinella spiralis';;;;;'1';'L';
'TRCSSP';'1.2.40.0.34.5.60';'Trichinellose unspezifiziert';;;;;'1';'L';
