"resource";"url";"version";"name";"title";"status";"description";"content";"identifier";"date";"count";"property";"property"
"CodeSystem";"https://termgit.elga.gv.at/CodeSystem-hl7-timing-event";"HL7:TimingEvent";"hl7-timing-event";"HL7 Timing Event";"active";"None";"complete";"2.16.840.1.113883.5.139";"2013-01-10";"18";"child|||code";"parent|||code"

"code";"display";"property";"property";"property"
"AC";"AC"
"ACD";"ACD"
"ACM";"ACM"
"ACV";"ACV"
"C";"C";"child|CD|code";"child|CM|code";"child|CV|code"
"CD";"CD";"parent|C|code";"";""
"CM";"CM";"parent|C|code";"";""
"CV";"CV";"parent|C|code";"";""
"HS";"HS";"";"";""
"IC";"IC";"";"";""
"ICD";"ICD";"";"";""
"ICM";"ICM";"";"";""
"ICV";"ICV";"";"";""
"PC";"PC";"";"";""
"PCD";"PCD";"";"";""
"PCM";"PCM";"";"";""
"PCV";"PCV";"";"";""
"WAKE";"WAKE";"";"";""