'code';'codeSystem';'displayName';'parentCodeSystemName';'concept_Beschreibung';'meaning';'hints';'orderNumber';'level';'type';'relationships';'einheit print';'einheit codiert'
'L';'2.16.840.1.113883.5.25';'low';'https://termgit.elga.gv.at/CodeSystem-hl7-confidentiality-code';'';'';'';'1';'0';'L';'';'';''
'M';'2.16.840.1.113883.5.25';'moderate';'https://termgit.elga.gv.at/CodeSystem-hl7-confidentiality-code';'';'';'';'2';'0';'L';'';'';''
'N';'2.16.840.1.113883.5.25';'normal';'https://termgit.elga.gv.at/CodeSystem-hl7-confidentiality-code';'';'';'';'3';'0';'L';'';'';''
'R';'2.16.840.1.113883.5.25';'restricted';'https://termgit.elga.gv.at/CodeSystem-hl7-confidentiality-code';'';'';'';'4';'0';'L';'';'';''
'U';'2.16.840.1.113883.5.25';'unrestricted';'https://termgit.elga.gv.at/CodeSystem-hl7-confidentiality-code';'';'';'';'5';'0';'L';'';'';''
'V';'2.16.840.1.113883.5.25';'very restricted';'https://termgit.elga.gv.at/CodeSystem-hl7-confidentiality-code';'';'';'';'6';'0';'L';'';'';''
