'code';'codeSystem';'displayName';'parentCode';'concept_Beschreibung';'meaning';'hints';'level';'type';'relationships'
'D';'1.2.40.0.34.5.207';'Aktuelle/Behandelte Diagnose';;;;;'0';'L';
'V';'1.2.40.0.34.5.207';'Verdachtsdiagnose';;;;;'0';'L';
