'code';'codeSystem';'displayName';'parentCode';'concept_Beschreibung';'meaning';'hints';'level';'type';'relationships'
'100000073362';'1.2.40.0.10.1.4.3.4.3.5';'Suspension zum Einnehmen';'';'';'Suspension zum Einnehmen';'';'0';'L';''
'100000073363';'1.2.40.0.10.1.4.3.4.3.5';'Gel zum Einnehmen';'';'';'Gel zum Einnehmen';'';'0';'L';''
'100000073364';'1.2.40.0.10.1.4.3.4.3.5';'Pulver zur Herstellung einer Lösung zum Einnehmen';'';'';'Pulver zur Herstellung einer Lösung zum Einnehmen';'';'0';'L';''
'100000073365';'1.2.40.0.10.1.4.3.4.3.5';'Granulat zur Herstellung einer Lösung zum Einnehmen';'';'';'Granulat zur Herstellung einer Lösung zum Einnehmen';'';'0';'L';''
'100000073366';'1.2.40.0.10.1.4.3.4.3.5';'Pulver und Lösungsmittel zur Herstellung einer Lösung zum Einnehmen';'';'';'Pulver und Lösungsmittel zur Herstellung einer Lösung zum Einnehmen';'';'0';'L';''
'100000073369';'1.2.40.0.10.1.4.3.4.3.5';'Tablette zur Herstellung einer Lösung zum Einnehmen';'';'';'Tablette zur Herstellung einer Lösung zum Einnehmen';'';'0';'L';''
'100000073370';'1.2.40.0.10.1.4.3.4.3.5';'Arzneitee';'';'';'Arzneitee';'';'0';'L';''
'100000073371';'1.2.40.0.10.1.4.3.4.3.5';'Teeaufgusspulver';'';'';'Teeaufgusspulver';'';'0';'L';''
'100000073372';'1.2.40.0.10.1.4.3.4.3.5';'Granulat';'';'';'Granulat';'';'0';'L';''
'100000073373';'1.2.40.0.10.1.4.3.4.3.5';'magensaftresistentes Granulat';'';'';'magensaftresistentes Granulat';'';'0';'L';''
'100000073375';'1.2.40.0.10.1.4.3.4.3.5';'Hartkapsel';'';'';'Hartkapsel';'';'0';'L';''
'100000073376';'1.2.40.0.10.1.4.3.4.3.5';'magensaftresistente Hartkapsel';'';'';'magensaftresistente Hartkapsel';'';'0';'L';''
'100000073380';'1.2.40.0.10.1.4.3.4.3.5';'überzogene Tablette';'';'';'überzogene Tablette';'';'0';'L';''
'100000073642';'1.2.40.0.10.1.4.3.4.3.5';'Tropfen zum Einnehmen, Lösung';'';'';'Tropfen zum Einnehmen, Lösung';'';'0';'L';''
'100000073643';'1.2.40.0.10.1.4.3.4.3.5';'Tropfen zum Einnehmen, Suspension';'';'';'Tropfen zum Einnehmen, Suspension';'';'0';'L';''
'100000073645';'1.2.40.0.10.1.4.3.4.3.5';'Flüssigkeit zum Einnehmen';'';'';'Flüssigkeit zum Einnehmen';'';'0';'L';''
'100000073646';'1.2.40.0.10.1.4.3.4.3.5';'Lösung zum Einnehmen';'';'';'Lösung zum Einnehmen';'';'0';'L';''
'100000073647';'1.2.40.0.10.1.4.3.4.3.5';'Emulsion zum Einnehmen';'';'';'Emulsion zum Einnehmen';'';'0';'L';''
'100000073649';'1.2.40.0.10.1.4.3.4.3.5';'Pulver zur Herstellung einer Suspension zum Einnehmen';'';'';'Pulver zur Herstellung einer Suspension zum Einnehmen';'';'0';'L';''
'100000073650';'1.2.40.0.10.1.4.3.4.3.5';'Granulat zur Herstellung einer Suspension zum Einnehmen';'';'';'Granulat zur Herstellung einer Suspension zum Einnehmen';'';'0';'L';''
'100000073652';'1.2.40.0.10.1.4.3.4.3.5';'Sirup';'';'';'Sirup';'';'0';'L';''
'100000073654';'1.2.40.0.10.1.4.3.4.3.5';'Tablette zur Herstellung einer Suspension zum Einnehmen';'';'';'Tablette zur Herstellung einer Suspension zum Einnehmen';'';'0';'L';''
'100000073655';'1.2.40.0.10.1.4.3.4.3.5';'Pulver zum Einnehmen';'';'';'Pulver zum Einnehmen';'';'0';'L';''
'100000073656';'1.2.40.0.10.1.4.3.4.3.5';'Brausepulver';'';'';'Brausepulver';'';'0';'L';''
'100000073657';'1.2.40.0.10.1.4.3.4.3.5';'Brausegranulat';'';'';'Brausegranulat';'';'0';'L';''
'100000073658';'1.2.40.0.10.1.4.3.4.3.5';'Retardgranulat';'';'';'Retardgranulat';'';'0';'L';''
'100000073660';'1.2.40.0.10.1.4.3.4.3.5';'Weichkapsel';'';'';'Weichkapsel';'';'0';'L';''
'100000073661';'1.2.40.0.10.1.4.3.4.3.5';'magensaftresistente Weichkapsel';'';'';'magensaftresistente Weichkapsel';'';'0';'L';''
'100000073662';'1.2.40.0.10.1.4.3.4.3.5';'Hartkapsel, retardiert';'';'';'Hartkapsel, retardiert';'';'0';'L';''
'100000073663';'1.2.40.0.10.1.4.3.4.3.5';'Hartkapsel mit veränderter Wirkstofffreisetzung';'';'';'Hartkapsel mit veränderter Wirkstofffreisetzung';'';'0';'L';''
'100000073664';'1.2.40.0.10.1.4.3.4.3.5';'Tablette';'';'';'Tablette';'';'0';'L';''
'100000073665';'1.2.40.0.10.1.4.3.4.3.5';'Filmtablette';'';'';'Filmtablette';'';'0';'L';''
'100000073666';'1.2.40.0.10.1.4.3.4.3.5';'Schmelztablette';'';'';'Schmelztablette';'';'0';'L';''
'100000073667';'1.2.40.0.10.1.4.3.4.3.5';'magensaftresistente Tablette';'';'';'magensaftresistente Tablette';'';'0';'L';''
'100000073668';'1.2.40.0.10.1.4.3.4.3.5';'Tablette mit veränderter Wirkstofffreisetzung';'';'';'Tablette mit veränderter Wirkstofffreisetzung';'';'0';'L';''
'100000073669';'1.2.40.0.10.1.4.3.4.3.5';'wirkstoffhaltiges Kaugummi';'';'';'wirkstoffhaltiges Kaugummi';'';'0';'L';''
'100000073673';'1.2.40.0.10.1.4.3.4.3.5';'Gurgellösung';'';'';'Gurgellösung';'';'0';'L';''
'100000073675';'1.2.40.0.10.1.4.3.4.3.5';'Suspension zur Anwendung in der Mundhöhle';'';'';'Suspension zur Anwendung in der Mundhöhle';'';'0';'L';''
'100000073676';'1.2.40.0.10.1.4.3.4.3.5';'Spray zur Anwendung in der Mundhöhle';'';'';'Spray zur Anwendung in der Mundhöhle';'';'0';'L';''
'100000073678';'1.2.40.0.10.1.4.3.4.3.5';'Lösung zur Anwendung am Zahnfleisch';'';'';'Lösung zur Anwendung am Zahnfleisch';'';'0';'L';''
'100000073680';'1.2.40.0.10.1.4.3.4.3.5';'Gel zur Anwendung am Zahnfleisch';'';'';'Gel zur Anwendung am Zahnfleisch';'';'0';'L';''
'100000073681';'1.2.40.0.10.1.4.3.4.3.5';'Brausetablette';'';'';'Brausetablette';'';'0';'L';''
'100000073682';'1.2.40.0.10.1.4.3.4.3.5';'Lyophilisat zum Einnehmen';'';'';'Lyophilisat zum Einnehmen';'';'0';'L';''
'100000073683';'1.2.40.0.10.1.4.3.4.3.5';'Retardtablette';'';'';'Retardtablette';'';'0';'L';''
'100000073684';'1.2.40.0.10.1.4.3.4.3.5';'Kautablette';'';'';'Kautablette';'';'0';'L';''
'100000073685';'1.2.40.0.10.1.4.3.4.3.5';'Lutschpastille';'';'';'Lutschpastille';'';'0';'L';''
'100000073691';'1.2.40.0.10.1.4.3.4.3.5';'Lösung zur Anwendung in der Mundhöhle';'';'';'Lösung zur Anwendung in der Mundhöhle';'';'0';'L';''
'100000073693';'1.2.40.0.10.1.4.3.4.3.5';'Sublingualspray';'';'';'Sublingualspray';'';'0';'L';''
'100000073695';'1.2.40.0.10.1.4.3.4.3.5';'Gel zur Anwendung in der Mundhöhle';'';'';'Gel zur Anwendung in der Mundhöhle';'';'0';'L';''
'100000073698';'1.2.40.0.10.1.4.3.4.3.5';'Sublingualtablette';'';'';'Sublingualtablette';'';'0';'L';''
'100000073699';'1.2.40.0.10.1.4.3.4.3.5';'Buccaltablette';'';'';'Buccaltablette';'';'0';'L';''
'100000073700';'1.2.40.0.10.1.4.3.4.3.5';'Lutschtablette, gepresst';'';'';'Lutschtablette, gepresst';'';'0';'L';''
'100000073703';'1.2.40.0.10.1.4.3.4.3.5';'Lutschtablette';'';'';'Lutschtablette';'';'0';'L';''
'100000073704';'1.2.40.0.10.1.4.3.4.3.5';'Pastille';'';'';'Pastille';'';'0';'L';''
'100000073705';'1.2.40.0.10.1.4.3.4.3.5';'Dentalgel';'';'';'Dentalgel';'';'0';'L';''
'100000073710';'1.2.40.0.10.1.4.3.4.3.5';'Gel zur periodontalen Anwendung';'';'';'Gel zur periodontalen Anwendung';'';'0';'L';''
'100000073711';'1.2.40.0.10.1.4.3.4.3.5';'Badezusatz';'';'';'Badezusatz';'';'0';'L';''
'100000073712';'1.2.40.0.10.1.4.3.4.3.5';'Creme';'';'';'Creme';'';'0';'L';''
'100000073713';'1.2.40.0.10.1.4.3.4.3.5';'Salbe';'';'';'Salbe';'';'0';'L';''
'100000073714';'1.2.40.0.10.1.4.3.4.3.5';'wirkstoffhaltiges Pflaster';'';'';'wirkstoffhaltiges Pflaster';'';'0';'L';''
'100000073715';'1.2.40.0.10.1.4.3.4.3.5';'Shampoo';'';'';'Shampoo';'';'0';'L';''
'100000073716';'1.2.40.0.10.1.4.3.4.3.5';'Spray zur Anwendung auf der Haut, Suspension';'';'';'Spray zur Anwendung auf der Haut, Suspension';'';'0';'L';''
'100000073717';'1.2.40.0.10.1.4.3.4.3.5';'Flüssigkeit zur Anwendung auf der Haut';'';'';'Flüssigkeit zur Anwendung auf der Haut';'';'0';'L';''
'100000073719';'1.2.40.0.10.1.4.3.4.3.5';'Emulsion zur Anwendung auf der Haut';'';'';'Emulsion zur Anwendung auf der Haut';'';'0';'L';''
'100000073720';'1.2.40.0.10.1.4.3.4.3.5';'Kutanes Pflaster';'';'';'Kutanes Pflaster';'';'0';'L';''
'100000073723';'1.2.40.0.10.1.4.3.4.3.5';'Dentallösung';'';'';'Dentallösung';'';'0';'L';''
'100000073726';'1.2.40.0.10.1.4.3.4.3.5';'Gel';'';'';'Gel';'';'0';'L';''
'100000073727';'1.2.40.0.10.1.4.3.4.3.5';'Paste zur Anwendung auf der Haut';'';'';'Paste zur Anwendung auf der Haut';'';'0';'L';''
'100000073728';'1.2.40.0.10.1.4.3.4.3.5';'Schaum zur Anwendung auf der Haut';'';'';'Schaum zur Anwendung auf der Haut';'';'0';'L';''
'100000073729';'1.2.40.0.10.1.4.3.4.3.5';'Spray zur Anwendung auf der Haut, Lösung';'';'';'Spray zur Anwendung auf der Haut, Lösung';'';'0';'L';''
'100000073731';'1.2.40.0.10.1.4.3.4.3.5';'Lösung zur Anwendung auf der Haut';'';'';'Lösung zur Anwendung auf der Haut';'';'0';'L';''
'100000073732';'1.2.40.0.10.1.4.3.4.3.5';'Suspension zur Anwendung auf der Haut';'';'';'Suspension zur Anwendung auf der Haut';'';'0';'L';''
'100000073733';'1.2.40.0.10.1.4.3.4.3.5';'Pulver zur Anwendung auf der Haut';'';'';'Pulver zur Anwendung auf der Haut';'';'0';'L';''
'100000073736';'1.2.40.0.10.1.4.3.4.3.5';'Umschlagpaste';'';'';'Umschlagpaste';'';'0';'L';''
'100000073741';'1.2.40.0.10.1.4.3.4.3.5';'transdermales Pflaster';'';'';'transdermales Pflaster';'';'0';'L';''
'100000073742';'1.2.40.0.10.1.4.3.4.3.5';'wirkstoffhaltiger Nagellack';'';'';'wirkstoffhaltiger Nagellack';'';'0';'L';''
'100000073743';'1.2.40.0.10.1.4.3.4.3.5';'Stift zur Anwendung auf der Haut';'';'';'Stift zur Anwendung auf der Haut';'';'0';'L';''
'100000073744';'1.2.40.0.10.1.4.3.4.3.5';'imprägnierter Verband';'';'';'imprägnierter Verband';'';'0';'L';''
'100000073752';'1.2.40.0.10.1.4.3.4.3.5';'Lösung zum Auftropfen';'';'';'Lösung zum Auftropfen';'';'0';'L';''
'100000073756';'1.2.40.0.10.1.4.3.4.3.5';'Pricktestlösung';'';'';'Pricktestlösung';'';'0';'L';''
'100000073758';'1.2.40.0.10.1.4.3.4.3.5';'Augengel';'';'';'Augengel';'';'0';'L';''
'100000073759';'1.2.40.0.10.1.4.3.4.3.5';'Augentropfen, Lösung';'';'';'Augentropfen, Lösung';'';'0';'L';''
'100000073760';'1.2.40.0.10.1.4.3.4.3.5';'Augentropfensuspension';'';'';'Augentropfensuspension';'';'0';'L';''
'100000073762';'1.2.40.0.10.1.4.3.4.3.5';'Konzentrat zur Herstellung eines Tauchbades, Emulsion';'';'';'Konzentrat zur Herstellung eines Tauchbades, Emulsion';'';'0';'L';''
'100000073769';'1.2.40.0.10.1.4.3.4.3.5';'Transdermales System';'';'';'Transdermales System';'';'0';'L';''
'100000073772';'1.2.40.0.10.1.4.3.4.3.5';'Augensalbe';'';'';'Augensalbe';'';'0';'L';''
'100000073773';'1.2.40.0.10.1.4.3.4.3.5';'Augentropfen, Emulsion';'';'';'Augentropfen, Emulsion';'';'0';'L';''
'100000073777';'1.2.40.0.10.1.4.3.4.3.5';'Augeninsert';'';'';'Augeninsert';'';'0';'L';''
'100000073786';'1.2.40.0.10.1.4.3.4.3.5';'Ohrentropfen, Lösung';'';'';'Ohrentropfen, Lösung';'';'0';'L';''
'100000073793';'1.2.40.0.10.1.4.3.4.3.5';'Nasengel';'';'';'Nasengel';'';'0';'L';''
'100000073794';'1.2.40.0.10.1.4.3.4.3.5';'Nasentropfen, Lösung';'';'';'Nasentropfen, Lösung';'';'0';'L';''
'100000073796';'1.2.40.0.10.1.4.3.4.3.5';'Nasenspray, Lösung';'';'';'Nasenspray, Lösung';'';'0';'L';''
'100000073798';'1.2.40.0.10.1.4.3.4.3.5';'Nasenstift';'';'';'Nasenstift';'';'0';'L';''
'100000073799';'1.2.40.0.10.1.4.3.4.3.5';'Vaginalgel';'';'';'Vaginalgel';'';'0';'L';''
'100000073806';'1.2.40.0.10.1.4.3.4.3.5';'Nasensalbe';'';'';'Nasensalbe';'';'0';'L';''
'100000073808';'1.2.40.0.10.1.4.3.4.3.5';'Nasenpulver';'';'';'Nasenpulver';'';'0';'L';''
'100000073809';'1.2.40.0.10.1.4.3.4.3.5';'Nasenspray, Suspension';'';'';'Nasenspray, Suspension';'';'0';'L';''
'100000073811';'1.2.40.0.10.1.4.3.4.3.5';'Vaginalcreme';'';'';'Vaginalcreme';'';'0';'L';''
'100000073813';'1.2.40.0.10.1.4.3.4.3.5';'Vaginallösung';'';'';'Vaginallösung';'';'0';'L';''
'100000073814';'1.2.40.0.10.1.4.3.4.3.5';'Vaginalemulsion';'';'';'Vaginalemulsion';'';'0';'L';''
'100000073815';'1.2.40.0.10.1.4.3.4.3.5';'Vaginalzäpfchen';'';'';'Vaginalzäpfchen';'';'0';'L';''
'100000073816';'1.2.40.0.10.1.4.3.4.3.5';'Weichkapsel zur vaginalen Anwendung';'';'';'Weichkapsel zur vaginalen Anwendung';'';'0';'L';''
'100000073818';'1.2.40.0.10.1.4.3.4.3.5';'vaginales Wirkstofffreisetzungssystem';'';'';'vaginales Wirkstofffreisetzungssystem';'';'0';'L';''
'100000073819';'1.2.40.0.10.1.4.3.4.3.5';'Rektalcreme';'';'';'Rektalcreme';'';'0';'L';''
'100000073820';'1.2.40.0.10.1.4.3.4.3.5';'Rektalschaum';'';'';'Rektalschaum';'';'0';'L';''
'100000073823';'1.2.40.0.10.1.4.3.4.3.5';'Hartkapsel zur vaginalen Anwendung';'';'';'Hartkapsel zur vaginalen Anwendung';'';'0';'L';''
'100000073824';'1.2.40.0.10.1.4.3.4.3.5';'Vaginaltablette';'';'';'Vaginaltablette';'';'0';'L';''
'100000073828';'1.2.40.0.10.1.4.3.4.3.5';'Rektalsalbe';'';'';'Rektalsalbe';'';'0';'L';''
'100000073829';'1.2.40.0.10.1.4.3.4.3.5';'Rektallösung';'';'';'Rektallösung';'';'0';'L';''
'100000073830';'1.2.40.0.10.1.4.3.4.3.5';'Rektalsuspension';'';'';'Rektalsuspension';'';'0';'L';''
'100000073831';'1.2.40.0.10.1.4.3.4.3.5';'Pulver zur Herstellung einer Rektallösung';'';'';'Pulver zur Herstellung einer Rektallösung';'';'0';'L';''
'100000073832';'1.2.40.0.10.1.4.3.4.3.5';'Pulver zur Herstellung einer Rektalsuspension';'';'';'Pulver zur Herstellung einer Rektalsuspension';'';'0';'L';''
'100000073835';'1.2.40.0.10.1.4.3.4.3.5';'Lösung für einen Vernebler';'';'';'Lösung für einen Vernebler';'';'0';'L';''
'100000073838';'1.2.40.0.10.1.4.3.4.3.5';'Druckgasinhalation, Suspension';'';'';'Druckgasinhalation, Suspension';'';'0';'L';''
'100000073839';'1.2.40.0.10.1.4.3.4.3.5';'Pulver zur Inhalation';'';'';'Pulver zur Inhalation';'';'0';'L';''
'100000073840';'1.2.40.0.10.1.4.3.4.3.5';'einzeldosiertes Pulver zur Inhalation';'';'';'einzeldosiertes Pulver zur Inhalation';'';'0';'L';''
'100000073843';'1.2.40.0.10.1.4.3.4.3.5';'Zäpfchen';'';'';'Zäpfchen';'';'0';'L';''
'100000073846';'1.2.40.0.10.1.4.3.4.3.5';'Suspension für einen Vernebler';'';'';'Suspension für einen Vernebler';'';'0';'L';''
'100000073847';'1.2.40.0.10.1.4.3.4.3.5';'Pulver zur Herstellung einer Lösung für einen Vernebler';'';'';'Pulver zur Herstellung einer Lösung für einen Vernebler';'';'0';'L';''
'100000073848';'1.2.40.0.10.1.4.3.4.3.5';'Druckgasinhalation, Lösung';'';'';'Druckgasinhalation, Lösung';'';'0';'L';''
'100000073850';'1.2.40.0.10.1.4.3.4.3.5';'Hartkapsel mit Pulver zur Inhalation';'';'';'Hartkapsel mit Pulver zur Inhalation';'';'0';'L';''
'100000073854';'1.2.40.0.10.1.4.3.4.3.5';'Flüssigkeit zur Herstellung eines Dampfs zur Inhalation';'';'';'Flüssigkeit zur Herstellung eines Dampfs zur Inhalation';'';'0';'L';''
'100000073856';'1.2.40.0.10.1.4.3.4.3.5';'Emulsion zur Injektion';'';'';'Emulsion zur Injektion';'';'0';'L';''
'100000073857';'1.2.40.0.10.1.4.3.4.3.5';'Konzentrat zur Herstellung einer Injektionslösung';'';'';'Konzentrat zur Herstellung einer Injektionslösung';'';'0';'L';''
'100000073858';'1.2.40.0.10.1.4.3.4.3.5';'Emulsion zur Infusion';'';'';'Emulsion zur Infusion';'';'0';'L';''
'100000073859';'1.2.40.0.10.1.4.3.4.3.5';'Pulver zur Herstellung einer Infusionslösung';'';'';'Pulver zur Herstellung einer Infusionslösung';'';'0';'L';''
'100000073860';'1.2.40.0.10.1.4.3.4.3.5';'Pulver und Lösungsmittel zur Herstellung einer Infusionslösung';'';'';'Pulver und Lösungsmittel zur Herstellung einer Infusionslösung';'';'0';'L';''
'100000073862';'1.2.40.0.10.1.4.3.4.3.5';'Salbe zur Herstellung eines Dampfs zur Inhalation';'';'';'Salbe zur Herstellung eines Dampfs zur Inhalation';'';'0';'L';''
'100000073863';'1.2.40.0.10.1.4.3.4.3.5';'Injektionslösung';'';'';'Injektionslösung';'';'0';'L';''
'100000073864';'1.2.40.0.10.1.4.3.4.3.5';'Injektionssuspension';'';'';'Injektionssuspension';'';'0';'L';''
'100000073866';'1.2.40.0.10.1.4.3.4.3.5';'Pulver zur Herstellung einer Injektionslösung';'';'';'Pulver zur Herstellung einer Injektionslösung';'';'0';'L';''
'100000073867';'1.2.40.0.10.1.4.3.4.3.5';'Pulver zur Herstellung einer Injektionssuspension';'';'';'Pulver zur Herstellung einer Injektionssuspension';'';'0';'L';''
'100000073868';'1.2.40.0.10.1.4.3.4.3.5';'Pulver und Lösungsmittel zur Herstellung einer Injektionslösung';'';'';'Pulver und Lösungsmittel zur Herstellung einer Injektionslösung';'';'0';'L';''
'100000073869';'1.2.40.0.10.1.4.3.4.3.5';'Pulver und Lösungsmittel zur Herstellung einer Injektionssuspension';'';'';'Pulver und Lösungsmittel zur Herstellung einer Injektionssuspension';'';'0';'L';''
'100000073870';'1.2.40.0.10.1.4.3.4.3.5';'Infusionslösung';'';'';'Infusionslösung';'';'0';'L';''
'100000073871';'1.2.40.0.10.1.4.3.4.3.5';'Konzentrat zur Herstellung einer Infusionslösung';'';'';'Konzentrat zur Herstellung einer Infusionslösung';'';'0';'L';''
'100000073872';'1.2.40.0.10.1.4.3.4.3.5';'Lyophilisat zur Herstellung einer Infusionslösung';'';'';'Lyophilisat zur Herstellung einer Infusionslösung';'';'0';'L';''
'100000073873';'1.2.40.0.10.1.4.3.4.3.5';'Lyophilisat zur Herstellung einer Injektionslösung';'';'';'Lyophilisat zur Herstellung einer Injektionslösung';'';'0';'L';''
'100000073874';'1.2.40.0.10.1.4.3.4.3.5';'Implantat';'';'';'Implantat';'';'0';'L';''
'100000073875';'1.2.40.0.10.1.4.3.4.3.5';'Kette zur Implantation';'';'';'Kette zur Implantation';'';'0';'L';''
'100000073877';'1.2.40.0.10.1.4.3.4.3.5';'Hämodiafiltrationslösung';'';'';'Hämodiafiltrationslösung';'';'0';'L';''
'100000073879';'1.2.40.0.10.1.4.3.4.3.5';'Blasenspüllösung';'';'';'Blasenspüllösung';'';'0';'L';''
'100000073880';'1.2.40.0.10.1.4.3.4.3.5';'Gel zur Anwendung in der Harnröhre';'';'';'Gel zur Anwendung in der Harnröhre';'';'0';'L';''
'100000073881';'1.2.40.0.10.1.4.3.4.3.5';'Lösungsmittel zur Herstellung von Parenteralia';'';'';'Lösungsmittel zur Herstellung von Parenteralia';'';'0';'L';''
'100000073885';'1.2.40.0.10.1.4.3.4.3.5';'Hämofiltrationslösung';'';'';'Hämofiltrationslösung';'';'0';'L';''
'100000073886';'1.2.40.0.10.1.4.3.4.3.5';'Hämodialyselösung';'';'';'Hämodialyselösung';'';'0';'L';''
'100000073887';'1.2.40.0.10.1.4.3.4.3.5';'Lösung zur intravesikalen Anwendung';'';'';'Lösung zur intravesikalen Anwendung';'';'0';'L';''
'100000073889';'1.2.40.0.10.1.4.3.4.3.5';'Stäbchen zur Anwendung in der Harnröhre';'';'';'Stäbchen zur Anwendung in der Harnröhre';'';'0';'L';''
'100000073895';'1.2.40.0.10.1.4.3.4.3.5';'Intrauterines Wirkstofffreisetzungssystem';'';'';'Intrauterines Wirkstofffreisetzungssystem';'';'0';'L';''
'100000073902';'1.2.40.0.10.1.4.3.4.3.5';'Suspension zur endotracheopulmonalen Instillation';'';'';'Suspension zur endotracheopulmonalen Instillation';'';'0';'L';''
'100000073903';'1.2.40.0.10.1.4.3.4.3.5';'Gel zur endozervikalen Anwendung';'';'';'Gel zur endozervikalen Anwendung';'';'0';'L';''
'100000073911';'1.2.40.0.10.1.4.3.4.3.5';'Lösung für einen Vernebler (*)';'';'';'Lösung für einen Vernebler (*)';'';'0';'L';''
'100000073913';'1.2.40.0.10.1.4.3.4.3.5';'Lösung zur Modifikation einer Blutfraktion';'';'';'Lösung zur Modifikation einer Blutfraktion';'';'0';'L';''
'100000073916';'1.2.40.0.10.1.4.3.4.3.5';'Radionuklidgenerator';'';'';'Radionuklidgenerator';'';'0';'L';''
'100000073917';'1.2.40.0.10.1.4.3.4.3.5';'Lösung zur gastrointestinalen Anwendung';'';'';'Lösung zur gastrointestinalen Anwendung';'';'0';'L';''
'100000073918';'1.2.40.0.10.1.4.3.4.3.5';'Suspension zur gastrointestinalen Anwendung';'';'';'Suspension zur gastrointestinalen Anwendung';'';'0';'L';''
'100000073919';'1.2.40.0.10.1.4.3.4.3.5';'Organkonservierungslösung';'';'';'Organkonservierungslösung';'';'0';'L';''
'100000073921';'1.2.40.0.10.1.4.3.4.3.5';'Kit für ein radioaktives Arzneimittel';'';'';'Kit für ein radioaktives Arzneimittel';'';'0';'L';''
'100000073922';'1.2.40.0.10.1.4.3.4.3.5';'Dispersion';'';'';'Dispersion';'';'0';'L';''
'100000073924';'1.2.40.0.10.1.4.3.4.3.5';'Spüllösung';'';'';'Spüllösung';'';'0';'L';''
'100000073925';'1.2.40.0.10.1.4.3.4.3.5';'Gewebekleber';'';'';'Gewebekleber';'';'0';'L';''
'100000073929';'1.2.40.0.10.1.4.3.4.3.5';'Gas zur medizinischen Anwendung, druckverdichtet';'';'';'Gas zur medizinischen Anwendung, druckverdichtet';'';'0';'L';''
'100000073930';'1.2.40.0.10.1.4.3.4.3.5';'Gas zur medizinischen Anwendung, verflüssigt';'';'';'Gas zur medizinischen Anwendung, verflüssigt';'';'0';'L';''
'100000073941';'1.2.40.0.10.1.4.3.4.3.5';'Pulver und Lösungsmittel für einen Gewebekleber';'';'';'Pulver und Lösungsmittel für einen Gewebekleber';'';'0';'L';''
'100000073942';'1.2.40.0.10.1.4.3.4.3.5';'lebendes Gewebeäquivalent';'';'';'lebendes Gewebeäquivalent';'';'0';'L';''
'100000073943';'1.2.40.0.10.1.4.3.4.3.5';'Gel zur intestinalen Anwendung';'';'';'Gel zur intestinalen Anwendung';'';'0';'L';''
'100000073945';'1.2.40.0.10.1.4.3.4.3.5';'Gas zur medizinischen Anwendung, kälteverflüssigt';'';'';'Gas zur medizinischen Anwendung, kälteverflüssigt';'';'0';'L';''
'100000073972';'1.2.40.0.10.1.4.3.4.3.5';'Concentrate and solvent for concentrate for solution for infusion';'';'';'Concentrate and solvent for concentrate for solution for infusion';'';'0';'L';''
'100000073990';'1.2.40.0.10.1.4.3.4.3.5';'Konzentrat und Lösungsmittel zur Herstellung einer Injektionssuspension';'';'';'Konzentrat und Lösungsmittel zur Herstellung einer Injektionssuspension';'';'0';'L';''
'100000073991';'1.2.40.0.10.1.4.3.4.3.5';'Konzentrat zur Herstellung einer Lösung zum Einnehmen';'';'';'Konzentrat zur Herstellung einer Lösung zum Einnehmen';'';'0';'L';''
'100000073996';'1.2.40.0.10.1.4.3.4.3.5';'Emulsion for injection/infusion';'';'';'Emulsion for injection/infusion';'';'0';'L';''
'100000073997';'1.2.40.0.10.1.4.3.4.3.5';'Augentropfen, Lösung im Einzeldosisbehältnis';'';'';'Augentropfen, Lösung im Einzeldosisbehältnis';'';'0';'L';''
'100000074010';'1.2.40.0.10.1.4.3.4.3.5';'Modified-release film-coated tablet';'';'';'Modified-release film-coated tablet';'';'0';'L';''
'100000074015';'1.2.40.0.10.1.4.3.4.3.5';'Powder and solvent for concentrate for solution for infusion';'';'';'Powder and solvent for concentrate for solution for infusion';'';'0';'L';''
'100000074018';'1.2.40.0.10.1.4.3.4.3.5';'Pulver und Lösungsmittel zur Herstellung einer Depot-Injektionssuspension';'';'';'Pulver und Lösungsmittel zur Herstellung einer Depot-Injektionssuspension';'';'0';'L';''
'100000074020';'1.2.40.0.10.1.4.3.4.3.5';'Pulver zur Herstellung einer Suspension zur intravesikalen Anwendung';'';'';'Pulver zur Herstellung einer Suspension zur intravesikalen Anwendung';'';'0';'L';''
'100000074021';'1.2.40.0.10.1.4.3.4.3.5';'Inhalation powder, tablet';'';'';'Inhalation powder, tablet';'';'0';'L';''
'100000074029';'1.2.40.0.10.1.4.3.4.3.5';'Pulver für ein Konzentrat zur Herstellung einer Infusionslösung';'';'';'Pulver für ein Konzentrat zur Herstellung einer Infusionslösung';'';'0';'L';''
'100000074033';'1.2.40.0.10.1.4.3.4.3.5';'Pulver zur Herstellung einer Lösung zur intravesikalen Anwendung';'';'';'Pulver zur Herstellung einer Lösung zur intravesikalen Anwendung';'';'0';'L';''
'100000074037';'1.2.40.0.10.1.4.3.4.3.5';'Solution for haemodialysis/haemofiltration';'';'';'Solution for haemodialysis/haemofiltration';'';'0';'L';''
'100000074038';'1.2.40.0.10.1.4.3.4.3.5';'Injektions-/Infusionslösung';'';'';'Injektions-/Infusionslösung';'';'0';'L';''
'100000074039';'1.2.40.0.10.1.4.3.4.3.5';'Injektionslösung im Fertigpen';'';'';'Injektionslösung im Fertigpen';'';'0';'L';''
'100000074040';'1.2.40.0.10.1.4.3.4.3.5';'Lösung zur intraperitonealen Anwendung';'';'';'Lösung zur intraperitonealen Anwendung';'';'0';'L';''
'100000074042';'1.2.40.0.10.1.4.3.4.3.5';'Pulver zur Herstellung einer Injektions- bzw. Infusionslösung';'';'';'Pulver zur Herstellung einer Injektions- bzw. Infusionslösung';'';'0';'L';''
'100000074046';'1.2.40.0.10.1.4.3.4.3.5';'Solution for injection in cartridge';'';'';'Solution for injection in cartridge';'';'0';'L';''
'100000074047';'1.2.40.0.10.1.4.3.4.3.5';'Injektionslösung in einer Fertigspritze';'';'';'Injektionslösung in einer Fertigspritze';'';'0';'L';''
'100000074048';'1.2.40.0.10.1.4.3.4.3.5';'Suspension und Brausegranulat zur Herstellung einer Suspension zum Einnehmen';'';'';'Suspension und Brausegranulat zur Herstellung einer Suspension zum Einnehmen';'';'0';'L';''
'100000074057';'1.2.40.0.10.1.4.3.4.3.5';'Pulver und Lösungsmittel zur Herstellung einer Injektions- bzw. Infusionslösung';'';'';'Pulver und Lösungsmittel zur Herstellung einer Injektions- bzw. Infusionslösung';'';'0';'L';''
'100000074063';'1.2.40.0.10.1.4.3.4.3.5';'Suspension for injection in pre-filled syringe';'';'';'Suspension for injection in pre-filled syringe';'';'0';'L';''
'100000074068';'1.2.40.0.10.1.4.3.4.3.5';'Injektionsdispersion';'';'';'Injektionsdispersion';'';'0';'L';''
'100000074069';'1.2.40.0.10.1.4.3.4.3.5';'Konzentrat zur Herstellung einer Injektions- /Infusionslösung';'';'';'Konzentrat zur Herstellung einer Injektions- /Infusionslösung';'';'0';'L';''
'100000074070';'1.2.40.0.10.1.4.3.4.3.5';'Inhalationslösung';'';'';'Inhalationslösung';'';'0';'L';''
'100000075573';'1.2.40.0.10.1.4.3.4.3.5';'Schmelzfilm';'';'';'Schmelzfilm';'';'0';'L';''
'100000075574';'1.2.40.0.10.1.4.3.4.3.5';'Buccalfilm';'';'';'Buccalfilm';'';'0';'L';''
'100000075576';'1.2.40.0.10.1.4.3.4.3.5';'Suspension zur Implantation';'';'';'Suspension zur Implantation';'';'0';'L';''
'100000075584';'1.2.40.0.10.1.4.3.4.3.5';'Powder and solvent for dispersion for injection';'';'';'Powder and solvent for dispersion for injection';'';'0';'L';''
'100000075585';'1.2.40.0.10.1.4.3.4.3.5';'Powder and solvent for solution for injection in pre-filled syringe';'';'';'Powder and solvent for solution for injection in pre-filled syringe';'';'0';'L';''
'100000075588';'1.2.40.0.10.1.4.3.4.3.5';'Solution for injection/infusion in pre-filled syringe';'';'';'Solution for injection/infusion in pre-filled syringe';'';'0';'L';''
'100000111534';'1.2.40.0.10.1.4.3.4.3.5';'Concentrate for dispersion for infusion';'';'';'Concentrate for dispersion for infusion';'';'0';'L';''
'100000116131';'1.2.40.0.10.1.4.3.4.3.5';'Salbe zur Anwendung in der Mundhöhle';'';'';'Salbe zur Anwendung in der Mundhöhle';'';'0';'L';''
'100000116134';'1.2.40.0.10.1.4.3.4.3.5';'Transdermal gel';'';'';'Transdermal gel';'';'0';'L';''
'100000116137';'1.2.40.0.10.1.4.3.4.3.5';'Lyophilisat und Lösungsmittel zur Herstellung einer Injektionslösung';'';'';'Lyophilisat und Lösungsmittel zur Herstellung einer Injektionslösung';'';'0';'L';''
'100000116151';'1.2.40.0.10.1.4.3.4.3.5';'Ear/eye/nasal drops, solution';'';'';'Ear/eye/nasal drops, solution';'';'0';'L';''
'100000116154';'1.2.40.0.10.1.4.3.4.3.5';'magensaftresistente Retardtablette';'';'';'magensaftresistente Retardtablette';'';'0';'L';''
'100000116157';'1.2.40.0.10.1.4.3.4.3.5';'Hard capsule with gastro-resistant pellets';'';'';'Hard capsule with gastro-resistant pellets';'';'0';'L';''
'100000116169';'1.2.40.0.10.1.4.3.4.3.5';'Tropfen zum Einnehmen, Flüssigkeit';'';'';'Tropfen zum Einnehmen, Flüssigkeit';'';'0';'L';''
'100000116172';'1.2.40.0.10.1.4.3.4.3.5';'Powder and gel for gel';'';'';'Powder and gel for gel';'';'0';'L';''
'100000116175';'1.2.40.0.10.1.4.3.4.3.5';'Pulver und Lösungsmittel zur Herstellung einer Lösung zur intravesikalen Anwendung';'';'';'Pulver und Lösungsmittel zur Herstellung einer Lösung zur intravesikalen Anwendung';'';'0';'L';''
'100000116176';'1.2.40.0.10.1.4.3.4.3.5';'Powder and solvent for intravesical suspension';'';'';'Powder and solvent for intravesical suspension';'';'0';'L';''
'100000116178';'1.2.40.0.10.1.4.3.4.3.5';'Powder and solvent for suspension for injection in pre-filled syringe';'';'';'Powder and solvent for suspension for injection in pre-filled syringe';'';'0';'L';''
'100000116183';'1.2.40.0.10.1.4.3.4.3.5';'Pulver für ein Konzentrat zur Herstellung einer Injektions-/Infusionslösung';'';'';'Pulver für ein Konzentrat zur Herstellung einer Injektions-/Infusionslösung';'';'0';'L';''
'100000116186';'1.2.40.0.10.1.4.3.4.3.5';'Pulver zur Herstellung einer Injektions-/Infusionslösung';'';'';'Pulver zur Herstellung einer Injektions-/Infusionslösung';'';'0';'L';''
'100000125706';'1.2.40.0.10.1.4.3.4.3.5';'Spray zur Anwendung in der Mundhöhle, Lösung';'';'';'Spray zur Anwendung in der Mundhöhle, Lösung';'';'0';'L';''
'100000125736';'1.2.40.0.10.1.4.3.4.3.5';'Prolonged-release suspension for injection';'';'';'Prolonged-release suspension for injection';'';'0';'L';''
'100000125743';'1.2.40.0.10.1.4.3.4.3.5';'Granules in sachet';'';'';'Granules in sachet';'';'0';'L';''
'100000125752';'1.2.40.0.10.1.4.3.4.3.5';'Powder for oral solution in sachet';'';'';'Powder for oral solution in sachet';'';'0';'L';''
'100000125756';'1.2.40.0.10.1.4.3.4.3.5';'Oral solution in sachet';'';'';'Oral solution in sachet';'';'0';'L';''
'100000125757';'1.2.40.0.10.1.4.3.4.3.5';'Oral solution in single-dose container';'';'';'Oral solution in single-dose container';'';'0';'L';''
'100000125775';'1.2.40.0.10.1.4.3.4.3.5';'Prolonged-release suspension for injection in pre-filled syringe';'';'';'Prolonged-release suspension for injection in pre-filled syringe';'';'0';'L';''
'100000143523';'1.2.40.0.10.1.4.3.4.3.5';'Pulver zur Herstellung einer Infusionsdispersion';'';'';'Pulver zur Herstellung einer Infusionsdispersion';'';'0';'L';''
'100000156088';'1.2.40.0.10.1.4.3.4.3.5';'Versiegelungsmatrix';'';'';'Versiegelungsmatrix';'';'0';'L';''
'100000169806';'1.2.40.0.10.1.4.3.4.3.5';'Depot-Injektionslösung';'';'';'Depot-Injektionslösung';'';'0';'L';''
'100000173999';'1.2.40.0.10.1.4.3.4.3.5';'Konzentrat zur Herstellung einer Injektionssuspension';'';'';'Konzentrat zur Herstellung einer Injektionssuspension';'';'0';'L';''
'100000174015';'1.2.40.0.10.1.4.3.4.3.5';'Lösungsmittel zur Herstellung...';'';'';'Lösungsmittel zur Herstellung...';'';'0';'L';''
'100000174019';'1.2.40.0.10.1.4.3.4.3.5';'Suspension zur Herstellung einer Injektionssuspension';'';'';'Suspension zur Herstellung einer Injektionssuspension';'';'0';'L';''
'100000174052';'1.2.40.0.10.1.4.3.4.3.5';'Tablette zur Herstellung einer Lösung zur Anwendung auf der Haut';'';'';'Tablette zur Herstellung einer Lösung zur Anwendung auf der Haut';'';'0';'L';''
'200000002229';'1.2.40.0.10.1.4.3.4.3.5';'Granulat zur Entnahme aus Kapseln';'';'';'Granulat zur Entnahme aus Kapseln';'';'0';'L';''
'200000003971';'1.2.40.0.10.1.4.3.4.3.5';'Gel zur intrauterinen Anwendung';'';'';'Gel zur intrauterinen Anwendung';'';'0';'L';''
'200000003974';'1.2.40.0.10.1.4.3.4.3.5';'magensaftresistentes Retardgranulat';'';'';'magensaftresistentes Retardgranulat';'';'0';'L';''
'200000010620';'1.2.40.0.10.1.4.3.4.3.5';'Suspension and solution for suspension for injection';'';'';'Suspension and solution for suspension for injection';'';'0';'L';''
'200000010684';'1.2.40.0.10.1.4.3.4.3.5';'Lyophilisat zur sublingualen Anwendung';'';'';'Lyophilisat zur sublingualen Anwendung';'';'0';'L';''
'200000015705';'1.2.40.0.10.1.4.3.4.3.5';'Konzentrat zur Herstellung einer Injektionsdispersion';'';'';'Konzentrat zur Herstellung einer Injektionsdispersion';'';'0';'L';''
'200000016453';'1.2.40.0.10.1.4.3.4.3.5';'Spray zur Anwendung auf der Haut';'';'';'Spray zur Anwendung auf der Haut';'';'0';'L';''
'900000000006';'1.2.40.0.10.1.4.3.4.3.5';'Pulver für ein Konzentrat zur Herstellung einer Injektionslösung';'';'';'Pulver für ein Konzentrat zur Herstellung einer Injektionslösung';'';'0';'L';''
'900000000008';'1.2.40.0.10.1.4.3.4.3.5';'Konzentrat für eine orale / rektale Suspension';'';'';'Konzentrat für eine orale / rektale Suspension';'';'0';'L';''
'900000000012';'1.2.40.0.10.1.4.3.4.3.5';'Pulver zur Herstellung einer Infusionssuspension';'';'';'Pulver zur Herstellung einer Infusionssuspension';'';'0';'L';''
'900000000026';'1.2.40.0.10.1.4.3.4.3.5';'Tablette zur Herstellung einer Rektaldispersion';'';'';'Tablette zur Herstellung einer Rektaldispersion';'';'0';'L';''
'900000000034';'1.2.40.0.10.1.4.3.4.3.5';'Dentalpaste';'';'';'Dentalpaste';'';'0';'L';''
'900000000036';'1.2.40.0.10.1.4.3.4.3.5';'Emulsion zur urethralen Instillation';'';'';'Emulsion zur urethralen Instillation';'';'0';'L';''
'900000000037';'1.2.40.0.10.1.4.3.4.3.5';'nicht definiert';'';'';'nicht definiert';'';'0';'L';''
'900000000043';'1.2.40.0.10.1.4.3.4.3.5';'Augen- und Nasensalbe';'';'';'Augen- und Nasensalbe';'';'0';'L';''
