{
  "resourceType": "CodeSystem",
  "id": "ems-verotoxin-2-subtyp",
  "url": "https://termgit.elga.gv.at/CodeSystem-ems-verotoxin-2-subtyp",
  "identifier": [
    {
      "use": "official",
      "system": "urn:ietf:rfc:3986",
      "value": "urn:oid:1.2.40.0.34.5.97"
    }
  ],
  "version": "1.0.0",
  "name": "ems-verotoxin-2-subtyp",
  "title": "EMS_Verotoxin_2_Subtyp",
  "status": "active",
  "date": "2017-01-26",
  "description": "**Beschreibung:** Verotoxin 2 Subtyp",
  "content": "complete",
  "count": 8,
  "concept": [
    {
      "code": "NOTEST",
      "display": "nicht durchgef\u00fchrt"
    },
    {
      "code": "VT2A",
      "display": "VT2a"
    },
    {
      "code": "VT2B",
      "display": "VT2b"
    },
    {
      "code": "VT2C",
      "display": "VT2c"
    },
    {
      "code": "VT2D",
      "display": "VT2d"
    },
    {
      "code": "VT2E",
      "display": "VT2e"
    },
    {
      "code": "VT2F",
      "display": "VT2f"
    },
    {
      "code": "VT2G",
      "display": "VT2g"
    }
  ]
}