'code';'codeSystem';'displayName';'parentCodeSystemName';'concept_Beschreibung';'meaning';'hints';'orderNumber';'level';'type';'relationships';'einheit print';'einheit codiert'
'0';'1.2.40.0.34.5.155';'Transaktions ID';'https://termgit.elga.gv.at/CodeSystem-elga-auditparticipantobjectidtype';'Transaktions ID (Transaktionsklammer)';;;'1';'0';'L';;;
'100';'1.2.40.0.34.5.155';'Policy ID';'https://termgit.elga.gv.at/CodeSystem-elga-auditparticipantobjectidtype';;;;'2';'0';'L';;;
'110';'1.2.40.0.34.5.155';'KBS ID';'https://termgit.elga.gv.at/CodeSystem-elga-auditparticipantobjectidtype';;;;'3';'0';'L';;;
'120';'1.2.40.0.34.5.155';'Assertion ID';'https://termgit.elga.gv.at/CodeSystem-elga-auditparticipantobjectidtype';;;;'4';'0';'L';;;
'130';'1.2.40.0.34.5.155';'Vollmacht Referenz';'https://termgit.elga.gv.at/CodeSystem-elga-auditparticipantobjectidtype';;;;'5';'0';'L';;;
'140';'1.2.40.0.34.5.155';'GDA ID';'https://termgit.elga.gv.at/CodeSystem-elga-auditparticipantobjectidtype';;;;'6';'0';'L';;;
