'code';'codeSystem';'displayName';'parentCodeSystemName';'concept_Beschreibung';'meaning';'hints';'orderNumber';'level';'type';'relationships';'einheit print';'einheit codiert'
'FFC';'2.16.840.1.113883.5.4';'First Fill - Complete';'https://termgit.elga.gv.at/CodeSystem-hl7-act-code';'';'Vollständige Abgabe';'';'1';'0';'L';'';'';''
'FFP';'2.16.840.1.113883.5.4';'First Fill - Part Fill';'https://termgit.elga.gv.at/CodeSystem-hl7-act-code';'';'Partielle Abgabe (erste Abgabe)';'';'2';'0';'L';'';'';''
'RFC';'2.16.840.1.113883.5.4';'Refill - Complete';'https://termgit.elga.gv.at/CodeSystem-hl7-act-code';'';'Partielle Abgabe (letzte Abgabe)';'';'3';'0';'L';'';'';''
'RFP';'2.16.840.1.113883.5.4';'Refill - Part Fill';'https://termgit.elga.gv.at/CodeSystem-hl7-act-code';'';'Partielle Abgabe (weitere Teilabgabe)';'';'4';'0';'L';'';'';''
