"resource";"url";"version";"name";"title";"status";"description";"identifier";"date";"count"
"ValueSet";"https://termgit.elga.gv.at/ValueSet-elga-problemstatuscode";"3.1";"elga-problemstatuscode";"ELGA_ProblemStatusCode";"active";"None";"1.2.40.0.34.10.167";"2015-07-15";"4"

"system";"code";"display";"designation";"designation"
"https://termgit.elga.gv.at/CodeSystem-hl7-actstatus";"aborted";"aborted";"de-AT|###|Abgebrochen ";"|https://termgit.elga.gv.at/CodeSystem-austrian-designation-use##concept_beschreibung#concept_beschreibung|Vor Abschluss abgebrochen, wird nicht mehr aufgenommen"
"https://termgit.elga.gv.at/CodeSystem-hl7-actstatus";"active";"active";"de-AT|###|Aktiv";"|https://termgit.elga.gv.at/CodeSystem-austrian-designation-use##concept_beschreibung#concept_beschreibung|Bereits begonnen oder kann begonnen werden"
"https://termgit.elga.gv.at/CodeSystem-hl7-actstatus";"completed";"completed";"de-AT|###|Abgeschlossen        ";"|https://termgit.elga.gv.at/CodeSystem-austrian-designation-use##concept_beschreibung#concept_beschreibung|Normal fertiggestellt"
"https://termgit.elga.gv.at/CodeSystem-hl7-actstatus";"suspended";"suspended";"de-AT|###|Ausgesetzt    ";"|https://termgit.elga.gv.at/CodeSystem-austrian-designation-use##concept_beschreibung#concept_beschreibung|NachBeginn/Aktivierung unterbrochen -Act kann fortgesetzt werden"