"resource";"url";"version";"name";"title";"status";"description";"content";"identifier";"date";"count";"property";"property"
"CodeSystem";"https://termgit.elga.gv.at/CodeSystem-hl7-role-code";"HL7:RoleCode";"hl7-role-code";"HL7 Role Code";"active";"None";"complete";"2.16.840.1.113883.5.111";"2013-01-10";"346";"child|||code";"parent|||code"

"code";"display";"property";"property";"property";"property";"property";"property";"property";"property";"property";"property";"property";"property";"property";"property";"property";"property";"property";"property";"property";"property";"property";"property";"property";"property";"property";"property";"property";"property";"property";"property";"property";"property";"property";"property";"property";"property";"property";"property";"property";"property";"property";"property";"property";"property";"property";"property";"property";"property"
"CLAIM";"claimant"
"GT";"Guarantor"
"PH";"Policy Holder"
"PROG";"program eligible"
"PT";"Patient"
"_AffiliationRoleType";"AffiliationRoleType";"child|RESPRSN|code";"child|_CoverageSponsorRoleType|code";"child|_PayorRoleType|code"
"RESPRSN";"responsible party";"parent|_AffiliationRoleType|code";"child|EXCEST|code";"child|GUADLTM|code";"child|GUARD|code";"child|POWATT|code"
"EXCEST";"executor of estate";"parent|RESPRSN|code";"";"";"";""
"GUADLTM";"guardian ad lidem";"parent|RESPRSN|code";"";"";"";""
"GUARD";"guardian";"parent|RESPRSN|code";"";"";"";""
"POWATT";"power of attorney";"parent|RESPRSN|code";"child|DPOWATT|code";"child|HPOWATT|code";"child|SPOWATT|code";""
"DPOWATT";"durable power of attorney";"parent|POWATT|code";"";"";"";""
"HPOWATT";"healthcare power of attorney";"parent|POWATT|code";"";"";"";""
"SPOWATT";"special power of attorney";"parent|POWATT|code";"";"";"";""
"_CoverageSponsorRoleType";"CoverageSponsorRoleType";"parent|_AffiliationRoleType|code";"child|FULLINS|code";"child|SELFINS|code";"";""
"FULLINS";"Fully insured coverage sponsor";"parent|_CoverageSponsorRoleType|code";"";"";"";""
"SELFINS";"Self insured coverage sponsor";"parent|_CoverageSponsorRoleType|code";"";"";"";""
"_PayorRoleType";"PayorRoleType";"parent|_AffiliationRoleType|code";"child|ENROLBKR|code";"child|TPA|code";"child|UMO|code";""
"ENROLBKR";"Enrollment Broker";"parent|_PayorRoleType|code";"";"";"";""
"TPA";"Third party administrator";"parent|_PayorRoleType|code";"";"";"";""
"UMO";"Utilization management organization";"parent|_PayorRoleType|code";"";"";"";""
"_AssignedRoleType";"AssignedRoleType";"child|_AssignedNonPersonLivingSubjectRoleType|code";"";"";"";""
"_AssignedNonPersonLivingSubjectRoleType";"AssignedNonPersonLivingSubjectRoleType";"parent|_AssignedRoleType|code";"child|ASSIST|code";"child|BIOTH|code";"child|CCO|code";"child|SEE|code";"child|SNIFF|code"
"ASSIST";"Assistive non-person living subject";"parent|_AssignedNonPersonLivingSubjectRoleType|code";"";"";"";"";""
"BIOTH";"Biotherapeutic non-person living subject";"parent|_AssignedNonPersonLivingSubjectRoleType|code";"child|ANTIBIOT|code";"child|DEBR|code";"";"";""
"ANTIBIOT";"Antibiotic";"parent|BIOTH|code";"";"";"";"";""
"DEBR";"Debridement";"parent|BIOTH|code";"";"";"";"";""
"CCO";"Clinical Companion";"parent|_AssignedNonPersonLivingSubjectRoleType|code";"";"";"";"";""
"SEE";"Seeing";"parent|_AssignedNonPersonLivingSubjectRoleType|code";"";"";"";"";""
"SNIFF";"Sniffing";"parent|_AssignedNonPersonLivingSubjectRoleType|code";"";"";"";"";""
"_CertifiedEntityType";"CertifiedEntityType";"";"";"";"";"";""
"_CitizenRoleType";"CitizenRoleType";"child|CAS|code";"child|CN|code";"child|CNRP|code";"child|CPCA|code";"child|CRP|code";""
"CAS";"asylum seeker";"parent|_CitizenRoleType|code";"child|CASM|code";"";"";"";""
"CASM";"single minor asylum seeker";"parent|CAS|code";"";"";"";"";""
"CN";"national";"parent|_CitizenRoleType|code";"";"";"";"";""
"CNRP";"non-country member without residence permit";"parent|_CitizenRoleType|code";"child|CNRPM|code";"";"";"";""
"CNRPM";"non-country member minor without residence permit";"parent|CNRP|code";"";"";"";"";""
"CPCA";"permit card applicant";"parent|_CitizenRoleType|code";"";"";"";"";""
"CRP";"non-country member with residence permit";"parent|_CitizenRoleType|code";"child|CRPM|code";"";"";"";""
"CRPM";"non-country member minor with residence permit";"parent|CRP|code";"";"";"";"";""
"_ContactRoleType";"ContactRoleType";"child|ECON|code";"child|NOK|code";"child|_AdministrativeContactRoleType|code";"";"";""
"ECON";"emergency contact";"parent|_ContactRoleType|code";"";"";"";"";""
"NOK";"next of kin";"parent|_ContactRoleType|code";"";"";"";"";""
"_AdministrativeContactRoleType";"AdministrativeContactRoleType";"parent|_ContactRoleType|code";"child|BILL|code";"child|ORG|code";"child|PAYOR|code";"";""
"BILL";"Billing Contact";"parent|_AdministrativeContactRoleType|code";"";"";"";"";""
"ORG";"organizational contact";"parent|_AdministrativeContactRoleType|code";"";"";"";"";""
"PAYOR";"Payor Contact";"parent|_AdministrativeContactRoleType|code";"";"";"";"";""
"_IdentifiedEntityType";"IdentifiedEntityType";"child|_LocationIdentifiedEntityRoleCode|code";"";"";"";"";""
"_LocationIdentifiedEntityRoleCode";"LocationIdentifiedEntityRoleCode";"parent|_IdentifiedEntityType|code";"child|ACHFID|code";"child|JURID|code";"child|LOCHFID|code";"";""
"ACHFID";"accreditation identifier";"parent|_LocationIdentifiedEntityRoleCode|code";"";"";"";"";""
"JURID";"jurisdiction facility identifier";"parent|_LocationIdentifiedEntityRoleCode|code";"";"";"";"";""
"LOCHFID";"local facility identifier";"parent|_LocationIdentifiedEntityRoleCode|code";"";"";"";"";""
"_LivingSubjectProductionClass";"LivingSubjectProductionClass";"child|BF|code";"child|BL|code";"child|BR|code";"child|CO|code";"child|DA|code";"child|DR|code";"child|DU|code";"child|FI|code";"child|LY|code";"child|MT|code";"child|MU|code";"child|PL|code";"child|RC|code";"child|SH|code";"child|VL|code";"child|WL|code";"child|WO|code"
"BF";"Beef";"parent|_LivingSubjectProductionClass|code";"";"";"";"";"";"";"";"";"";"";"";"";"";"";"";""
"BL";"Broiler";"parent|_LivingSubjectProductionClass|code";"";"";"";"";"";"";"";"";"";"";"";"";"";"";"";""
"BR";"Breeder";"parent|_LivingSubjectProductionClass|code";"";"";"";"";"";"";"";"";"";"";"";"";"";"";"";""
"CO";"Companion";"parent|_LivingSubjectProductionClass|code";"";"";"";"";"";"";"";"";"";"";"";"";"";"";"";""
"DA";"Dairy";"parent|_LivingSubjectProductionClass|code";"";"";"";"";"";"";"";"";"";"";"";"";"";"";"";""
"DR";"Draft";"parent|_LivingSubjectProductionClass|code";"";"";"";"";"";"";"";"";"";"";"";"";"";"";"";""
"DU";"Dual";"parent|_LivingSubjectProductionClass|code";"";"";"";"";"";"";"";"";"";"";"";"";"";"";"";""
"FI";"Fiber";"parent|_LivingSubjectProductionClass|code";"";"";"";"";"";"";"";"";"";"";"";"";"";"";"";""
"LY";"Layer";"parent|_LivingSubjectProductionClass|code";"";"";"";"";"";"";"";"";"";"";"";"";"";"";"";""
"MT";"Meat";"parent|_LivingSubjectProductionClass|code";"";"";"";"";"";"";"";"";"";"";"";"";"";"";"";""
"MU";"Multiplier";"parent|_LivingSubjectProductionClass|code";"";"";"";"";"";"";"";"";"";"";"";"";"";"";"";""
"PL";"Pleasure";"parent|_LivingSubjectProductionClass|code";"";"";"";"";"";"";"";"";"";"";"";"";"";"";"";""
"RC";"Racing";"parent|_LivingSubjectProductionClass|code";"";"";"";"";"";"";"";"";"";"";"";"";"";"";"";""
"SH";"Show";"parent|_LivingSubjectProductionClass|code";"";"";"";"";"";"";"";"";"";"";"";"";"";"";"";""
"VL";"Veal";"parent|_LivingSubjectProductionClass|code";"";"";"";"";"";"";"";"";"";"";"";"";"";"";"";""
"WL";"Wool";"parent|_LivingSubjectProductionClass|code";"";"";"";"";"";"";"";"";"";"";"";"";"";"";"";""
"WO";"Working";"parent|_LivingSubjectProductionClass|code";"";"";"";"";"";"";"";"";"";"";"";"";"";"";"";""
"_MedicationGeneralizationRoleType";"MedicationGeneralizationRoleType";"child|DC|code";"child|GD|code";"child|MGDSF|code";"";"";"";"";"";"";"";"";"";"";"";"";"";""
"DC";"therapeutic class";"parent|_MedicationGeneralizationRoleType|code";"";"";"";"";"";"";"";"";"";"";"";"";"";"";"";""
"GD";"generic drug";"parent|_MedicationGeneralizationRoleType|code";"child|GDF|code";"child|GDS|code";"child|GDSF|code";"";"";"";"";"";"";"";"";"";"";"";"";""
"GDF";"generic drug form";"parent|GD|code";"";"";"";"";"";"";"";"";"";"";"";"";"";"";"";""
"GDS";"generic drug strength";"parent|GD|code";"";"";"";"";"";"";"";"";"";"";"";"";"";"";"";""
"GDSF";"generic drug strength form";"parent|GD|code";"";"";"";"";"";"";"";"";"";"";"";"";"";"";"";""
"MGDSF";"manufactured drug strength form";"parent|_MedicationGeneralizationRoleType|code";"";"";"";"";"";"";"";"";"";"";"";"";"";"";"";""
"_MemberRoleType";"MemberRoleType";"child|TRB|code";"";"";"";"";"";"";"";"";"";"";"";"";"";"";"";""
"TRB";"Tribal Member";"parent|_MemberRoleType|code";"";"";"";"";"";"";"";"";"";"";"";"";"";"";"";""
"_PersonalRelationshipRoleType";"PersonalRelationshipRoleType";"child|FAMMEMB|code";"child|FRND|code";"child|NBOR|code";"child|ROOM|code";"";"";"";"";"";"";"";"";"";"";"";"";""
"FAMMEMB";"Family Member";"parent|_PersonalRelationshipRoleType|code";"child|CHILD|code";"child|EXT|code";"child|PRN|code";"child|SIB|code";"child|SIGOTHR|code";"";"";"";"";"";"";"";"";"";"";""
"CHILD";"Child";"parent|FAMMEMB|code";"child|CHLDADOPT|code";"child|CHLDFOST|code";"child|CHLDINLAW|code";"child|DAUC|code";"child|NCHILD|code";"child|SONC|code";"child|STPCHLD|code";"";"";"";"";"";"";"";"";""
"CHLDADOPT";"adopted child";"parent|CHILD|code";"child|DAUADOPT|code";"child|SONADOPT|code";"";"";"";"";"";"";"";"";"";"";"";"";"";""
"DAUADOPT";"adopted daughter";"parent|CHLDADOPT|code";"";"";"";"";"";"";"";"";"";"";"";"";"";"";"";""
"SONADOPT";"adopted son";"parent|CHLDADOPT|code";"";"";"";"";"";"";"";"";"";"";"";"";"";"";"";""
"CHLDFOST";"foster child";"parent|CHILD|code";"child|DAUFOST|code";"child|SONFOST|code";"";"";"";"";"";"";"";"";"";"";"";"";"";""
"DAUFOST";"foster daughter";"parent|CHLDFOST|code";"";"";"";"";"";"";"";"";"";"";"";"";"";"";"";""
"SONFOST";"foster son";"parent|CHLDFOST|code";"";"";"";"";"";"";"";"";"";"";"";"";"";"";"";""
"CHLDINLAW";"child in-law";"parent|CHILD|code";"child|DAUINLAW|code";"child|SONINLAW|code";"";"";"";"";"";"";"";"";"";"";"";"";"";""
"DAUINLAW";"daughter in-law";"parent|CHLDINLAW|code";"";"";"";"";"";"";"";"";"";"";"";"";"";"";"";""
"SONINLAW";"son in-law";"parent|CHLDINLAW|code";"";"";"";"";"";"";"";"";"";"";"";"";"";"";"";""
"DAUC";"Daughter";"parent|CHILD|code";"child|DAU|code";"child|STPDAU|code";"";"";"";"";"";"";"";"";"";"";"";"";"";""
"DAU";"natural daughter";"parent|DAUC|code";"";"";"";"";"";"";"";"";"";"";"";"";"";"";"";""
"STPDAU";"stepdaughter";"parent|DAUC|code";"";"";"";"";"";"";"";"";"";"";"";"";"";"";"";""
"NCHILD";"natural child";"parent|CHILD|code";"child|SON|code";"";"";"";"";"";"";"";"";"";"";"";"";"";"";""
"SON";"natural son";"parent|NCHILD|code";"";"";"";"";"";"";"";"";"";"";"";"";"";"";"";""
"SONC";"son";"parent|CHILD|code";"child|STPSON|code";"";"";"";"";"";"";"";"";"";"";"";"";"";"";""
"STPSON";"stepson";"parent|SONC|code";"";"";"";"";"";"";"";"";"";"";"";"";"";"";"";""
"STPCHLD";"step child";"parent|CHILD|code";"";"";"";"";"";"";"";"";"";"";"";"";"";"";"";""
"EXT";"extended family member";"parent|FAMMEMB|code";"child|AUNT|code";"child|COUSN|code";"child|GGRPRN|code";"child|GRNDCHILD|code";"child|GRPRN|code";"child|NIENEPH|code";"child|UNCLE|code";"";"";"";"";"";"";"";"";""
"AUNT";"aunt";"parent|EXT|code";"child|MAUNT|code";"child|PAUNT|code";"";"";"";"";"";"";"";"";"";"";"";"";"";""
"MAUNT";"MaternalAunt";"parent|AUNT|code";"";"";"";"";"";"";"";"";"";"";"";"";"";"";"";""
"PAUNT";"PaternalAunt";"parent|AUNT|code";"";"";"";"";"";"";"";"";"";"";"";"";"";"";"";""
"COUSN";"cousin";"parent|EXT|code";"child|MCOUSN|code";"child|PCOUSN|code";"";"";"";"";"";"";"";"";"";"";"";"";"";""
"MCOUSN";"MaternalCousin";"parent|COUSN|code";"";"";"";"";"";"";"";"";"";"";"";"";"";"";"";""
"PCOUSN";"PaternalCousin";"parent|COUSN|code";"";"";"";"";"";"";"";"";"";"";"";"";"";"";"";""
"GGRPRN";"great grandparent";"parent|EXT|code";"child|GGRFTH|code";"child|GGRMTH|code";"child|MGGRFTH|code";"child|MGGRMTH|code";"child|MGGRPRN|code";"child|PGGRFTH|code";"child|PGGRMTH|code";"child|PGGRPRN|code";"";"";"";"";"";"";"";""
"GGRFTH";"great grandfather";"parent|GGRPRN|code";"";"";"";"";"";"";"";"";"";"";"";"";"";"";"";""
"GGRMTH";"great grandmother";"parent|GGRPRN|code";"";"";"";"";"";"";"";"";"";"";"";"";"";"";"";""
"MGGRFTH";"MaternalGreatgrandfather";"parent|GGRPRN|code";"";"";"";"";"";"";"";"";"";"";"";"";"";"";"";""
"MGGRMTH";"MaternalGreatgrandmother";"parent|GGRPRN|code";"";"";"";"";"";"";"";"";"";"";"";"";"";"";"";""
"MGGRPRN";"MaternalGreatgrandparent";"parent|GGRPRN|code";"";"";"";"";"";"";"";"";"";"";"";"";"";"";"";""
"PGGRFTH";"PaternalGreatgrandfather";"parent|GGRPRN|code";"";"";"";"";"";"";"";"";"";"";"";"";"";"";"";""
"PGGRMTH";"PaternalGreatgrandmother";"parent|GGRPRN|code";"";"";"";"";"";"";"";"";"";"";"";"";"";"";"";""
"PGGRPRN";"PaternalGreatgrandparent";"parent|GGRPRN|code";"";"";"";"";"";"";"";"";"";"";"";"";"";"";"";""
"GRNDCHILD";"grandchild";"parent|EXT|code";"child|GRNDDAU|code";"child|GRNDSON|code";"";"";"";"";"";"";"";"";"";"";"";"";"";""
"GRNDDAU";"granddaughter";"parent|GRNDCHILD|code";"";"";"";"";"";"";"";"";"";"";"";"";"";"";"";""
"GRNDSON";"grandson";"parent|GRNDCHILD|code";"";"";"";"";"";"";"";"";"";"";"";"";"";"";"";""
"GRPRN";"Grandparent";"parent|EXT|code";"child|GRFTH|code";"child|GRMTH|code";"child|MGRFTH|code";"child|MGRMTH|code";"child|MGRPRN|code";"child|PGRFTH|code";"child|PGRMTH|code";"child|PGRPRN|code";"";"";"";"";"";"";"";""
"GRFTH";"Grandfather";"parent|GRPRN|code";"";"";"";"";"";"";"";"";"";"";"";"";"";"";"";""
"GRMTH";"Grandmother";"parent|GRPRN|code";"";"";"";"";"";"";"";"";"";"";"";"";"";"";"";""
"MGRFTH";"MaternalGrandfather";"parent|GRPRN|code";"";"";"";"";"";"";"";"";"";"";"";"";"";"";"";""
"MGRMTH";"MaternalGrandmother";"parent|GRPRN|code";"";"";"";"";"";"";"";"";"";"";"";"";"";"";"";""
"MGRPRN";"MaternalGrandparent";"parent|GRPRN|code";"";"";"";"";"";"";"";"";"";"";"";"";"";"";"";""
"PGRFTH";"PaternalGrandfather";"parent|GRPRN|code";"";"";"";"";"";"";"";"";"";"";"";"";"";"";"";""
"PGRMTH";"PaternalGrandmother";"parent|GRPRN|code";"";"";"";"";"";"";"";"";"";"";"";"";"";"";"";""
"PGRPRN";"PaternalGrandparent";"parent|GRPRN|code";"";"";"";"";"";"";"";"";"";"";"";"";"";"";"";""
"NIENEPH";"niece/nephew";"parent|EXT|code";"child|NEPHEW|code";"child|NIECE|code";"";"";"";"";"";"";"";"";"";"";"";"";"";""
"NEPHEW";"nephew";"parent|NIENEPH|code";"";"";"";"";"";"";"";"";"";"";"";"";"";"";"";""
"NIECE";"niece";"parent|NIENEPH|code";"";"";"";"";"";"";"";"";"";"";"";"";"";"";"";""
"UNCLE";"uncle";"parent|EXT|code";"child|MUNCLE|code";"child|PUNCLE|code";"";"";"";"";"";"";"";"";"";"";"";"";"";""
"MUNCLE";"MaternalUncle";"parent|UNCLE|code";"";"";"";"";"";"";"";"";"";"";"";"";"";"";"";""
"PUNCLE";"PaternalUncle";"parent|UNCLE|code";"";"";"";"";"";"";"";"";"";"";"";"";"";"";"";""
"PRN";"Parent";"parent|FAMMEMB|code";"child|FTH|code";"child|MTH|code";"child|NPRN|code";"child|PRNINLAW|code";"child|STPPRN|code";"";"";"";"";"";"";"";"";"";"";""
"FTH";"Father";"parent|PRN|code";"";"";"";"";"";"";"";"";"";"";"";"";"";"";"";""
"MTH";"Mother";"parent|PRN|code";"";"";"";"";"";"";"";"";"";"";"";"";"";"";"";""
"NPRN";"natural parent";"parent|PRN|code";"child|NFTH|code";"child|NMTH|code";"";"";"";"";"";"";"";"";"";"";"";"";"";""
"NFTH";"natural father";"parent|NPRN|code";"child|NFTHF|code";"";"";"";"";"";"";"";"";"";"";"";"";"";"";""
"NFTHF";"natural father of fetus";"parent|NFTH|code";"";"";"";"";"";"";"";"";"";"";"";"";"";"";"";""
"NMTH";"natural mother";"parent|NPRN|code";"";"";"";"";"";"";"";"";"";"";"";"";"";"";"";""
"PRNINLAW";"parent in-law";"parent|PRN|code";"child|FTHINLAW|code";"child|MTHINLAW|code";"";"";"";"";"";"";"";"";"";"";"";"";"";""
"FTHINLAW";"father-in-law";"parent|PRNINLAW|code";"";"";"";"";"";"";"";"";"";"";"";"";"";"";"";""
"MTHINLAW";"mother-in-law";"parent|PRNINLAW|code";"";"";"";"";"";"";"";"";"";"";"";"";"";"";"";""
"STPPRN";"step parent";"parent|PRN|code";"child|STPFTH|code";"child|STPMTH|code";"";"";"";"";"";"";"";"";"";"";"";"";"";""
"STPFTH";"stepfather";"parent|STPPRN|code";"";"";"";"";"";"";"";"";"";"";"";"";"";"";"";""
"STPMTH";"stepmother";"parent|STPPRN|code";"";"";"";"";"";"";"";"";"";"";"";"";"";"";"";""
"SIB";"Sibling";"parent|FAMMEMB|code";"child|BRO|code";"child|HSIB|code";"child|NSIB|code";"child|SIBINLAW|code";"child|SIS|code";"child|STPSIB|code";"";"";"";"";"";"";"";"";"";""
"BRO";"Brother";"parent|SIB|code";"";"";"";"";"";"";"";"";"";"";"";"";"";"";"";""
"HSIB";"half-sibling";"parent|SIB|code";"child|HBRO|code";"child|HSIS|code";"";"";"";"";"";"";"";"";"";"";"";"";"";""
"HBRO";"half-brother";"parent|HSIB|code";"";"";"";"";"";"";"";"";"";"";"";"";"";"";"";""
"HSIS";"half-sister";"parent|HSIB|code";"";"";"";"";"";"";"";"";"";"";"";"";"";"";"";""
"NSIB";"natural sibling";"parent|SIB|code";"child|NBRO|code";"child|NSIS|code";"";"";"";"";"";"";"";"";"";"";"";"";"";""
"NBRO";"natural brother";"parent|NSIB|code";"";"";"";"";"";"";"";"";"";"";"";"";"";"";"";""
"NSIS";"natural sister";"parent|NSIB|code";"";"";"";"";"";"";"";"";"";"";"";"";"";"";"";""
"SIBINLAW";"sibling in-law";"parent|SIB|code";"child|BROINLAW|code";"child|SISINLAW|code";"";"";"";"";"";"";"";"";"";"";"";"";"";""
"BROINLAW";"brother-in-law";"parent|SIBINLAW|code";"";"";"";"";"";"";"";"";"";"";"";"";"";"";"";""
"SISINLAW";"sister-in-law";"parent|SIBINLAW|code";"";"";"";"";"";"";"";"";"";"";"";"";"";"";"";""
"SIS";"Sister";"parent|SIB|code";"";"";"";"";"";"";"";"";"";"";"";"";"";"";"";""
"STPSIB";"step sibling";"parent|SIB|code";"child|STPBRO|code";"child|STPSIS|code";"";"";"";"";"";"";"";"";"";"";"";"";"";""
"STPBRO";"stepbrother";"parent|STPSIB|code";"";"";"";"";"";"";"";"";"";"";"";"";"";"";"";""
"STPSIS";"stepsister";"parent|STPSIB|code";"";"";"";"";"";"";"";"";"";"";"";"";"";"";"";""
"SIGOTHR";"significant other";"parent|FAMMEMB|code";"child|DOMPART|code";"child|SPS|code";"";"";"";"";"";"";"";"";"";"";"";"";"";""
"DOMPART";"domestic partner";"parent|SIGOTHR|code";"";"";"";"";"";"";"";"";"";"";"";"";"";"";"";""
"SPS";"spouse";"parent|SIGOTHR|code";"child|HUSB|code";"child|WIFE|code";"";"";"";"";"";"";"";"";"";"";"";"";"";""
"HUSB";"husband";"parent|SPS|code";"";"";"";"";"";"";"";"";"";"";"";"";"";"";"";""
"WIFE";"wife";"parent|SPS|code";"";"";"";"";"";"";"";"";"";"";"";"";"";"";"";""
"FRND";"unrelated friend";"parent|_PersonalRelationshipRoleType|code";"";"";"";"";"";"";"";"";"";"";"";"";"";"";"";""
"NBOR";"neighbor";"parent|_PersonalRelationshipRoleType|code";"";"";"";"";"";"";"";"";"";"";"";"";"";"";"";""
"ROOM";"Roommate";"parent|_PersonalRelationshipRoleType|code";"";"";"";"";"";"";"";"";"";"";"";"";"";"";"";""
"_PolicyOrProgramCoverageRoleType";"PolicyOrProgramCoverageRoleType";"child|_CoverageRoleType|code";"child|_CoveredPartyRoleType|code";"";"";"";"";"";"";"";"";"";"";"";"";"";"";""
"_CoverageRoleType";"CoverageRoleType";"parent|_PolicyOrProgramCoverageRoleType|code";"child|FAMDEP|code";"child|HANDIC|code";"child|INJ|code";"child|SELF|code";"child|SPON|code";"child|STUD|code";"";"";"";"";"";"";"";"";"";""
"FAMDEP";"family dependent";"parent|_CoverageRoleType|code";"";"";"";"";"";"";"";"";"";"";"";"";"";"";"";""
"HANDIC";"handicapped dependent";"parent|_CoverageRoleType|code";"";"";"";"";"";"";"";"";"";"";"";"";"";"";"";""
"INJ";"injured plaintiff";"parent|_CoverageRoleType|code";"";"";"";"";"";"";"";"";"";"";"";"";"";"";"";""
"SELF";"self";"parent|_CoverageRoleType|code";"";"";"";"";"";"";"";"";"";"";"";"";"";"";"";""
"SPON";"sponsored dependent";"parent|_CoverageRoleType|code";"";"";"";"";"";"";"";"";"";"";"";"";"";"";"";""
"STUD";"student";"parent|_CoverageRoleType|code";"child|FSTUD|code";"child|PSTUD|code";"";"";"";"";"";"";"";"";"";"";"";"";"";""
"FSTUD";"full-time student";"parent|STUD|code";"";"";"";"";"";"";"";"";"";"";"";"";"";"";"";""
"PSTUD";"part-time student";"parent|STUD|code";"";"";"";"";"";"";"";"";"";"";"";"";"";"";"";""
"_CoveredPartyRoleType";"covered party role type";"parent|_PolicyOrProgramCoverageRoleType|code";"child|_ClaimantCoveredPartyRoleType|code";"child|_DependentCoveredPartyRoleType|code";"child|_IndividualInsuredPartyRoleType|code";"child|_ProgramEligiblePartyRoleType|code";"child|_SubscriberCoveredPartyRoleType|code";"";"";"";"";"";"";"";"";"";"";""
"_ClaimantCoveredPartyRoleType";"ClaimantCoveredPartyRoleType";"parent|_CoveredPartyRoleType|code";"child|CRIMEVIC|code";"child|INJWKR|code";"";"";"";"";"";"";"";"";"";"";"";"";"";""
"CRIMEVIC";"crime victim";"parent|_ClaimantCoveredPartyRoleType|code";"";"";"";"";"";"";"";"";"";"";"";"";"";"";"";""
"INJWKR";"injured worker";"parent|_ClaimantCoveredPartyRoleType|code";"";"";"";"";"";"";"";"";"";"";"";"";"";"";"";""
"_DependentCoveredPartyRoleType";"DependentCoveredPartyRoleType";"parent|_CoveredPartyRoleType|code";"child|COCBEN|code";"child|DIFFABL|code";"child|WARD|code";"";"";"";"";"";"";"";"";"";"";"";"";""
"COCBEN";"continuity of coverage beneficiary";"parent|_DependentCoveredPartyRoleType|code";"";"";"";"";"";"";"";"";"";"";"";"";"";"";"";""
"DIFFABL";"differently abled";"parent|_DependentCoveredPartyRoleType|code";"";"";"";"";"";"";"";"";"";"";"";"";"";"";"";""
"WARD";"ward";"parent|_DependentCoveredPartyRoleType|code";"";"";"";"";"";"";"";"";"";"";"";"";"";"";"";""
"_IndividualInsuredPartyRoleType";"IndividualInsuredPartyRoleType";"parent|_CoveredPartyRoleType|code";"child|RETIREE|code";"";"";"";"";"";"";"";"";"";"";"";"";"";"";""
"RETIREE";"retiree";"parent|_IndividualInsuredPartyRoleType|code";"";"";"";"";"";"";"";"";"";"";"";"";"";"";"";""
"_ProgramEligiblePartyRoleType";"ProgramEligiblePartyRoleType";"parent|_CoveredPartyRoleType|code";"child|INDIG|code";"child|MIL|code";"";"";"";"";"";"";"";"";"";"";"";"";"";""
"INDIG";"member of an indigenous people";"parent|_ProgramEligiblePartyRoleType|code";"";"";"";"";"";"";"";"";"";"";"";"";"";"";"";""
"MIL";"military";"parent|_ProgramEligiblePartyRoleType|code";"child|ACTMIL|code";"child|RETMIL|code";"child|VET|code";"";"";"";"";"";"";"";"";"";"";"";"";""
"ACTMIL";"active duty military";"parent|MIL|code";"";"";"";"";"";"";"";"";"";"";"";"";"";"";"";""
"RETMIL";"retired military";"parent|MIL|code";"";"";"";"";"";"";"";"";"";"";"";"";"";"";"";""
"VET";"veteran";"parent|MIL|code";"";"";"";"";"";"";"";"";"";"";"";"";"";"";"";""
"_SubscriberCoveredPartyRoleType";"SubscriberCoveredPartyRoleType";"parent|_CoveredPartyRoleType|code";"";"";"";"";"";"";"";"";"";"";"";"";"";"";"";""
"_ResearchSubjectRoleBasis";"ResearchSubjectRoleBasis";"child|ERL|code";"child|SCN|code";"";"";"";"";"";"";"";"";"";"";"";"";"";"";""
"ERL";"enrollment";"parent|_ResearchSubjectRoleBasis|code";"";"";"";"";"";"";"";"";"";"";"";"";"";"";"";""
"SCN";"screening";"parent|_ResearchSubjectRoleBasis|code";"";"";"";"";"";"";"";"";"";"";"";"";"";"";"";""
"_ServiceDeliveryLocationRoleType";"ServiceDeliveryLocationRoleType";"child|_DedicatedServiceDeliveryLocationRoleType|code";"child|_IncidentalServiceDeliveryLocationRoleType|code";"";"";"";"";"";"";"";"";"";"";"";"";"";"";""
"_DedicatedServiceDeliveryLocationRoleType";"DedicatedServiceDeliveryLocationRoleType";"parent|_ServiceDeliveryLocationRoleType|code";"child|_DedicatedClinicalLocationRoleType|code";"child|_DedicatedNonClinicalLocationRoleType|code";"";"";"";"";"";"";"";"";"";"";"";"";"";""
"_DedicatedClinicalLocationRoleType";"DedicatedClinicalLocationRoleType";"parent|_DedicatedServiceDeliveryLocationRoleType|code";"child|DX|code";"child|HOSP|code";"child|HU|code";"child|NCCF|code";"child|OF|code";"child|RTF|code";"";"";"";"";"";"";"";"";"";""
"DX";"Diagnostics or therapeutics unit";"parent|_DedicatedClinicalLocationRoleType|code";"child|CVDX|code";"child|GIDX|code";"child|RADDX|code";"";"";"";"";"";"";"";"";"";"";"";"";""
"CVDX";"Cardiovascular diagnostics or therapeutics unit";"parent|DX|code";"child|CATH|code";"child|ECHO|code";"";"";"";"";"";"";"";"";"";"";"";"";"";""
"CATH";"Cardiac catheterization lab";"parent|CVDX|code";"";"";"";"";"";"";"";"";"";"";"";"";"";"";"";""
"ECHO";"Echocardiography lab";"parent|CVDX|code";"";"";"";"";"";"";"";"";"";"";"";"";"";"";"";""
"GIDX";"Gastroenterology diagnostics or therapeutics lab";"parent|DX|code";"child|ENDOS|code";"";"";"";"";"";"";"";"";"";"";"";"";"";"";""
"ENDOS";"Endoscopy lab";"parent|GIDX|code";"";"";"";"";"";"";"";"";"";"";"";"";"";"";"";""
"RADDX";"Radiology diagnostics or therapeutics unit";"parent|DX|code";"child|RADO|code";"child|RNEU|code";"";"";"";"";"";"";"";"";"";"";"";"";"";""
"RADO";"Radiation oncology unit";"parent|RADDX|code";"";"";"";"";"";"";"";"";"";"";"";"";"";"";"";""
"RNEU";"Neuroradiology unit";"parent|RADDX|code";"";"";"";"";"";"";"";"";"";"";"";"";"";"";"";""
"HOSP";"Hospital";"parent|_DedicatedClinicalLocationRoleType|code";"child|CHR|code";"child|GACH|code";"child|MHSP|code";"child|PSYCHF|code";"child|RH|code";"";"";"";"";"";"";"";"";"";"";""
"CHR";"Chronic Care Facility";"parent|HOSP|code";"";"";"";"";"";"";"";"";"";"";"";"";"";"";"";""
"GACH";"Hospitals; General Acute Care Hospital";"parent|HOSP|code";"";"";"";"";"";"";"";"";"";"";"";"";"";"";"";""
"MHSP";"Military Hospital";"parent|HOSP|code";"";"";"";"";"";"";"";"";"";"";"";"";"";"";"";""
"PSYCHF";"Psychatric Care Facility";"parent|HOSP|code";"";"";"";"";"";"";"";"";"";"";"";"";"";"";"";""
"RH";"Rehabilitation hospital";"parent|HOSP|code";"child|RHAT|code";"child|RHII|code";"child|RHMAD|code";"child|RHPI|code";"child|RHYAD|code";"";"";"";"";"";"";"";"";"";"";""
"RHAT";"addiction treatment center";"parent|RH|code";"";"";"";"";"";"";"";"";"";"";"";"";"";"";"";""
"RHII";"intellectual impairment center";"parent|RH|code";"";"";"";"";"";"";"";"";"";"";"";"";"";"";"";""
"RHMAD";"parents with adjustment difficulties center";"parent|RH|code";"";"";"";"";"";"";"";"";"";"";"";"";"";"";"";""
"RHPI";"physical impairment center";"parent|RH|code";"child|RHPIH|code";"child|RHPIMS|code";"child|RHPIVS|code";"";"";"";"";"";"";"";"";"";"";"";"";""
"RHPIH";"physical impairment - hearing center";"parent|RHPI|code";"";"";"";"";"";"";"";"";"";"";"";"";"";"";"";""
"RHPIMS";"physical impairment - motor skills center";"parent|RHPI|code";"";"";"";"";"";"";"";"";"";"";"";"";"";"";"";""
"RHPIVS";"physical impairment - visual skills center";"parent|RHPI|code";"";"";"";"";"";"";"";"";"";"";"";"";"";"";"";""
"RHYAD";"youths with adjustment difficulties center";"parent|RH|code";"";"";"";"";"";"";"";"";"";"";"";"";"";"";"";""
"HU";"Hospital unit";"parent|_DedicatedClinicalLocationRoleType|code";"child|BMTU|code";"child|CCU|code";"child|CHEST|code";"child|EPIL|code";"child|ER|code";"child|HD|code";"child|HLAB|code";"child|HRAD|code";"child|HUSCS|code";"child|ICU|code";"child|INPHARM|code";"child|MBL|code";"child|NCCS|code";"child|NS|code";"child|OUTPHARM|code";"child|PEDU|code";"child|PHU|code";"child|RHU|code";"child|SLEEP|code"
"BMTU";"Bone marrow transplant unit";"parent|HU|code";"";"";"";"";"";"";"";"";"";"";"";"";"";"";"";"";"";"";""
"CCU";"Coronary care unit";"parent|HU|code";"";"";"";"";"";"";"";"";"";"";"";"";"";"";"";"";"";"";""
"CHEST";"Chest unit";"parent|HU|code";"";"";"";"";"";"";"";"";"";"";"";"";"";"";"";"";"";"";""
"EPIL";"Epilepsy unit";"parent|HU|code";"";"";"";"";"";"";"";"";"";"";"";"";"";"";"";"";"";"";""
"ER";"Emergency room";"parent|HU|code";"child|ETU|code";"";"";"";"";"";"";"";"";"";"";"";"";"";"";"";"";"";""
"ETU";"Emergency trauma unit";"parent|ER|code";"";"";"";"";"";"";"";"";"";"";"";"";"";"";"";"";"";"";""
"HD";"Hemodialysis unit";"parent|HU|code";"";"";"";"";"";"";"";"";"";"";"";"";"";"";"";"";"";"";""
"HLAB";"hospital laboratory";"parent|HU|code";"child|INLAB|code";"child|OUTLAB|code";"";"";"";"";"";"";"";"";"";"";"";"";"";"";"";"";""
"INLAB";"inpatient laboratory";"parent|HLAB|code";"";"";"";"";"";"";"";"";"";"";"";"";"";"";"";"";"";"";""
"OUTLAB";"outpatient laboratory";"parent|HLAB|code";"";"";"";"";"";"";"";"";"";"";"";"";"";"";"";"";"";"";""
"HRAD";"radiology unit";"parent|HU|code";"";"";"";"";"";"";"";"";"";"";"";"";"";"";"";"";"";"";""
"HUSCS";"specimen collection site";"parent|HU|code";"";"";"";"";"";"";"";"";"";"";"";"";"";"";"";"";"";"";""
"ICU";"Intensive care unit";"parent|HU|code";"child|PEDICU|code";"";"";"";"";"";"";"";"";"";"";"";"";"";"";"";"";"";""
"PEDICU";"Pediatric intensive care unit";"parent|ICU|code";"child|PEDNICU|code";"";"";"";"";"";"";"";"";"";"";"";"";"";"";"";"";"";""
"PEDNICU";"Pediatric neonatal intensive care unit";"parent|PEDICU|code";"";"";"";"";"";"";"";"";"";"";"";"";"";"";"";"";"";"";""
"INPHARM";"inpatient pharmacy";"parent|HU|code";"";"";"";"";"";"";"";"";"";"";"";"";"";"";"";"";"";"";""
"MBL";"medical laboratory";"parent|HU|code";"";"";"";"";"";"";"";"";"";"";"";"";"";"";"";"";"";"";""
"NCCS";"Neurology critical care and stroke unit";"parent|HU|code";"";"";"";"";"";"";"";"";"";"";"";"";"";"";"";"";"";"";""
"NS";"Neurosurgery unit";"parent|HU|code";"";"";"";"";"";"";"";"";"";"";"";"";"";"";"";"";"";"";""
"OUTPHARM";"outpatient pharmacy";"parent|HU|code";"";"";"";"";"";"";"";"";"";"";"";"";"";"";"";"";"";"";""
"PEDU";"Pediatric unit";"parent|HU|code";"";"";"";"";"";"";"";"";"";"";"";"";"";"";"";"";"";"";""
"PHU";"Psychiatric hospital unit";"parent|HU|code";"";"";"";"";"";"";"";"";"";"";"";"";"";"";"";"";"";"";""
"RHU";"Rehabilitation hospital unit";"parent|HU|code";"";"";"";"";"";"";"";"";"";"";"";"";"";"";"";"";"";"";""
"SLEEP";"Sleep disorders unit";"parent|HU|code";"";"";"";"";"";"";"";"";"";"";"";"";"";"";"";"";"";"";""
"NCCF";"Nursing or custodial care facility";"parent|_DedicatedClinicalLocationRoleType|code";"child|SNF|code";"";"";"";"";"";"";"";"";"";"";"";"";"";"";"";"";"";""
"SNF";"Skilled nursing facility";"parent|NCCF|code";"";"";"";"";"";"";"";"";"";"";"";"";"";"";"";"";"";"";""
"OF";"Outpatient facility";"parent|_DedicatedClinicalLocationRoleType|code";"child|ALL|code";"child|AMPUT|code";"child|BMTC|code";"child|BREAST|code";"child|CANC|code";"child|CAPC|code";"child|CARD|code";"child|COAG|code";"child|CRS|code";"child|DERM|code";"child|ENDO|code";"child|ENT|code";"child|FMC|code";"child|GI|code";"child|GIM|code";"child|GYN|code";"child|HEM|code";"child|HTN|code";"child|IEC|code";"child|INFD|code";"child|INV|code";"child|LYMPH|code";"child|MGEN|code";"child|NEPH|code";"child|NEUR|code";"child|OB|code";"child|OMS|code";"child|ONCL|code";"child|OPH|code";"child|OPTC|code";"child|ORTHO|code";"child|PAINCL|code";"child|PC|code";"child|PEDC|code";"child|POD|code";"child|PREV|code";"child|PROCTO|code";"child|PROFF|code";"child|PROS|code";"child|PSI|code";"child|PSY|code";"child|RHEUM|code";"child|SPMED|code";"child|SU|code";"child|TR|code";"child|TRAVEL|code";"child|WND|code"
"ALL";"Allergy clinic";"parent|OF|code";"";"";"";"";"";"";"";"";"";"";"";"";"";"";"";"";"";"";"";"";"";"";"";"";"";"";"";"";"";"";"";"";"";"";"";"";"";"";"";"";"";"";"";"";"";"";""
"AMPUT";"Amputee clinic";"parent|OF|code";"";"";"";"";"";"";"";"";"";"";"";"";"";"";"";"";"";"";"";"";"";"";"";"";"";"";"";"";"";"";"";"";"";"";"";"";"";"";"";"";"";"";"";"";"";"";""
"BMTC";"Bone marrow transplant clinic";"parent|OF|code";"";"";"";"";"";"";"";"";"";"";"";"";"";"";"";"";"";"";"";"";"";"";"";"";"";"";"";"";"";"";"";"";"";"";"";"";"";"";"";"";"";"";"";"";"";"";""
"BREAST";"Breast clinic";"parent|OF|code";"";"";"";"";"";"";"";"";"";"";"";"";"";"";"";"";"";"";"";"";"";"";"";"";"";"";"";"";"";"";"";"";"";"";"";"";"";"";"";"";"";"";"";"";"";"";""
"CANC";"Child and adolescent neurology clinic";"parent|OF|code";"";"";"";"";"";"";"";"";"";"";"";"";"";"";"";"";"";"";"";"";"";"";"";"";"";"";"";"";"";"";"";"";"";"";"";"";"";"";"";"";"";"";"";"";"";"";""
"CAPC";"Child and adolescent psychiatry clinic";"parent|OF|code";"";"";"";"";"";"";"";"";"";"";"";"";"";"";"";"";"";"";"";"";"";"";"";"";"";"";"";"";"";"";"";"";"";"";"";"";"";"";"";"";"";"";"";"";"";"";""
"CARD";"Ambulatory Health Care Facilities; Clinic/Center; Rehabilitation: Cardiac Facilities";"parent|OF|code";"child|PEDCARD|code";"";"";"";"";"";"";"";"";"";"";"";"";"";"";"";"";"";"";"";"";"";"";"";"";"";"";"";"";"";"";"";"";"";"";"";"";"";"";"";"";"";"";"";"";"";""
"PEDCARD";"Pediatric cardiology clinic";"parent|CARD|code";"";"";"";"";"";"";"";"";"";"";"";"";"";"";"";"";"";"";"";"";"";"";"";"";"";"";"";"";"";"";"";"";"";"";"";"";"";"";"";"";"";"";"";"";"";"";""
"COAG";"Coagulation clinic";"parent|OF|code";"";"";"";"";"";"";"";"";"";"";"";"";"";"";"";"";"";"";"";"";"";"";"";"";"";"";"";"";"";"";"";"";"";"";"";"";"";"";"";"";"";"";"";"";"";"";""
"CRS";"Colon and rectal surgery clinic";"parent|OF|code";"";"";"";"";"";"";"";"";"";"";"";"";"";"";"";"";"";"";"";"";"";"";"";"";"";"";"";"";"";"";"";"";"";"";"";"";"";"";"";"";"";"";"";"";"";"";""
"DERM";"Dermatology clinic";"parent|OF|code";"";"";"";"";"";"";"";"";"";"";"";"";"";"";"";"";"";"";"";"";"";"";"";"";"";"";"";"";"";"";"";"";"";"";"";"";"";"";"";"";"";"";"";"";"";"";""
"ENDO";"Endocrinology clinic";"parent|OF|code";"child|PEDE|code";"";"";"";"";"";"";"";"";"";"";"";"";"";"";"";"";"";"";"";"";"";"";"";"";"";"";"";"";"";"";"";"";"";"";"";"";"";"";"";"";"";"";"";"";"";""
"PEDE";"Pediatric endocrinology clinic";"parent|ENDO|code";"";"";"";"";"";"";"";"";"";"";"";"";"";"";"";"";"";"";"";"";"";"";"";"";"";"";"";"";"";"";"";"";"";"";"";"";"";"";"";"";"";"";"";"";"";"";""
"ENT";"Otorhinolaryngology clinic";"parent|OF|code";"";"";"";"";"";"";"";"";"";"";"";"";"";"";"";"";"";"";"";"";"";"";"";"";"";"";"";"";"";"";"";"";"";"";"";"";"";"";"";"";"";"";"";"";"";"";""
"FMC";"Family medicine clinic";"parent|OF|code";"";"";"";"";"";"";"";"";"";"";"";"";"";"";"";"";"";"";"";"";"";"";"";"";"";"";"";"";"";"";"";"";"";"";"";"";"";"";"";"";"";"";"";"";"";"";""
"GI";"Gastroenterology clinic";"parent|OF|code";"child|PEDGI|code";"";"";"";"";"";"";"";"";"";"";"";"";"";"";"";"";"";"";"";"";"";"";"";"";"";"";"";"";"";"";"";"";"";"";"";"";"";"";"";"";"";"";"";"";"";""
"PEDGI";"Pediatric gastroenterology clinic";"parent|GI|code";"";"";"";"";"";"";"";"";"";"";"";"";"";"";"";"";"";"";"";"";"";"";"";"";"";"";"";"";"";"";"";"";"";"";"";"";"";"";"";"";"";"";"";"";"";"";""
"GIM";"General internal medicine clinic";"parent|OF|code";"";"";"";"";"";"";"";"";"";"";"";"";"";"";"";"";"";"";"";"";"";"";"";"";"";"";"";"";"";"";"";"";"";"";"";"";"";"";"";"";"";"";"";"";"";"";""
"GYN";"Gynecology clinic";"parent|OF|code";"";"";"";"";"";"";"";"";"";"";"";"";"";"";"";"";"";"";"";"";"";"";"";"";"";"";"";"";"";"";"";"";"";"";"";"";"";"";"";"";"";"";"";"";"";"";""
"HEM";"Hematology clinic";"parent|OF|code";"child|PEDHEM|code";"";"";"";"";"";"";"";"";"";"";"";"";"";"";"";"";"";"";"";"";"";"";"";"";"";"";"";"";"";"";"";"";"";"";"";"";"";"";"";"";"";"";"";"";"";""
"PEDHEM";"Pediatric hematology clinic";"parent|HEM|code";"";"";"";"";"";"";"";"";"";"";"";"";"";"";"";"";"";"";"";"";"";"";"";"";"";"";"";"";"";"";"";"";"";"";"";"";"";"";"";"";"";"";"";"";"";"";""
"HTN";"Hypertension clinic";"parent|OF|code";"";"";"";"";"";"";"";"";"";"";"";"";"";"";"";"";"";"";"";"";"";"";"";"";"";"";"";"";"";"";"";"";"";"";"";"";"";"";"";"";"";"";"";"";"";"";""
"IEC";"Impairment evaluation center";"parent|OF|code";"";"";"";"";"";"";"";"";"";"";"";"";"";"";"";"";"";"";"";"";"";"";"";"";"";"";"";"";"";"";"";"";"";"";"";"";"";"";"";"";"";"";"";"";"";"";""
"INFD";"Infectious disease clinic";"parent|OF|code";"child|PEDID|code";"";"";"";"";"";"";"";"";"";"";"";"";"";"";"";"";"";"";"";"";"";"";"";"";"";"";"";"";"";"";"";"";"";"";"";"";"";"";"";"";"";"";"";"";"";""
"PEDID";"Pediatric infectious disease clinic";"parent|INFD|code";"";"";"";"";"";"";"";"";"";"";"";"";"";"";"";"";"";"";"";"";"";"";"";"";"";"";"";"";"";"";"";"";"";"";"";"";"";"";"";"";"";"";"";"";"";"";""
"INV";"Infertility clinic";"parent|OF|code";"";"";"";"";"";"";"";"";"";"";"";"";"";"";"";"";"";"";"";"";"";"";"";"";"";"";"";"";"";"";"";"";"";"";"";"";"";"";"";"";"";"";"";"";"";"";""
"LYMPH";"Lympedema clinic";"parent|OF|code";"";"";"";"";"";"";"";"";"";"";"";"";"";"";"";"";"";"";"";"";"";"";"";"";"";"";"";"";"";"";"";"";"";"";"";"";"";"";"";"";"";"";"";"";"";"";""
"MGEN";"Medical genetics clinic";"parent|OF|code";"";"";"";"";"";"";"";"";"";"";"";"";"";"";"";"";"";"";"";"";"";"";"";"";"";"";"";"";"";"";"";"";"";"";"";"";"";"";"";"";"";"";"";"";"";"";""
"NEPH";"Nephrology clinic";"parent|OF|code";"child|PEDNEPH|code";"";"";"";"";"";"";"";"";"";"";"";"";"";"";"";"";"";"";"";"";"";"";"";"";"";"";"";"";"";"";"";"";"";"";"";"";"";"";"";"";"";"";"";"";"";""
"PEDNEPH";"Pediatric nephrology clinic";"parent|NEPH|code";"";"";"";"";"";"";"";"";"";"";"";"";"";"";"";"";"";"";"";"";"";"";"";"";"";"";"";"";"";"";"";"";"";"";"";"";"";"";"";"";"";"";"";"";"";"";""
"NEUR";"Neurology clinic";"parent|OF|code";"";"";"";"";"";"";"";"";"";"";"";"";"";"";"";"";"";"";"";"";"";"";"";"";"";"";"";"";"";"";"";"";"";"";"";"";"";"";"";"";"";"";"";"";"";"";""
"OB";"Obstetrics clinic";"parent|OF|code";"";"";"";"";"";"";"";"";"";"";"";"";"";"";"";"";"";"";"";"";"";"";"";"";"";"";"";"";"";"";"";"";"";"";"";"";"";"";"";"";"";"";"";"";"";"";""
"OMS";"Oral and maxillofacial surgery clinic";"parent|OF|code";"";"";"";"";"";"";"";"";"";"";"";"";"";"";"";"";"";"";"";"";"";"";"";"";"";"";"";"";"";"";"";"";"";"";"";"";"";"";"";"";"";"";"";"";"";"";""
"ONCL";"Medical oncology clinic";"parent|OF|code";"child|PEDHO|code";"";"";"";"";"";"";"";"";"";"";"";"";"";"";"";"";"";"";"";"";"";"";"";"";"";"";"";"";"";"";"";"";"";"";"";"";"";"";"";"";"";"";"";"";"";""
"PEDHO";"Pediatric oncology clinic";"parent|ONCL|code";"";"";"";"";"";"";"";"";"";"";"";"";"";"";"";"";"";"";"";"";"";"";"";"";"";"";"";"";"";"";"";"";"";"";"";"";"";"";"";"";"";"";"";"";"";"";""
"OPH";"Opthalmology clinic";"parent|OF|code";"";"";"";"";"";"";"";"";"";"";"";"";"";"";"";"";"";"";"";"";"";"";"";"";"";"";"";"";"";"";"";"";"";"";"";"";"";"";"";"";"";"";"";"";"";"";""
"OPTC";"optometry clinic";"parent|OF|code";"";"";"";"";"";"";"";"";"";"";"";"";"";"";"";"";"";"";"";"";"";"";"";"";"";"";"";"";"";"";"";"";"";"";"";"";"";"";"";"";"";"";"";"";"";"";""
"ORTHO";"Orthopedics clinic";"parent|OF|code";"child|HAND|code";"";"";"";"";"";"";"";"";"";"";"";"";"";"";"";"";"";"";"";"";"";"";"";"";"";"";"";"";"";"";"";"";"";"";"";"";"";"";"";"";"";"";"";"";"";""
"HAND";"Hand clinic";"parent|ORTHO|code";"";"";"";"";"";"";"";"";"";"";"";"";"";"";"";"";"";"";"";"";"";"";"";"";"";"";"";"";"";"";"";"";"";"";"";"";"";"";"";"";"";"";"";"";"";"";""
"PAINCL";"Pain clinic";"parent|OF|code";"";"";"";"";"";"";"";"";"";"";"";"";"";"";"";"";"";"";"";"";"";"";"";"";"";"";"";"";"";"";"";"";"";"";"";"";"";"";"";"";"";"";"";"";"";"";""
"PC";"Primary care clinic";"parent|OF|code";"";"";"";"";"";"";"";"";"";"";"";"";"";"";"";"";"";"";"";"";"";"";"";"";"";"";"";"";"";"";"";"";"";"";"";"";"";"";"";"";"";"";"";"";"";"";""
"PEDC";"Pediatrics clinic";"parent|OF|code";"child|PEDRHEUM|code";"";"";"";"";"";"";"";"";"";"";"";"";"";"";"";"";"";"";"";"";"";"";"";"";"";"";"";"";"";"";"";"";"";"";"";"";"";"";"";"";"";"";"";"";"";""
"PEDRHEUM";"Pediatric rheumatology clinic";"parent|PEDC|code";"";"";"";"";"";"";"";"";"";"";"";"";"";"";"";"";"";"";"";"";"";"";"";"";"";"";"";"";"";"";"";"";"";"";"";"";"";"";"";"";"";"";"";"";"";"";""
"POD";"Podiatry clinic";"parent|OF|code";"";"";"";"";"";"";"";"";"";"";"";"";"";"";"";"";"";"";"";"";"";"";"";"";"";"";"";"";"";"";"";"";"";"";"";"";"";"";"";"";"";"";"";"";"";"";""
"PREV";"Preventive medicine clinic";"parent|OF|code";"";"";"";"";"";"";"";"";"";"";"";"";"";"";"";"";"";"";"";"";"";"";"";"";"";"";"";"";"";"";"";"";"";"";"";"";"";"";"";"";"";"";"";"";"";"";""
"PROCTO";"Proctology clinic";"parent|OF|code";"";"";"";"";"";"";"";"";"";"";"";"";"";"";"";"";"";"";"";"";"";"";"";"";"";"";"";"";"";"";"";"";"";"";"";"";"";"";"";"";"";"";"";"";"";"";""
"PROFF";"Providerīs Office";"parent|OF|code";"";"";"";"";"";"";"";"";"";"";"";"";"";"";"";"";"";"";"";"";"";"";"";"";"";"";"";"";"";"";"";"";"";"";"";"";"";"";"";"";"";"";"";"";"";"";""
"PROS";"Prosthodontics clinic";"parent|OF|code";"";"";"";"";"";"";"";"";"";"";"";"";"";"";"";"";"";"";"";"";"";"";"";"";"";"";"";"";"";"";"";"";"";"";"";"";"";"";"";"";"";"";"";"";"";"";""
"PSI";"Psychology clinic";"parent|OF|code";"";"";"";"";"";"";"";"";"";"";"";"";"";"";"";"";"";"";"";"";"";"";"";"";"";"";"";"";"";"";"";"";"";"";"";"";"";"";"";"";"";"";"";"";"";"";""
"PSY";"Psychiatry clinic";"parent|OF|code";"";"";"";"";"";"";"";"";"";"";"";"";"";"";"";"";"";"";"";"";"";"";"";"";"";"";"";"";"";"";"";"";"";"";"";"";"";"";"";"";"";"";"";"";"";"";""
"RHEUM";"Rheumatology clinic";"parent|OF|code";"";"";"";"";"";"";"";"";"";"";"";"";"";"";"";"";"";"";"";"";"";"";"";"";"";"";"";"";"";"";"";"";"";"";"";"";"";"";"";"";"";"";"";"";"";"";""
"SPMED";"Sports medicine clinic";"parent|OF|code";"";"";"";"";"";"";"";"";"";"";"";"";"";"";"";"";"";"";"";"";"";"";"";"";"";"";"";"";"";"";"";"";"";"";"";"";"";"";"";"";"";"";"";"";"";"";""
"SU";"Surgery clinic";"parent|OF|code";"child|PLS|code";"child|URO|code";"";"";"";"";"";"";"";"";"";"";"";"";"";"";"";"";"";"";"";"";"";"";"";"";"";"";"";"";"";"";"";"";"";"";"";"";"";"";"";"";"";"";"";"";""
"PLS";"Plastic surgery clinic";"parent|SU|code";"";"";"";"";"";"";"";"";"";"";"";"";"";"";"";"";"";"";"";"";"";"";"";"";"";"";"";"";"";"";"";"";"";"";"";"";"";"";"";"";"";"";"";"";"";"";""
"URO";"Urology clinic";"parent|SU|code";"";"";"";"";"";"";"";"";"";"";"";"";"";"";"";"";"";"";"";"";"";"";"";"";"";"";"";"";"";"";"";"";"";"";"";"";"";"";"";"";"";"";"";"";"";"";""
"TR";"Transplant clinic";"parent|OF|code";"";"";"";"";"";"";"";"";"";"";"";"";"";"";"";"";"";"";"";"";"";"";"";"";"";"";"";"";"";"";"";"";"";"";"";"";"";"";"";"";"";"";"";"";"";"";""
"TRAVEL";"Travel and geographic medicine clinic";"parent|OF|code";"";"";"";"";"";"";"";"";"";"";"";"";"";"";"";"";"";"";"";"";"";"";"";"";"";"";"";"";"";"";"";"";"";"";"";"";"";"";"";"";"";"";"";"";"";"";""
"WND";"Wound clinic";"parent|OF|code";"";"";"";"";"";"";"";"";"";"";"";"";"";"";"";"";"";"";"";"";"";"";"";"";"";"";"";"";"";"";"";"";"";"";"";"";"";"";"";"";"";"";"";"";"";"";""
"RTF";"Residential treatment facility";"parent|_DedicatedClinicalLocationRoleType|code";"child|PRC|code";"child|SURF|code";"";"";"";"";"";"";"";"";"";"";"";"";"";"";"";"";"";"";"";"";"";"";"";"";"";"";"";"";"";"";"";"";"";"";"";"";"";"";"";"";"";"";"";"";""
"PRC";"Pain rehabilitation center";"parent|RTF|code";"";"";"";"";"";"";"";"";"";"";"";"";"";"";"";"";"";"";"";"";"";"";"";"";"";"";"";"";"";"";"";"";"";"";"";"";"";"";"";"";"";"";"";"";"";"";""
"SURF";"Substance use rehabilitation facility";"parent|RTF|code";"";"";"";"";"";"";"";"";"";"";"";"";"";"";"";"";"";"";"";"";"";"";"";"";"";"";"";"";"";"";"";"";"";"";"";"";"";"";"";"";"";"";"";"";"";"";""
"_DedicatedNonClinicalLocationRoleType";"DedicatedNonClinicalLocationRoleType";"parent|_DedicatedServiceDeliveryLocationRoleType|code";"child|DADDR|code";"child|MOBL|code";"child|PHARM|code";"";"";"";"";"";"";"";"";"";"";"";"";"";"";"";"";"";"";"";"";"";"";"";"";"";"";"";"";"";"";"";"";"";"";"";"";"";"";"";"";"";"";"";""
"DADDR";"Delivery Address";"parent|_DedicatedNonClinicalLocationRoleType|code";"";"";"";"";"";"";"";"";"";"";"";"";"";"";"";"";"";"";"";"";"";"";"";"";"";"";"";"";"";"";"";"";"";"";"";"";"";"";"";"";"";"";"";"";"";"";""
"MOBL";"Mobile Unit";"parent|_DedicatedNonClinicalLocationRoleType|code";"child|AMB|code";"";"";"";"";"";"";"";"";"";"";"";"";"";"";"";"";"";"";"";"";"";"";"";"";"";"";"";"";"";"";"";"";"";"";"";"";"";"";"";"";"";"";"";"";"";""
"AMB";"Ambulance";"parent|MOBL|code";"";"";"";"";"";"";"";"";"";"";"";"";"";"";"";"";"";"";"";"";"";"";"";"";"";"";"";"";"";"";"";"";"";"";"";"";"";"";"";"";"";"";"";"";"";"";""
"PHARM";"Pharmacy";"parent|_DedicatedNonClinicalLocationRoleType|code";"";"";"";"";"";"";"";"";"";"";"";"";"";"";"";"";"";"";"";"";"";"";"";"";"";"";"";"";"";"";"";"";"";"";"";"";"";"";"";"";"";"";"";"";"";"";""
"_IncidentalServiceDeliveryLocationRoleType";"IncidentalServiceDeliveryLocationRoleType";"parent|_ServiceDeliveryLocationRoleType|code";"child|ACC|code";"child|COMM|code";"child|PTRES|code";"child|SCHOOL|code";"child|UPC|code";"child|WORK|code";"";"";"";"";"";"";"";"";"";"";"";"";"";"";"";"";"";"";"";"";"";"";"";"";"";"";"";"";"";"";"";"";"";"";"";"";"";"";"";"";""
"ACC";"accident site";"parent|_IncidentalServiceDeliveryLocationRoleType|code";"";"";"";"";"";"";"";"";"";"";"";"";"";"";"";"";"";"";"";"";"";"";"";"";"";"";"";"";"";"";"";"";"";"";"";"";"";"";"";"";"";"";"";"";"";"";""
"COMM";"Community Location";"parent|_IncidentalServiceDeliveryLocationRoleType|code";"child|CSC|code";"";"";"";"";"";"";"";"";"";"";"";"";"";"";"";"";"";"";"";"";"";"";"";"";"";"";"";"";"";"";"";"";"";"";"";"";"";"";"";"";"";"";"";"";"";""
"CSC";"community service center";"parent|COMM|code";"";"";"";"";"";"";"";"";"";"";"";"";"";"";"";"";"";"";"";"";"";"";"";"";"";"";"";"";"";"";"";"";"";"";"";"";"";"";"";"";"";"";"";"";"";"";""
"PTRES";"Patientīs Residence";"parent|_IncidentalServiceDeliveryLocationRoleType|code";"";"";"";"";"";"";"";"";"";"";"";"";"";"";"";"";"";"";"";"";"";"";"";"";"";"";"";"";"";"";"";"";"";"";"";"";"";"";"";"";"";"";"";"";"";"";""
"SCHOOL";"school";"parent|_IncidentalServiceDeliveryLocationRoleType|code";"";"";"";"";"";"";"";"";"";"";"";"";"";"";"";"";"";"";"";"";"";"";"";"";"";"";"";"";"";"";"";"";"";"";"";"";"";"";"";"";"";"";"";"";"";"";""
"UPC";"underage protection center";"parent|_IncidentalServiceDeliveryLocationRoleType|code";"";"";"";"";"";"";"";"";"";"";"";"";"";"";"";"";"";"";"";"";"";"";"";"";"";"";"";"";"";"";"";"";"";"";"";"";"";"";"";"";"";"";"";"";"";"";""
"WORK";"work site";"parent|_IncidentalServiceDeliveryLocationRoleType|code";"";"";"";"";"";"";"";"";"";"";"";"";"";"";"";"";"";"";"";"";"";"";"";"";"";"";"";"";"";"";"";"";"";"";"";"";"";"";"";"";"";"";"";"";"";"";""
"_SpecimenRoleType";"SpecimenRoleType";"child|C|code";"child|G|code";"child|L|code";"child|P|code";"child|Q|code";"child|R|code";"";"";"";"";"";"";"";"";"";"";"";"";"";"";"";"";"";"";"";"";"";"";"";"";"";"";"";"";"";"";"";"";"";"";"";"";"";"";"";"";"";""
"C";"Calibrator";"parent|_SpecimenRoleType|code";"";"";"";"";"";"";"";"";"";"";"";"";"";"";"";"";"";"";"";"";"";"";"";"";"";"";"";"";"";"";"";"";"";"";"";"";"";"";"";"";"";"";"";"";"";"";""
"G";"Group";"parent|_SpecimenRoleType|code";"";"";"";"";"";"";"";"";"";"";"";"";"";"";"";"";"";"";"";"";"";"";"";"";"";"";"";"";"";"";"";"";"";"";"";"";"";"";"";"";"";"";"";"";"";"";""
"L";"Pool";"parent|_SpecimenRoleType|code";"";"";"";"";"";"";"";"";"";"";"";"";"";"";"";"";"";"";"";"";"";"";"";"";"";"";"";"";"";"";"";"";"";"";"";"";"";"";"";"";"";"";"";"";"";"";""
"P";"Patient";"parent|_SpecimenRoleType|code";"";"";"";"";"";"";"";"";"";"";"";"";"";"";"";"";"";"";"";"";"";"";"";"";"";"";"";"";"";"";"";"";"";"";"";"";"";"";"";"";"";"";"";"";"";"";""
"Q";"Quality Control";"parent|_SpecimenRoleType|code";"child|B|code";"child|E|code";"child|F|code";"child|O|code";"child|V|code";"";"";"";"";"";"";"";"";"";"";"";"";"";"";"";"";"";"";"";"";"";"";"";"";"";"";"";"";"";"";"";"";"";"";"";"";"";"";"";"";"";""
"B";"Blind";"parent|Q|code";"";"";"";"";"";"";"";"";"";"";"";"";"";"";"";"";"";"";"";"";"";"";"";"";"";"";"";"";"";"";"";"";"";"";"";"";"";"";"";"";"";"";"";"";"";"";""
"E";"Electronic QC";"parent|Q|code";"";"";"";"";"";"";"";"";"";"";"";"";"";"";"";"";"";"";"";"";"";"";"";"";"";"";"";"";"";"";"";"";"";"";"";"";"";"";"";"";"";"";"";"";"";"";""
"F";"Filler Proficiency";"parent|Q|code";"";"";"";"";"";"";"";"";"";"";"";"";"";"";"";"";"";"";"";"";"";"";"";"";"";"";"";"";"";"";"";"";"";"";"";"";"";"";"";"";"";"";"";"";"";"";""
"O";"Operator Proficiency";"parent|Q|code";"";"";"";"";"";"";"";"";"";"";"";"";"";"";"";"";"";"";"";"";"";"";"";"";"";"";"";"";"";"";"";"";"";"";"";"";"";"";"";"";"";"";"";"";"";"";""
"V";"Verifying";"parent|Q|code";"";"";"";"";"";"";"";"";"";"";"";"";"";"";"";"";"";"";"";"";"";"";"";"";"";"";"";"";"";"";"";"";"";"";"";"";"";"";"";"";"";"";"";"";"";"";""
"R";"Replicate";"parent|_SpecimenRoleType|code";"";"";"";"";"";"";"";"";"";"";"";"";"";"";"";"";"";"";"";"";"";"";"";"";"";"";"";"";"";"";"";"";"";"";"";"";"";"";"";"";"";"";"";"";"";"";""
"communityLaboratory";"Community Laboratory";"";"";"";"";"";"";"";"";"";"";"";"";"";"";"";"";"";"";"";"";"";"";"";"";"";"";"";"";"";"";"";"";"";"";"";"";"";"";"";"";"";"";"";"";"";"";"";""
"homeHealth";"Home Health";"";"";"";"";"";"";"";"";"";"";"";"";"";"";"";"";"";"";"";"";"";"";"";"";"";"";"";"";"";"";"";"";"";"";"";"";"";"";"";"";"";"";"";"";"";"";"";""
"laboratory";"Laboratory";"";"";"";"";"";"";"";"";"";"";"";"";"";"";"";"";"";"";"";"";"";"";"";"";"";"";"";"";"";"";"";"";"";"";"";"";"";"";"";"";"";"";"";"";"";"";"";""
"pathologist";"Pathologist";"";"";"";"";"";"";"";"";"";"";"";"";"";"";"";"";"";"";"";"";"";"";"";"";"";"";"";"";"";"";"";"";"";"";"";"";"";"";"";"";"";"";"";"";"";"";"";""
"phlebotomist";"Phlebotomist";"";"";"";"";"";"";"";"";"";"";"";"";"";"";"";"";"";"";"";"";"";"";"";"";"";"";"";"";"";"";"";"";"";"";"";"";"";"";"";"";"";"";"";"";"";"";"";""
"subject";"Self";"";"";"";"";"";"";"";"";"";"";"";"";"";"";"";"";"";"";"";"";"";"";"";"";"";"";"";"";"";"";"";"";"";"";"";"";"";"";"";"";"";"";"";"";"";"";"";""
"thirdParty";"Third Party";"";"";"";"";"";"";"";"";"";"";"";"";"";"";"";"";"";"";"";"";"";"";"";"";"";"";"";"";"";"";"";"";"";"";"";"";"";"";"";"";"";"";"";"";"";"";"";""