{
  "resourceType": "CodeSystem",
  "id": "geschlechtercodes-iso-iec-5218",
  "url": "https://termgit.elga.gv.at/CodeSystem-geschlechtercodes-iso-iec-5218",
  "identifier": [
    {
      "use": "official",
      "system": "urn:ietf:rfc:3986",
      "value": "urn:oid:1.0.5218"
    }
  ],
  "version": "Corrected Version 2004",
  "name": "geschlechtercodes-iso-iec-5218",
  "title": "Geschlechtercodes - ISO IEC 5218",
  "status": "active",
  "date": "2015-04-01",
  "content": "complete",
  "count": 4,
  "concept": [
    {
      "code": "0",
      "display": "unbekannt"
    },
    {
      "code": "1",
      "display": "m\u00e4nnlich"
    },
    {
      "code": "2",
      "display": "weiblich"
    },
    {
      "code": "9",
      "display": "nicht zutreffend"
    }
  ]
}