"resource";"url";"version";"name";"title";"status";"description";"identifier";"date";"contact";"count"
"ValueSet";"https://termgit.elga.gv.at/ValueSet-elga-languagecode";"202008";"elga-languagecode";"ELGA_LanguageCode";"active";"**Description:** ELGA_LanguageCode is used to describe the language of the documents (CDA-Element: ClinicalDocument.languageCode). Description available under: http://www.ietf.org/rfc/rfc3066.txt

**Beschreibung:** Wird zur Beschreibung der Sprache des Dokuments verwendet  (Element ClinicalDocument.languageCode). Beschreibung unter http://www.ietf.org/rfc/rfc3066.txt";"1.2.40.0.34.10.10";"2020-08-20";"|url|http://www.hl7.org";"56"

"system";"code";"display";"designation"
"https://termgit.elga.gv.at/CodeSystem-hl7-language-identification";"ar";"Arabisch";"|https://termgit.elga.gv.at/CodeSystem-austrian-designation-use##concept_beschreibung#concept_beschreibung|HL7 Tags for the Identification of Languages"
"https://termgit.elga.gv.at/CodeSystem-hl7-language-identification";"bn";"Bengali";"|https://termgit.elga.gv.at/CodeSystem-austrian-designation-use##concept_beschreibung#concept_beschreibung|HL7 Tags for the Identification of Languages"
"https://termgit.elga.gv.at/CodeSystem-hl7-language-identification";"cs";"Tschechisch";"|https://termgit.elga.gv.at/CodeSystem-austrian-designation-use##concept_beschreibung#concept_beschreibung|HL7 Tags for the Identification of Languages"
"https://termgit.elga.gv.at/CodeSystem-hl7-language-identification";"da";"Dänisch";"|https://termgit.elga.gv.at/CodeSystem-austrian-designation-use##concept_beschreibung#concept_beschreibung|HL7 Tags for the Identification of Languages"
"https://termgit.elga.gv.at/CodeSystem-hl7-language-identification";"de";"Deutsch";"|https://termgit.elga.gv.at/CodeSystem-austrian-designation-use##concept_beschreibung#concept_beschreibung|HL7 Tags for the Identification of Languages"
"https://termgit.elga.gv.at/CodeSystem-hl7-language-identification";"de-AT";"Österreichisches Deutsch";"|https://termgit.elga.gv.at/CodeSystem-austrian-designation-use##hinweise#hinweise|Einziger erlaubter Wert"
"https://termgit.elga.gv.at/CodeSystem-hl7-language-identification";"de-CH";"Deutsch (Schweiz)";"|https://termgit.elga.gv.at/CodeSystem-austrian-designation-use##concept_beschreibung#concept_beschreibung|HL7 Tags for the Identification of Languages"
"https://termgit.elga.gv.at/CodeSystem-hl7-language-identification";"de-DE";"Deutsch (Deutschland)";"|https://termgit.elga.gv.at/CodeSystem-austrian-designation-use##concept_beschreibung#concept_beschreibung|HL7 Tags for the Identification of Languages"
"https://termgit.elga.gv.at/CodeSystem-hl7-language-identification";"el";"Neugriechisch";"|https://termgit.elga.gv.at/CodeSystem-austrian-designation-use##concept_beschreibung#concept_beschreibung|HL7 Tags for the Identification of Languages"
"https://termgit.elga.gv.at/CodeSystem-hl7-language-identification";"en";"Englisch";"|https://termgit.elga.gv.at/CodeSystem-austrian-designation-use##concept_beschreibung#concept_beschreibung|HL7 Tags for the Identification of Languages"
"https://termgit.elga.gv.at/CodeSystem-hl7-language-identification";"en-AU";"Englisch (Australien)";"|https://termgit.elga.gv.at/CodeSystem-austrian-designation-use##concept_beschreibung#concept_beschreibung|HL7 Tags for the Identification of Languages"
"https://termgit.elga.gv.at/CodeSystem-hl7-language-identification";"en-CA";"Englisch (Kanada)";"|https://termgit.elga.gv.at/CodeSystem-austrian-designation-use##concept_beschreibung#concept_beschreibung|HL7 Tags for the Identification of Languages"
"https://termgit.elga.gv.at/CodeSystem-hl7-language-identification";"en-GB";"Englisch (GB)";"|https://termgit.elga.gv.at/CodeSystem-austrian-designation-use##concept_beschreibung#concept_beschreibung|HL7 Tags for the Identification of Languages"
"https://termgit.elga.gv.at/CodeSystem-hl7-language-identification";"en-IN";"Englisch (Indien)";"|https://termgit.elga.gv.at/CodeSystem-austrian-designation-use##concept_beschreibung#concept_beschreibung|HL7 Tags for the Identification of Languages"
"https://termgit.elga.gv.at/CodeSystem-hl7-language-identification";"en-NZ";"Englisch (Neuseeland)";"|https://termgit.elga.gv.at/CodeSystem-austrian-designation-use##concept_beschreibung#concept_beschreibung|HL7 Tags for the Identification of Languages"
"https://termgit.elga.gv.at/CodeSystem-hl7-language-identification";"en-SG";"Englisch (Singapur)";"|https://termgit.elga.gv.at/CodeSystem-austrian-designation-use##concept_beschreibung#concept_beschreibung|HL7 Tags for the Identification of Languages"
"https://termgit.elga.gv.at/CodeSystem-hl7-language-identification";"en-US";"Englisch (US)";"|https://termgit.elga.gv.at/CodeSystem-austrian-designation-use##concept_beschreibung#concept_beschreibung|HL7 Tags for the Identification of Languages"
"https://termgit.elga.gv.at/CodeSystem-hl7-language-identification";"es";"Spanisch";"|https://termgit.elga.gv.at/CodeSystem-austrian-designation-use##concept_beschreibung#concept_beschreibung|HL7 Tags for the Identification of Languages"
"https://termgit.elga.gv.at/CodeSystem-hl7-language-identification";"es-AR";"Spanisch (Argentinien)";"|https://termgit.elga.gv.at/CodeSystem-austrian-designation-use##concept_beschreibung#concept_beschreibung|HL7 Tags for the Identification of Languages"
"https://termgit.elga.gv.at/CodeSystem-hl7-language-identification";"es-ES";"Spanish (Spanien)";"|https://termgit.elga.gv.at/CodeSystem-austrian-designation-use##concept_beschreibung#concept_beschreibung|HL7 Tags for the Identification of Languages"
"https://termgit.elga.gv.at/CodeSystem-hl7-language-identification";"es-UY";"Spanish (Uruguay)";"|https://termgit.elga.gv.at/CodeSystem-austrian-designation-use##concept_beschreibung#concept_beschreibung|HL7 Tags for the Identification of Languages"
"https://termgit.elga.gv.at/CodeSystem-hl7-language-identification";"fi";"Finnisch";"|https://termgit.elga.gv.at/CodeSystem-austrian-designation-use##concept_beschreibung#concept_beschreibung|HL7 Tags for the Identification of Languages"
"https://termgit.elga.gv.at/CodeSystem-hl7-language-identification";"fr";"Französisch";"|https://termgit.elga.gv.at/CodeSystem-austrian-designation-use##concept_beschreibung#concept_beschreibung|HL7 Tags for the Identification of Languages"
"https://termgit.elga.gv.at/CodeSystem-hl7-language-identification";"fr-BE";"Französisch (Belgien)";"|https://termgit.elga.gv.at/CodeSystem-austrian-designation-use##concept_beschreibung#concept_beschreibung|HL7 Tags for the Identification of Languages"
"https://termgit.elga.gv.at/CodeSystem-hl7-language-identification";"fr-CH";"Französisch (Schweiz)";"|https://termgit.elga.gv.at/CodeSystem-austrian-designation-use##concept_beschreibung#concept_beschreibung|HL7 Tags for the Identification of Languages"
"https://termgit.elga.gv.at/CodeSystem-hl7-language-identification";"fr-FR";"Französisch (Frankreich)";"|https://termgit.elga.gv.at/CodeSystem-austrian-designation-use##concept_beschreibung#concept_beschreibung|HL7 Tags for the Identification of Languages"
"https://termgit.elga.gv.at/CodeSystem-hl7-language-identification";"fy";"Friesisch";"|https://termgit.elga.gv.at/CodeSystem-austrian-designation-use##concept_beschreibung#concept_beschreibung|HL7 Tags for the Identification of Languages"
"https://termgit.elga.gv.at/CodeSystem-hl7-language-identification";"fy-NL";"Friesisch (Niederlande)";"|https://termgit.elga.gv.at/CodeSystem-austrian-designation-use##concept_beschreibung#concept_beschreibung|HL7 Tags for the Identification of Languages"
"https://termgit.elga.gv.at/CodeSystem-hl7-language-identification";"hi";"Hindi";"|https://termgit.elga.gv.at/CodeSystem-austrian-designation-use##concept_beschreibung#concept_beschreibung|HL7 Tags for the Identification of Languages"
"https://termgit.elga.gv.at/CodeSystem-hl7-language-identification";"hr";"Kroatisch";"|https://termgit.elga.gv.at/CodeSystem-austrian-designation-use##concept_beschreibung#concept_beschreibung|HL7 Tags for the Identification of Languages"
"https://termgit.elga.gv.at/CodeSystem-hl7-language-identification";"it";"Italienisch";"|https://termgit.elga.gv.at/CodeSystem-austrian-designation-use##concept_beschreibung#concept_beschreibung|HL7 Tags for the Identification of Languages"
"https://termgit.elga.gv.at/CodeSystem-hl7-language-identification";"it-CH";"Italienisch (Schweiz)";"|https://termgit.elga.gv.at/CodeSystem-austrian-designation-use##concept_beschreibung#concept_beschreibung|HL7 Tags for the Identification of Languages"
"https://termgit.elga.gv.at/CodeSystem-hl7-language-identification";"it-IT";"Italienisch (Italien)";"|https://termgit.elga.gv.at/CodeSystem-austrian-designation-use##concept_beschreibung#concept_beschreibung|HL7 Tags for the Identification of Languages"
"https://termgit.elga.gv.at/CodeSystem-hl7-language-identification";"ja";"Japanisch";"|https://termgit.elga.gv.at/CodeSystem-austrian-designation-use##concept_beschreibung#concept_beschreibung|HL7 Tags for the Identification of Languages"
"https://termgit.elga.gv.at/CodeSystem-hl7-language-identification";"ko";"Koreanisch";"|https://termgit.elga.gv.at/CodeSystem-austrian-designation-use##concept_beschreibung#concept_beschreibung|HL7 Tags for the Identification of Languages"
"https://termgit.elga.gv.at/CodeSystem-hl7-language-identification";"nl";"Niederländisch";"|https://termgit.elga.gv.at/CodeSystem-austrian-designation-use##concept_beschreibung#concept_beschreibung|HL7 Tags for the Identification of Languages"
"https://termgit.elga.gv.at/CodeSystem-hl7-language-identification";"nl-BE";"Niederländisch (Belgien)";"|https://termgit.elga.gv.at/CodeSystem-austrian-designation-use##concept_beschreibung#concept_beschreibung|HL7 Tags for the Identification of Languages"
"https://termgit.elga.gv.at/CodeSystem-hl7-language-identification";"nl-NL";"Niederländisch (Niederlande)";"|https://termgit.elga.gv.at/CodeSystem-austrian-designation-use##concept_beschreibung#concept_beschreibung|HL7 Tags for the Identification of Languages"
"https://termgit.elga.gv.at/CodeSystem-hl7-language-identification";"no";"Norwegisch";"|https://termgit.elga.gv.at/CodeSystem-austrian-designation-use##concept_beschreibung#concept_beschreibung|HL7 Tags for the Identification of Languages"
"https://termgit.elga.gv.at/CodeSystem-hl7-language-identification";"no-NO";"Norwegisch (Norwegen)";"|https://termgit.elga.gv.at/CodeSystem-austrian-designation-use##concept_beschreibung#concept_beschreibung|HL7 Tags for the Identification of Languages"
"https://termgit.elga.gv.at/CodeSystem-hl7-language-identification";"pa";"Pandschabi-Sprache";"|https://termgit.elga.gv.at/CodeSystem-austrian-designation-use##concept_beschreibung#concept_beschreibung|HL7 Tags for the Identification of Languages"
"https://termgit.elga.gv.at/CodeSystem-hl7-language-identification";"pl";"Polnisch";"|https://termgit.elga.gv.at/CodeSystem-austrian-designation-use##concept_beschreibung#concept_beschreibung|HL7 Tags for the Identification of Languages"
"https://termgit.elga.gv.at/CodeSystem-hl7-language-identification";"pt";"Portugiesisch";"|https://termgit.elga.gv.at/CodeSystem-austrian-designation-use##concept_beschreibung#concept_beschreibung|HL7 Tags for the Identification of Languages"
"https://termgit.elga.gv.at/CodeSystem-hl7-language-identification";"pt-BR";"Portugiesisch (Brasilien)";"|https://termgit.elga.gv.at/CodeSystem-austrian-designation-use##concept_beschreibung#concept_beschreibung|HL7 Tags for the Identification of Languages"
"https://termgit.elga.gv.at/CodeSystem-hl7-language-identification";"ru";"Russisch";"|https://termgit.elga.gv.at/CodeSystem-austrian-designation-use##concept_beschreibung#concept_beschreibung|HL7 Tags for the Identification of Languages"
"https://termgit.elga.gv.at/CodeSystem-hl7-language-identification";"ru-RU";"Russisch (Russland)";"|https://termgit.elga.gv.at/CodeSystem-austrian-designation-use##concept_beschreibung#concept_beschreibung|HL7 Tags for the Identification of Languages"
"https://termgit.elga.gv.at/CodeSystem-hl7-language-identification";"sr";"Serbisch";"|https://termgit.elga.gv.at/CodeSystem-austrian-designation-use##concept_beschreibung#concept_beschreibung|HL7 Tags for the Identification of Languages"
"https://termgit.elga.gv.at/CodeSystem-hl7-language-identification";"sr-RS";"Serbisch (Serbien)";"|https://termgit.elga.gv.at/CodeSystem-austrian-designation-use##concept_beschreibung#concept_beschreibung|HL7 Tags for the Identification of Languages"
"https://termgit.elga.gv.at/CodeSystem-hl7-language-identification";"sv";"Schwedisch";"|https://termgit.elga.gv.at/CodeSystem-austrian-designation-use##concept_beschreibung#concept_beschreibung|HL7 Tags for the Identification of Languages"
"https://termgit.elga.gv.at/CodeSystem-hl7-language-identification";"sv-SE";"Schwedisch (Schweden)";"|https://termgit.elga.gv.at/CodeSystem-austrian-designation-use##concept_beschreibung#concept_beschreibung|HL7 Tags for the Identification of Languages"
"https://termgit.elga.gv.at/CodeSystem-hl7-language-identification";"te";"Telugu-Sprache";"|https://termgit.elga.gv.at/CodeSystem-austrian-designation-use##concept_beschreibung#concept_beschreibung|HL7 Tags for the Identification of Languages"
"https://termgit.elga.gv.at/CodeSystem-hl7-language-identification";"zh";"Chinesisch";"|https://termgit.elga.gv.at/CodeSystem-austrian-designation-use##concept_beschreibung#concept_beschreibung|HL7 Tags for the Identification of Languages"
"https://termgit.elga.gv.at/CodeSystem-hl7-language-identification";"zh-CN";"Chinesisch (China)";"|https://termgit.elga.gv.at/CodeSystem-austrian-designation-use##concept_beschreibung#concept_beschreibung|HL7 Tags for the Identification of Languages"
"https://termgit.elga.gv.at/CodeSystem-hl7-language-identification";"zh-HK";"Chinesisch (Hong Kong)";"|https://termgit.elga.gv.at/CodeSystem-austrian-designation-use##concept_beschreibung#concept_beschreibung|HL7 Tags for the Identification of Languages"
"https://termgit.elga.gv.at/CodeSystem-hl7-language-identification";"zh-SG";"Chinesisch (Singapur)";"|https://termgit.elga.gv.at/CodeSystem-austrian-designation-use##concept_beschreibung#concept_beschreibung|HL7 Tags for the Identification of Languages"
"https://termgit.elga.gv.at/CodeSystem-hl7-language-identification";"zh-TW";"Chinesisch (Taiwan)";"|https://termgit.elga.gv.at/CodeSystem-austrian-designation-use##concept_beschreibung#concept_beschreibung|HL7 Tags for the Identification of Languages"