{
  "resourceType": "CodeSystem",
  "id": "oeaek-fachrichtung",
  "url": "https://termgit.elga.gv.at/CodeSystem-oeaek-fachrichtung",
  "identifier": [
    {
      "use": "official",
      "system": "urn:ietf:rfc:3986",
      "value": "urn:oid:1.2.40.0.34.3.1.10.20"
    }
  ],
  "version": "201902",
  "name": "oeaek-fachrichtung",
  "title": "OEAEK_Fachrichtung",
  "status": "active",
  "date": "2019-02-26",
  "description": "**Description:** Code List of all disciplines valid in Austria issued by the Medical Chamber of Austria\n\n**Beschreibung:** Code Liste aller in \u00d6sterreich g\u00fcltigen Fachrichtungen",
  "content": "complete",
  "count": 71,
  "concept": [
    {
      "code": "1",
      "display": "An\u00e4sthesiologie und Intensivmedizin",
      "designation": [
        {
          "language": "de-AT",
          "value": "An\u00e4sthesiologie und Intensivmedizin"
        }
      ]
    },
    {
      "code": "10",
      "display": "Neurologie und Psychiatrie",
      "designation": [
        {
          "language": "de-AT",
          "value": "Neurologie und Psychiatrie"
        }
      ]
    },
    {
      "code": "11",
      "display": "Orthop\u00e4die und Orthop\u00e4dische Chirurgie",
      "designation": [
        {
          "language": "de-AT",
          "value": "Orthop\u00e4die und Orthop\u00e4dische Chirurgie"
        }
      ]
    },
    {
      "code": "114",
      "display": "Orthop\u00e4die und Traumatologie",
      "designation": [
        {
          "language": "de-AT",
          "value": "Orthop\u00e4die und Traumatologie"
        }
      ]
    },
    {
      "code": "12",
      "display": "Physikalische Medizin und allgemeine Rehabilitation",
      "designation": [
        {
          "language": "de-AT",
          "value": "Physikalische Medizin und allgemeine Rehabilitation"
        }
      ]
    },
    {
      "code": "13",
      "display": "Radiologie",
      "designation": [
        {
          "language": "de-AT",
          "value": "Radiologie"
        }
      ]
    },
    {
      "code": "14",
      "display": "Unfallchirurgie",
      "designation": [
        {
          "language": "de-AT",
          "value": "Unfallchirurgie"
        }
      ]
    },
    {
      "code": "15",
      "display": "Urologie",
      "designation": [
        {
          "language": "de-AT",
          "value": "Urologie"
        }
      ]
    },
    {
      "code": "16",
      "display": "Zahn-, Mund und Kieferheilkunde",
      "designation": [
        {
          "language": "de-AT",
          "value": "Zahn-, Mund und Kieferheilkunde"
        }
      ]
    },
    {
      "code": "18",
      "display": "Psychiatrie und Neurologie",
      "designation": [
        {
          "language": "de-AT",
          "value": "Psychiatrie und Neurologie"
        }
      ]
    },
    {
      "code": "19",
      "display": "Medizinische und Chemische Labordiagnostik",
      "designation": [
        {
          "language": "de-AT",
          "value": "Medizinische und Chemische Labordiagnostik"
        }
      ]
    },
    {
      "code": "2",
      "display": "Augenheilkunde und Optometrie",
      "designation": [
        {
          "language": "de-AT",
          "value": "Augenheilkunde und Optometrie"
        }
      ]
    },
    {
      "code": "20",
      "display": "Mikrobiol.serol.Labordiagnostik",
      "designation": [
        {
          "language": "de-AT",
          "value": "Mikrobiol.serol.Labordiagnostik"
        }
      ]
    },
    {
      "code": "21",
      "display": "Anatomie",
      "designation": [
        {
          "language": "de-AT",
          "value": "Anatomie"
        }
      ]
    },
    {
      "code": "22",
      "display": "Histologie, Embryologie u. Zellbiologie",
      "designation": [
        {
          "language": "de-AT",
          "value": "Histologie, Embryologie u. Zellbiologie"
        }
      ]
    },
    {
      "code": "23",
      "display": "Klinische Mikrobiologie und Hygiene",
      "designation": [
        {
          "language": "de-AT",
          "value": "Klinische Mikrobiologie und Hygiene"
        }
      ]
    },
    {
      "code": "24",
      "display": "Klinische Pathologie und Molekularpathologie",
      "designation": [
        {
          "language": "de-AT",
          "value": "Klinische Pathologie und Molekularpathologie"
        }
      ]
    },
    {
      "code": "25",
      "display": "Pharmakologie und Toxikologie",
      "designation": [
        {
          "language": "de-AT",
          "value": "Pharmakologie und Toxikologie"
        }
      ]
    },
    {
      "code": "26",
      "display": "Physiologie",
      "designation": [
        {
          "language": "de-AT",
          "value": "Physiologie"
        }
      ]
    },
    {
      "code": "27",
      "display": "Gerichtsmedizin",
      "designation": [
        {
          "language": "de-AT",
          "value": "Gerichtsmedizin"
        }
      ]
    },
    {
      "code": "29",
      "display": "Neurochirurgie",
      "designation": [
        {
          "language": "de-AT",
          "value": "Neurochirurgie"
        }
      ]
    },
    {
      "code": "3",
      "display": "Allgemeinchirurgie und Viszeralchirurgie",
      "designation": [
        {
          "language": "de-AT",
          "value": "Allgemeinchirurgie und Viszeralchirurgie"
        }
      ]
    },
    {
      "code": "30",
      "display": "Plastische, Rekonstruktive und \u00c4sthetische Chirurgie",
      "designation": [
        {
          "language": "de-AT",
          "value": "Plastische, Rekonstruktive und \u00c4sthetische Chirurgie"
        }
      ]
    },
    {
      "code": "31",
      "display": "Klinische Immunologie",
      "designation": [
        {
          "language": "de-AT",
          "value": "Klinische Immunologie"
        }
      ]
    },
    {
      "code": "32",
      "display": "Medizinische Genetik",
      "designation": [
        {
          "language": "de-AT",
          "value": "Medizinische Genetik"
        }
      ]
    },
    {
      "code": "326",
      "display": "Physiologie und Pathophysiologie",
      "designation": [
        {
          "language": "de-AT",
          "value": "Physiologie und Pathophysiologie"
        }
      ]
    },
    {
      "code": "33",
      "display": "Medizinische Biophysik",
      "designation": [
        {
          "language": "de-AT",
          "value": "Medizinische Biophysik"
        }
      ]
    },
    {
      "code": "34",
      "display": "Neurobiologie",
      "designation": [
        {
          "language": "de-AT",
          "value": "Neurobiologie"
        }
      ]
    },
    {
      "code": "35",
      "display": "Neuropathologie",
      "designation": [
        {
          "language": "de-AT",
          "value": "Neuropathologie"
        }
      ]
    },
    {
      "code": "352",
      "display": "Klinische Pathologie und Neuropathologie",
      "designation": [
        {
          "language": "de-AT",
          "value": "Klinische Pathologie und Neuropathologie"
        }
      ]
    },
    {
      "code": "36",
      "display": "Pathophysiologie",
      "designation": [
        {
          "language": "de-AT",
          "value": "Pathophysiologie"
        }
      ]
    },
    {
      "code": "37",
      "display": "Sozialmedizin",
      "designation": [
        {
          "language": "de-AT",
          "value": "Sozialmedizin"
        }
      ]
    },
    {
      "code": "370",
      "display": "Public Health",
      "designation": [
        {
          "language": "de-AT",
          "value": "Public Health"
        }
      ]
    },
    {
      "code": "372",
      "display": "Allgemeinchirurgie und Gef\u00e4\u00dfchirurgie",
      "designation": [
        {
          "language": "de-AT",
          "value": "Allgemeinchirurgie und Gef\u00e4\u00dfchirurgie"
        }
      ]
    },
    {
      "code": "38",
      "display": "Tumorbiologie",
      "designation": [
        {
          "language": "de-AT",
          "value": "Tumorbiologie"
        }
      ]
    },
    {
      "code": "4",
      "display": "Frauenheilkunde und Geburtshilfe",
      "designation": [
        {
          "language": "de-AT",
          "value": "Frauenheilkunde und Geburtshilfe"
        }
      ]
    },
    {
      "code": "40",
      "display": "Arbeitsmedizin",
      "designation": [
        {
          "language": "de-AT",
          "value": "Arbeitsmedizin"
        }
      ]
    },
    {
      "code": "400",
      "display": "Arbeitsmedizin und angewandte Physiologie",
      "designation": [
        {
          "language": "de-AT",
          "value": "Arbeitsmedizin und angewandte Physiologie"
        }
      ]
    },
    {
      "code": "41",
      "display": "Transfusionsmedizin",
      "designation": [
        {
          "language": "de-AT",
          "value": "Transfusionsmedizin"
        }
      ]
    },
    {
      "code": "42",
      "display": "Kinder- und Jugendchirurgie",
      "designation": [
        {
          "language": "de-AT",
          "value": "Kinder- und Jugendchirurgie"
        }
      ]
    },
    {
      "code": "43",
      "display": "Medizinische Leistungsphysiologie",
      "designation": [
        {
          "language": "de-AT",
          "value": "Medizinische Leistungsphysiologie"
        }
      ]
    },
    {
      "code": "44",
      "display": "Mund-,  Kiefer- und Gesichtschirurgie",
      "designation": [
        {
          "language": "de-AT",
          "value": "Mund-,  Kiefer- und Gesichtschirurgie"
        }
      ]
    },
    {
      "code": "45",
      "display": "Nuklearmedizin",
      "designation": [
        {
          "language": "de-AT",
          "value": "Nuklearmedizin"
        }
      ]
    },
    {
      "code": "46",
      "display": "Spezifische Prophylaxe und Tropenmedizin",
      "designation": [
        {
          "language": "de-AT",
          "value": "Spezifische Prophylaxe und Tropenmedizin"
        }
      ]
    },
    {
      "code": "463",
      "display": "Klinische Immunologie und Spezifische Prophylaxe und Tropenmedizin",
      "designation": [
        {
          "language": "de-AT",
          "value": "Klinische Immunologie und Spezifische Prophylaxe und Tropenmedizin"
        }
      ]
    },
    {
      "code": "47",
      "display": "Strahlentherapie-Radioonkologie",
      "designation": [
        {
          "language": "de-AT",
          "value": "Strahlentherapie-Radioonkologie"
        }
      ]
    },
    {
      "code": "48",
      "display": "Virologie",
      "designation": [
        {
          "language": "de-AT",
          "value": "Virologie"
        }
      ]
    },
    {
      "code": "482",
      "display": "Klinische Mikrobiologie und Virologie",
      "designation": [
        {
          "language": "de-AT",
          "value": "Klinische Mikrobiologie und Virologie"
        }
      ]
    },
    {
      "code": "49",
      "display": "Neurologie",
      "designation": [
        {
          "language": "de-AT",
          "value": "Neurologie"
        }
      ]
    },
    {
      "code": "5",
      "display": "Hals- Nasen- und Ohrenheilkunde",
      "designation": [
        {
          "language": "de-AT",
          "value": "Hals- Nasen- und Ohrenheilkunde"
        }
      ]
    },
    {
      "code": "50",
      "display": "Psychiatrie",
      "designation": [
        {
          "language": "de-AT",
          "value": "Psychiatrie"
        }
      ]
    },
    {
      "code": "51",
      "display": "Radiologie",
      "designation": [
        {
          "language": "de-AT",
          "value": "Radiologie"
        }
      ]
    },
    {
      "code": "52",
      "display": "Psychiatrie und psychotherapeutische Medizin",
      "designation": [
        {
          "language": "de-AT",
          "value": "Psychiatrie und psychotherapeutische Medizin"
        }
      ]
    },
    {
      "code": "53",
      "display": "Herzchirurgie",
      "designation": [
        {
          "language": "de-AT",
          "value": "Herzchirurgie"
        }
      ]
    },
    {
      "code": "54",
      "display": "Thoraxchirurgie",
      "designation": [
        {
          "language": "de-AT",
          "value": "Thoraxchirurgie"
        }
      ]
    },
    {
      "code": "55",
      "display": "Kinder- und Jugendpsychiatrie",
      "designation": [
        {
          "language": "de-AT",
          "value": "Kinder- und Jugendpsychiatrie"
        }
      ]
    },
    {
      "code": "550",
      "display": "Kinder- und Jugendpsychiatrie und Psychotherapeutische Medizin",
      "designation": [
        {
          "language": "de-AT",
          "value": "Kinder- und Jugendpsychiatrie und Psychotherapeutische Medizin"
        }
      ]
    },
    {
      "code": "6",
      "display": "Haut- und Geschlechtskrankheiten",
      "designation": [
        {
          "language": "de-AT",
          "value": "Haut- und Geschlechtskrankheiten"
        }
      ]
    },
    {
      "code": "7",
      "display": "Innere Medizin",
      "designation": [
        {
          "language": "de-AT",
          "value": "Innere Medizin"
        }
      ]
    },
    {
      "code": "709",
      "display": "Innere Medizin und Pneumologie",
      "designation": [
        {
          "language": "de-AT",
          "value": "Innere Medizin und Pneumologie"
        }
      ]
    },
    {
      "code": "761",
      "display": "Innere Medizin und Infektiologie",
      "designation": [
        {
          "language": "de-AT",
          "value": "Innere Medizin und Infektiologie"
        }
      ]
    },
    {
      "code": "774",
      "display": "Innere Medizin und Kardiologie",
      "designation": [
        {
          "language": "de-AT",
          "value": "Innere Medizin und Kardiologie"
        }
      ]
    },
    {
      "code": "775",
      "display": "Innere Medizin und Nephrologie",
      "designation": [
        {
          "language": "de-AT",
          "value": "Innere Medizin und Nephrologie"
        }
      ]
    },
    {
      "code": "778",
      "display": "Innere Medizin und Angiologie",
      "designation": [
        {
          "language": "de-AT",
          "value": "Innere Medizin und Angiologie"
        }
      ]
    },
    {
      "code": "779",
      "display": "Innere Medizin und Endokrinologie und Diabetologie",
      "designation": [
        {
          "language": "de-AT",
          "value": "Innere Medizin und Endokrinologie und Diabetologie"
        }
      ]
    },
    {
      "code": "780",
      "display": "Innere Medizin und Gastroenterologie und Hepatologie",
      "designation": [
        {
          "language": "de-AT",
          "value": "Innere Medizin und Gastroenterologie und Hepatologie"
        }
      ]
    },
    {
      "code": "782",
      "display": "Innere Medizin und H\u00e4matologie und internistische Onkologie",
      "designation": [
        {
          "language": "de-AT",
          "value": "Innere Medizin und H\u00e4matologie und internistische Onkologie"
        }
      ]
    },
    {
      "code": "783",
      "display": "Innere Medizin und Intensivmedizin",
      "designation": [
        {
          "language": "de-AT",
          "value": "Innere Medizin und Intensivmedizin"
        }
      ]
    },
    {
      "code": "786",
      "display": "Innere Medizin und Rheumatologie",
      "designation": [
        {
          "language": "de-AT",
          "value": "Innere Medizin und Rheumatologie"
        }
      ]
    },
    {
      "code": "8",
      "display": "Kinder- und Jugendheilkunde",
      "designation": [
        {
          "language": "de-AT",
          "value": "Kinder- und Jugendheilkunde"
        }
      ]
    },
    {
      "code": "9",
      "display": "Lungenkrankheiten",
      "designation": [
        {
          "language": "de-AT",
          "value": "Lungenkrankheiten"
        }
      ]
    }
  ]
}