'code';'codeSystem';'displayName';'parentCode';'concept_Beschreibung';'meaning';'hints';'level';'type';'relationships'
'N';'1.2.40.0.34.5.59';'nein';'';'';'';'';'0';'L';''
'NA';'1.2.40.0.34.5.59';'nicht zutreffend';'';'';'';'';'0';'L';''
'PSBL';'1.2.40.0.34.5.59';'möglich';'';'';'';'';'0';'L';''
'UNK';'1.2.40.0.34.5.59';'unbekannt';'';'';'';'';'0';'L';''
'Y';'1.2.40.0.34.5.59';'ja';'';'';'';'';'0';'L';''
