"resource";"url";"version";"name";"title";"status";"description";"content";"identifier";"date";"count"
"CodeSystem";"https://termgit.elga.gv.at/CodeSystem-ems-material";"2.0.0";"ems-material";"EMS_Material";"active";"**Beschreibung:** Liste der Probenmaterialien für EMS Labormeldungen";"complete";"1.2.40.0.34.5.58";"2020-11-06";"65"

"code";"display";"definition"
"ABSTRICH";"Abstriche";"Abstriche"
"ABSZESS";"Abszess";"Abszess"
"ANAL";"Rektalabstrich";"Analabstrich | Rektalabstrich | Stuhl/Analabstrich"
"ASCITES";"Ascites";"Ascites"
"BIOPSIE";"Biopsiematerial";"Biopsate | Biopsie (periphere Nerven) | Biopsiematerial"
"BLOOD";"Blut";"Blut | Blut (DNA/Leukozyten)"
"BLOODAUS";"Blutausstrich";"Blutausstrich"
"BLOODDRY";"getrockneter Bluttropfen";"getrockneter Bluttropfen"
"BLOODFULL";"Vollblut";"Vollblut"
"BLOODPOST";"Leichenblut";"Leichenblut"
"BRONCHLAV";"Bronchiallavage";"Bronchiallavage"
"BRONCHSEKR";"Bronchialsekret";"Bronchialsekret"
"CERVSWAB";"Cervicalabstrich";"Cervicalabstrich"
"CSF";"Liquor";"Liquor"
"EDTA";"EDTA-Blut";"EDTA-Blut"
"EDTAPLAS";"EDTA-Blut/Plas,a";"EDTA Blut/Plasma"
"EITER";"Eiter";"Eiter"
"EJAKULAT";"Ejakulat";"Ejakulat"
"ERBR";"Erbrochenes";"Erbrochenes"
"EXSUPERI";"Exsudat Peritoneum";""
"EXSUPLEURA";"Exsudat Pleura";""
"GALLE";"Gallenflüssigkeit";"Gallenflüssigkeit"
"GELENK";"Gelenkflüssigkeit";"Gelenkflüssigkeit"
"GEWEBE";"Gewebe";"Gewebeprobe | Gewebeproben | Epithelabstrich"
"GURGELAT";"Gurgelat";""
"HAUT";"Haut";"Abstrich von Hautläsionen | Haut | Hautbiopsie oder Aspirat von Purpura/Petechien | verdächtige Hautareale"
"HIRN";"Hirn";"Hirnbiopsie/ -gewebe | Hirnbiopsie-Gewebe | Hirngewebe"
"ISOLAT";"Isolat";"Bakterienisolat | Isolat | Isolate"
"KNOCHENMARK";"Knochenmark";"Knochenmark"
"KRUSTE";"Kruste";"Kruste"
"LAVAGE";"Lavage";"Lavage"
"LEBER";"Leberbiopsie";"Leberbiopsie"
"LUNGE";"Lunge";"Lunge | Pleurapunktat"
"LYMPH";"Lymphknoten";"Punktat von Lymphknoten | Resektionsmaterial aus Lymphknoten"
"MAGENSAFT";"Magensaft";""
"MEMBRAN";"Membran";"Membran"
"MILZ";"Milz";"Milz"
"NACKENHAUT";"Nackenhautbiopsie";"Nackenhautbiopsie"
"NASALSWAB";"Nasenabstrich";"Nasenabstrich"
"NASALTHROATSWAB";"Rachenabstrich";"Abstrich Nasen-Rachenschleimhaut | Nasen- oder Nasen-/Rachenabstrich"
"NEWBORNSWAB";"Neugeborenenabstrich";"Neugeborenenabstrich"
"OPMATERIAL";"Operationsmaterial";"intraoperatives Material | Operationsmaterial"
"OTHER";"anderes";"anderes"
"OTHERBODY";"andere erregerhaltige Körperflüssigkeiten";"andere erregerhaltige Körperflüssigkeiten"
"OTHERNOTSTERILE";"andere nicht sterile Probe";"andere nicht sterile Probe | andere nicht-sterile Probe"
"OTHERSTERILE";"andere sterile Probe";"andere sterile Probe | andere sterile Stelle"
"OTHERSWAB";"andere Abstriche";"andere Abstriche"
"PLASMA";"Plasma";"Plasma"
"POSTMORTEM";"post mortem-Material";"post mortem-Material | Proben von Verstorbenen"
"PUNKTAT";"Punktionsmaterial";"Punktionsmaterial"
"RESPSEKR";"Respiratorische Sekrete";"Respiratorische Sekrete"
"RNA";"nCoV RNA";""
"SEKRETE";"Sekrete";"Sekrete"
"SERUM";"Serum";"Serum"
"SONST";"sonstiges";"sonstiges"
"SPEICHEL";"Speichel";"oral Fluid | Speichel | Speichel/oral fluid"
"SPRITZE";"Spritzeninhalt";"Spritzeninhalt"
"SPUTUM";"Sputum";"Sputum | tiefes respiratorisches Sekret"
"STUHL";"Stuhl";"Stuhl"
"THROATSWAB";"Rachenabstrich";"Rachenabstrich"
"THROATSWABFLUSS";"Rachenspülflüssigkeit Serum";"Rachenspülflüssigkeit Serum"
"TONS";"Tonsillenabstrich";"Tonsillenabstrich"
"UMGEB";"Umgebungsprobe";"Umgebungsprobe"
"URINE";"Harn";"Harn | Urin"
"WUND";"Wundsekret";"Wundabstrich | Wundsekret"