'code';'codeSystem';'displayName';'parentCode';'concept_Beschreibung';'meaning';'hints';'level';'type';'relationships'
'normal';'2.16.840.1.113883.5.14';'normal';;'Umfasst die erwarteten Zustände des Acts, jedoch nicht "nullified" und "obsolete", die spezielle Endzustände für den Lebenszyklus darstellen';'Normal';;'0';'S';
'aborted';'2.16.840.1.113883.5.14';'aborted';;'Vor Abschluss abgebrochen, wird nicht mehr aufgenommen.';'Abgebrochen';;'1';'L';
'active';'2.16.840.1.113883.5.14';'active';;'Bereits begonnen oder kann begonnen werden.';'Aktiv';;'1';'L';
'cancelled';'2.16.840.1.113883.5.14';'cancelled';;'Vor Beginn/Aktivierung storniert.';'Storniert';;'1';'L';
'completed';'2.16.840.1.113883.5.14';'completed';;'Normal fertiggestellt.';'Abgeschlossen';;'1';'L';
'held';'2.16.840.1.113883.5.14';'held';;'Angehalten, Act muss vor Beginn/Aktivierung freigegeben werden.';'Angehalten';;'1';'L';
'new';'2.16.840.1.113883.5.14';'new';;'Neu, Act hat noch nicht begonnen.';'Neu ';;'1';'L';
'suspended';'2.16.840.1.113883.5.14';'suspended';;'Nach Beginn/Aktivierung unterbrochen  - Act kann fortgesetzt werden.';'Ausgesetzt';;'1';'L';
'nullified';'2.16.840.1.113883.5.14';'nullified';;'Act wurde irrtümlich angelegt. Act bleibt für Audit erhalten.';'Annulliert';;'0';'L';
'obsolete';'2.16.840.1.113883.5.14';'obsolete';;'Ersetzt durch einen anderen Act.';'Obsolet';;'0';'L';
