'code';'codeSystem';'displayName';'parentCode';'concept_Beschreibung';'meaning';'hints';'level';'type';'relationships'
'_GeneralAddressUse';'2.16.840.1.113883.5.1119';'_GeneralAddressUse';'';'';'';'';'0';'S';''
'BAD';'2.16.840.1.113883.5.1119';'bad address';'';'';'';'';'1';'L';''
'CONF';'2.16.840.1.113883.5.1119';'confidential address';'';'';'';'';'1';'L';''
'H';'2.16.840.1.113883.5.1119';'home address';'';'';'';'';'1';'S';''
'HP';'2.16.840.1.113883.5.1119';'primary home';'';'';'';'';'2';'L';''
'HV';'2.16.840.1.113883.5.1119';'vacation home';'';'';'';'';'2';'L';''
'TMP';'2.16.840.1.113883.5.1119';'temporary address';'';'';'';'';'1';'L';''
'WP';'2.16.840.1.113883.5.1119';'work place';'';'';'';'';'1';'S';''
'DIR';'2.16.840.1.113883.5.1119';'direct';'';'';'';'';'2';'L';''
'PUB';'2.16.840.1.113883.5.1119';'public';'';'';'';'';'2';'L';''
'_PostalAddressUse';'2.16.840.1.113883.5.1119';'_PostalAddressUse';'';'';'';'';'0';'S';''
'PHYS';'2.16.840.1.113883.5.1119';'physical visit address';'';'';'';'';'1';'L';''
'PST';'2.16.840.1.113883.5.1119';'postal address';'';'';'';'';'1';'L';''
'_TelecommunicationAddressUse';'2.16.840.1.113883.5.1119';'_TelecommunicationAddressUse';'';'';'';'';'0';'S';''
'AS';'2.16.840.1.113883.5.1119';'answering service';'';'';'';'';'1';'L';''
'EC';'2.16.840.1.113883.5.1119';'emergency contact';'';'';'';'';'1';'L';''
'MC';'2.16.840.1.113883.5.1119';'mobile contact)';'';'';'';'';'1';'L';''
'PG';'2.16.840.1.113883.5.1119';'pager';'';'';'';'';'1';'L';''
