'code';'codeSystem';'displayName';'parentCode';'concept_Beschreibung';'meaning';'hints';'level';'type';'relationships'
'39';'1.2.40.0.34.3.1.10.40';'Sexualmedizin';'';'';'Sexualmedizin';'';'0';'L';''
'44';'1.2.40.0.34.3.1.10.40';'Sportmedizin';'';'';'Sportmedizin';'';'0';'L';''
'45';'1.2.40.0.34.3.1.10.40';'Umweltmedizin';'';'';'Umweltmedizin';'';'0';'L';''
'46';'1.2.40.0.34.3.1.10.40';'Kur-, Präventivmedizin und Wellness';'';'';'Kur-, Präventivmedizin und Wellness';'';'0';'L';''
'49';'1.2.40.0.34.3.1.10.40';'Psychosoziale Medizin';'';'';'Psychosoziale Medizin';'';'0';'L';''
'50';'1.2.40.0.34.3.1.10.40';'Psychosomatische Medizin';'';'';'Psychosomatische Medizin';'';'0';'L';''
'51';'1.2.40.0.34.3.1.10.40';'Psychotherapeutische Medizin';'';'';'Psychotherapeutische Medizin';'';'0';'L';''
'52';'1.2.40.0.34.3.1.10.40';'Geriatrie';'';'';'Geriatrie';'';'0';'L';''
'53';'1.2.40.0.34.3.1.10.40';'Akupunktur';'';'';'Akupunktur';'';'0';'L';''
'56';'1.2.40.0.34.3.1.10.40';'Arbeitsmedizin';'';'';'Arbeitsmedizin';'';'0';'L';''
'61';'1.2.40.0.34.3.1.10.40';'Manuelle Medizin';'';'';'Manuelle Medizin';'';'0';'L';''
'62';'1.2.40.0.34.3.1.10.40';'Homöopathie';'';'';'Homöopathie';'';'0';'L';''
'63';'1.2.40.0.34.3.1.10.40';'Neuraltherapie';'';'';'Neuraltherapie';'';'0';'L';''
'64';'1.2.40.0.34.3.1.10.40';'Ernährungsmedizin';'';'';'Ernährungsmedizin';'';'0';'L';''
'65';'1.2.40.0.34.3.1.10.40';'Krankenhaushygiene';'';'';'Krankenhaushygiene';'';'0';'L';''
'66';'1.2.40.0.34.3.1.10.40';'Klinischer Prüfarzt';'';'';'Klinischer Prüfarzt';'';'0';'L';''
'67';'1.2.40.0.34.3.1.10.40';'Diagnostik und Therapie nach Dr. F.X. Mayr';'';'';'Diagnostik und Therapie nach Dr. F.X. Mayr';'';'0';'L';''
'68';'1.2.40.0.34.3.1.10.40';'Schularzt';'';'';'Schularzt';'';'0';'L';''
'69';'1.2.40.0.34.3.1.10.40';'Anthroposophische Medizin';'';'';'Anthroposophische Medizin';'';'0';'L';''
'72';'1.2.40.0.34.3.1.10.40';'Genetik';'';'';'Genetik';'';'0';'L';''
'73';'1.2.40.0.34.3.1.10.40';'Applied Kinesiology';'';'';'Applied Kinesiology';'';'0';'L';''
'74';'1.2.40.0.34.3.1.10.40';'Chinesische Diagnostik und Arzneitherapie';'';'';'Chinesische Diagnostik und Arzneitherapie';'';'0';'L';''
'75';'1.2.40.0.34.3.1.10.40';'Kneippmedizin';'';'';'Kneippmedizin';'';'0';'L';''
'84';'1.2.40.0.34.3.1.10.40';'Forensisch-psychiatrische Gutachten';'';'';'Forensisch-psychiatrische Gutachten';'';'0';'L';''
'85';'1.2.40.0.34.3.1.10.40';'Spezielle Schmerztherapie';'';'';'Spezielle Schmerztherapie';'';'0';'L';''
'86';'1.2.40.0.34.3.1.10.40';'Begleitende Krebsbehandlungen';'';'';'Begleitende Krebsbehandlungen';'';'0';'L';''
'87';'1.2.40.0.34.3.1.10.40';'Palliativmedizin';'';'';'Palliativmedizin';'';'0';'L';''
'91';'1.2.40.0.34.3.1.10.40';'Orthomolekulare Medizin';'';'';'Orthomolekulare Medizin';'';'0';'L';''
'92';'1.2.40.0.34.3.1.10.40';'Phytotherapie';'';'';'Phytotherapie';'';'0';'L';''
'93';'1.2.40.0.34.3.1.10.40';'Substitutionsbehandlung';'';'';'Substitutionsbehandlung';'';'0';'L';''
