'code';'codeSystem';'displayName';'parentCodeSystemName';'concept_Beschreibung';'meaning';'hints';'orderNumber';'level';'type';'relationships';'einheit print';'einheit codiert'
'10160-0';'2.16.840.1.113883.6.1';'History of Medication use Narrative';'http://loinc.org';;'Letzte Medikation';;'1';'0';'L';;;
'10164-2';'2.16.840.1.113883.6.1';'History of Present illness Narrative';'http://loinc.org';;'Anamnese';;'2';'0';'L';;;
'10183-2';'2.16.840.1.113883.6.1';'Hospital discharge medications Narrative';'http://loinc.org';;'Empfohlene Medikation';;'3';'0';'L';;;
'11348-0';'2.16.840.1.113883.6.1';'History of Past illness Narrative';'http://loinc.org';;'Frühere Erkrankungen';;'4';'0';'L';;;
'11493-4';'2.16.840.1.113883.6.1';'Hospital discharge studies summary Narrative';'http://loinc.org';;'Erhobene Befunde';;'5';'0';'L';;;
'11535-2';'2.16.840.1.113883.6.1';'Hospital discharge Dx Narrative';'http://loinc.org';;'Entlassungsdiagnosen';;'6';'0';'L';;;
'18610-6';'2.16.840.1.113883.6.1';'Medication administered Set';'http://loinc.org';;'Verabreichte Medikation während des Aufenthalts';;'7';'0';'L';;;
'18776-5';'2.16.840.1.113883.6.1';'Plan of care note';'http://loinc.org';;'Weitere empfohlene Maßnahmen';;'8';'0';'L';;;
'29554-3';'2.16.840.1.113883.6.1';'Procedure Narrative';'http://loinc.org';;'Durchgeführte Maßnahmen';;'9';'0';'L';;;
'38212-7';'2.16.840.1.113883.6.1';'Pain assessment panel';'http://loinc.org';;'Schmerz';;'10';'0';'L';;;
'42346-7';'2.16.840.1.113883.6.1';'Medications on admission (narrative)';'http://loinc.org';;'Medikation bei Einweisung';;'11';'0';'L';;;
'42348-3';'2.16.840.1.113883.6.1';'Advance directives';'http://loinc.org';;'Patientenverfügungen und andere juridische Dokumente';;'12';'0';'L';;;
'42349-1';'2.16.840.1.113883.6.1';'Reason for referral (narrative)';'http://loinc.org';;'Aufnahmegrund';;'13';'0';'L';;;
'47420-5';'2.16.840.1.113883.6.1';'Functional status assessment note';'http://loinc.org';;'Entlassungszustand';;'14';'0';'L';;;
'48765-2';'2.16.840.1.113883.6.1';'Allergies and adverse reactions Document';'http://loinc.org';;'Allergien und Medikamentenunverträglichkeiten';;'15';'0';'L';;;
'51898-5';'2.16.840.1.113883.6.1';'Risk factors Document';'http://loinc.org';;'Risiken';;'16';'0';'L';;;
'56447-6';'2.16.840.1.113883.6.1';'Deprecated Plan of care note';'http://loinc.org';;'Empfohlene Anordnungen an die weitere Pflege';;'17';'0';'L';;;
'8648-8';'2.16.840.1.113883.6.1';'Hospital course Narrative';'http://loinc.org';;'Zusammenfassung des Aufenthalts';;'18';'0';'L';;;
'8650-4';'2.16.840.1.113883.6.1';'Hospital discharge disposition Narrative';'http://loinc.org';;'Entlassungsmanagement';;'19';'0';'L';;;
'8716-3';'2.16.840.1.113883.6.1';'Vital signs';'http://loinc.org';;'Vitalparameter';;'20';'0';'L';;;
'ABBEM';'1.2.40.0.34.5.40';'Abschließende Bemerkungen';'https://termgit.elga.gv.at/CodeSystem-elga-sections';;;'Titel der Sektion wird vom ELGA-Referenzstylesheet nicht dargestellt';'21';'0';'L';;;
'ANM';'1.2.40.0.34.5.40';'Anmerkungen';'https://termgit.elga.gv.at/CodeSystem-elga-sections';;;;'22';'0';'L';;;
'BEFAUS';'1.2.40.0.34.5.40';'Ausstehende Befunde';'https://termgit.elga.gv.at/CodeSystem-elga-sections';;;;'23';'0';'L';;;
'BEFBEI';'1.2.40.0.34.5.40';'Beigelegte erhobene Befunde';'https://termgit.elga.gv.at/CodeSystem-elga-sections';;;;'24';'0';'L';;;
'BEFERH';'1.2.40.0.34.5.40';'Auszüge aus erhobenen Befunden';'https://termgit.elga.gv.at/CodeSystem-elga-sections';;;;'25';'0';'L';;;
'BEIL';'1.2.40.0.34.5.40';'Beilagen';'https://termgit.elga.gv.at/CodeSystem-elga-sections';;;;'26';'0';'L';;;
'BRIEFT';'1.2.40.0.34.5.40';'Brieftext';'https://termgit.elga.gv.at/CodeSystem-elga-sections';;;'Titel der Sektion wird vom ELGA-Referenzstylesheet nicht dargestellt';'27';'0';'L';;;
'PFATM';'1.2.40.0.34.5.40';'Atmung';'https://termgit.elga.gv.at/CodeSystem-elga-sections';;;;'28';'0';'L';;;
'PFAUS';'1.2.40.0.34.5.40';'Ausscheidung';'https://termgit.elga.gv.at/CodeSystem-elga-sections';;;;'29';'0';'L';;;
'PFDIAG';'1.2.40.0.34.5.40';'Pflege- und Betreuungsdiagnosen';'https://termgit.elga.gv.at/CodeSystem-elga-sections';;;;'30';'0';'L';;;
'PFERN';'1.2.40.0.34.5.40';'Ernährung';'https://termgit.elga.gv.at/CodeSystem-elga-sections';;;;'31';'0';'L';;;
'PFHAUT';'1.2.40.0.34.5.40';'Hautzustand';'https://termgit.elga.gv.at/CodeSystem-elga-sections';;;;'32';'0';'L';;;
'PFKLEI';'1.2.40.0.34.5.40';'Körperpflege und Kleiden';'https://termgit.elga.gv.at/CodeSystem-elga-sections';;;;'33';'0';'L';;;
'PFKOMM';'1.2.40.0.34.5.40';'Kommunikation';'https://termgit.elga.gv.at/CodeSystem-elga-sections';;;;'34';'0';'L';;;
'PFMED';'1.2.40.0.34.5.40';'Medikamentenverabreichung';'https://termgit.elga.gv.at/CodeSystem-elga-sections';;;;'35';'0';'L';;;
'PFMOB';'1.2.40.0.34.5.40';'Mobilität';'https://termgit.elga.gv.at/CodeSystem-elga-sections';;;;'36';'0';'L';;;
'PFORIE';'1.2.40.0.34.5.40';'Orientierung und Bewusstseinslage';'https://termgit.elga.gv.at/CodeSystem-elga-sections';;;;'37';'0';'L';;;
'PFROLL';'1.2.40.0.34.5.40';'Rollenwahrnehmung und Sinnfindung';'https://termgit.elga.gv.at/CodeSystem-elga-sections';;;;'38';'0';'L';;;
'PFSCHL';'1.2.40.0.34.5.40';'Schlafen';'https://termgit.elga.gv.at/CodeSystem-elga-sections';;;;'39';'0';'L';;;
'PFSOZV';'1.2.40.0.34.5.40';'Soziales Verhalten';'https://termgit.elga.gv.at/CodeSystem-elga-sections';;;;'40';'0';'L';;;
'RES';'1.2.40.0.34.5.40';'Hilfsmittel und Ressourcen';'https://termgit.elga.gv.at/CodeSystem-elga-sections';;;;'41';'0';'L';;;
'TERMIN';'1.2.40.0.34.5.40';'Termine, Kontrollen, Wiederbestellung';'https://termgit.elga.gv.at/CodeSystem-elga-sections';;;;'42';'0';'L';;;
