'code';'codeSystem';'displayName';'parentCodeSystemName';'concept_Beschreibung';'meaning';'hints';'orderNumber';'level';'type';'relationships';'einheit print';'einheit codiert'
'182849000';'2.16.840.1.113883.6.96';'no drug therapy prescribed';'https://termgit.elga.gv.at/CodeSystem-snomed-ct-auszug';'To indicate the absense of any prescribed medications';'Keine empfohlene Medikation angegeben';'Wird angewandt, wenn keine empfohlene Medikation vorliegt';'1';'0';'L';;;
'408350003';'2.16.840.1.113883.6.96';'patient not on self-medications';'https://termgit.elga.gv.at/CodeSystem-snomed-ct-auszug';'To indicate no treatment';'Keine Medikation (bei Einweisung)';'Wird angewandt, wenn keine Medikation bei Einweisung vorliegt';'2';'0';'L';;;
