'code';'codeSystem';'displayName';'parentCodeSystemName';'concept_Beschreibung';'meaning';'hints';'orderNumber';'level';'type';'relationships';'einheit print';'einheit codiert'
'_SNOMEDSpecimen';'1.2.40.0.34.5.173';'SNOMED Specimen Type';'https://termgit.elga.gv.at/CodeSystem-elga-specimentype-ergaenzung';'';'';'';'1';'0';'A';'';'';''
'119297000';'2.16.840.1.113883.6.96';'Blood specimen';'https://termgit.elga.gv.at/CodeSystem-snomed-ct-auszug';'';'Blut';'';'2';'1';'S';'2.16.840.1.113883.5.129:BLD';'';''
'446131002';'2.16.840.1.113883.6.96';'Blood specimen obtained for blood culture';'https://termgit.elga.gv.at/CodeSystem-snomed-ct-auszug';'';'Blutkultur';'';'3';'2';'L';'2.16.840.1.113883.5.129:BLD';'';''
'445295009';'2.16.840.1.113883.6.96';'Blood specimen with edetic acid';'https://termgit.elga.gv.at/CodeSystem-snomed-ct-auszug';'';'EDTA-Blut';'';'4';'2';'L';'2.16.840.1.113883.5.129:BLD';'';''
'708049000';'2.16.840.1.113883.6.96';'Plasma specimen with ethylenediamine tetraacetic acid';'https://termgit.elga.gv.at/CodeSystem-snomed-ct-auszug';'';'EDTA-Plasma';'';'5';'2';'L';'2.16.840.1.113883.5.129:PLAS';'';''
'708048008';'2.16.840.1.113883.6.96';'Plasma specimen with citrate';'https://termgit.elga.gv.at/CodeSystem-snomed-ct-auszug';'';'Citrat-Plasma';'';'6';'2';'L';'2.16.840.1.113883.5.129:PLAS';'';''
'441510007';'2.16.840.1.113883.6.96';'Blood specimen with anticoagulant';'https://termgit.elga.gv.at/CodeSystem-snomed-ct-auszug';'';'Blut antikoaguliert';'';'7';'2';'L';'';'';''
'119361006';'2.16.840.1.113883.6.96';'Plasma specimen';'https://termgit.elga.gv.at/CodeSystem-snomed-ct-auszug';'';'Plasma';'';'8';'2';'L';'2.16.840.1.113883.5.129:PLAS';'';''
'122590004';'2.16.840.1.113883.6.96';'Serum specimen from patient';'https://termgit.elga.gv.at/CodeSystem-snomed-ct-auszug';'';'Serum';'';'9';'2';'L';'2.16.840.1.113883.5.129:SER';'';''
'122552005';'2.16.840.1.113883.6.96';'Arterial blood specimen';'https://termgit.elga.gv.at/CodeSystem-snomed-ct-auszug';'';'Arterielles Blut';'';'10';'2';'L';'2.16.840.1.113883.5.129:BLDA';'';''
'122554006';'2.16.840.1.113883.6.96';'Capillary blood specimen ';'https://termgit.elga.gv.at/CodeSystem-snomed-ct-auszug';'';'Kapillarblut';'';'11';'2';'L';'2.16.840.1.113883.5.129:BLDC';'';''
'122555007';'2.16.840.1.113883.6.96';'Venous blood specimen';'https://termgit.elga.gv.at/CodeSystem-snomed-ct-auszug';'';'venöses Blut';'';'12';'2';'L';'2.16.840.1.113883.5.129:BLDV';'';''
'122556008';'2.16.840.1.113883.6.96';'Cord blood specimen';'https://termgit.elga.gv.at/CodeSystem-snomed-ct-auszug';'';'Nabelschnurblut';'';'13';'2';'L';'2.16.840.1.113883.5.129:BLDCO';'';''
'788707000';'2.16.840.1.113883.6.96';'Plasma specimen or serum specimen or whole blood specimen';'https://termgit.elga.gv.at/CodeSystem-snomed-ct-auszug';'';'Plasma, Serum oder Vollblut';'';'14';'2';'L';'';'';''
'258580003';'2.16.840.1.113883.6.96';'Whole blood sample';'https://termgit.elga.gv.at/CodeSystem-snomed-ct-auszug';'';'Vollblut';'';'15';'2';'L';'';'';''
'258603007';'2.16.840.1.113883.6.96';'Respiratory sample';'https://termgit.elga.gv.at/CodeSystem-snomed-ct-auszug';'';'Atemwege';'';'16';'1';'S';'';'';''
'410580001';'2.16.840.1.113883.6.96';'Respiratory fluid specimen';'https://termgit.elga.gv.at/CodeSystem-snomed-ct-auszug';'';'Atemwegsmaterial';'';'17';'2';'L';'';'';''
'309164002';'2.16.840.1.113883.6.96';'Upper respiratory swab sample';'https://termgit.elga.gv.at/CodeSystem-snomed-ct-auszug';'';'Abstrich obere Atemwege';'';'18';'2';'L';'';'';''
'258606004';'2.16.840.1.113883.6.96';'Lower respiratory sample';'https://termgit.elga.gv.at/CodeSystem-snomed-ct-auszug';'';'Abstrich untere Atemwege';'';'19';'2';'L';'';'';''
'258607008';'2.16.840.1.113883.6.96';'Bronchoalveolar lavage fluid sample';'https://termgit.elga.gv.at/CodeSystem-snomed-ct-auszug';'';'Bronchoalveoläre Lavage (BAL)';'';'20';'2';'L';'';'';''
'258446004';'2.16.840.1.113883.6.96';'Bronchial fluid sample';'https://termgit.elga.gv.at/CodeSystem-snomed-ct-auszug';'';'Endobronchialsekret';'';'21';'2';'L';'2.16.840.1.113883.5.129:BRO';'';''
'122610009';'2.16.840.1.113883.6.96';'Specimen from lung obtained by biopsy';'https://termgit.elga.gv.at/CodeSystem-snomed-ct-auszug';'';'Lungenbiopsie';'';'22';'2';'L';'2.16.840.1.113883.5.129:TLNG';'';''
'445297001';'2.16.840.1.113883.6.96';'Swab of internal nose';'https://termgit.elga.gv.at/CodeSystem-snomed-ct-auszug';'';'Nasenabstrich';'';'23';'2';'L';'';'';''
'168141000';'2.16.840.1.113883.6.96';'Nasal fluid sample';'https://termgit.elga.gv.at/CodeSystem-snomed-ct-auszug';'';'Nasensekret';'';'24';'2';'L';'2.16.840.1.113883.5.129:NOS';'';''
'258500001';'2.16.840.1.113883.6.96';'Nasopharyngeal swab';'https://termgit.elga.gv.at/CodeSystem-snomed-ct-auszug';'';'Nasopharynxabstrich';'';'25';'2';'L';'2.16.840.1.113883.5.129:NOS';'';''
'258411007';'2.16.840.1.113883.6.96';'Nasopharyngeal aspirate';'https://termgit.elga.gv.at/CodeSystem-snomed-ct-auszug';'';'Nasopharynxsekret';'';'26';'2';'L';'';'';''
'258529004';'2.16.840.1.113883.6.96';'Throat swab';'https://termgit.elga.gv.at/CodeSystem-snomed-ct-auszug';'';'Rachenabstrich';'';'27';'2';'L';'2.16.840.1.113883.5.129:THRT';'';''
'258469001';'2.16.840.1.113883.6.96';'Pharyngeal washings';'https://termgit.elga.gv.at/CodeSystem-snomed-ct-auszug';'';'Rachenspülflüssigkeit';'';'28';'2';'L';'';'';''
'119334006';'2.16.840.1.113883.6.96';'Sputum specimen';'https://termgit.elga.gv.at/CodeSystem-snomed-ct-auszug';'';'Sputum';'';'29';'2';'L';'2.16.840.1.113883.5.129:SPT';'';''
'697989009';'2.16.840.1.113883.6.96';'Anterior nares swab';'https://termgit.elga.gv.at/CodeSystem-snomed-ct-auszug';'';'Abstrich Nase rostral';'';'30';'2';'L';'';'';''
'472867001';'2.16.840.1.113883.6.96';'Swab from tonsil';'https://termgit.elga.gv.at/CodeSystem-snomed-ct-auszug';'';'Tonsillenabstrich';'';'31';'2';'L';'';'';''
'445447003';'2.16.840.1.113883.6.96';'Specimen from trachea obtained by aspiration';'https://termgit.elga.gv.at/CodeSystem-snomed-ct-auszug';'';'Trachealsekret';'';'32';'2';'L';'';'';''
'16223051000119101';'2.16.840.1.113883.6.96';'Nasal sinus contents sample';'https://termgit.elga.gv.at/CodeSystem-snomed-ct-auszug';'';'Material aus Nasennebenhöhle';'';'33';'2';'L';'';'';''
'433324003';'2.16.840.1.113883.6.96';'Specimen from eye region';'https://termgit.elga.gv.at/CodeSystem-snomed-ct-auszug';'';'Auge';'';'34';'1';'S';'';'';''
'445160003';'2.16.840.1.113883.6.96';'Swab of eye';'https://termgit.elga.gv.at/CodeSystem-snomed-ct-auszug';'';'Augenabstrich';'';'35';'2';'L';'2.16.840.1.113883.5.129:EYE';'';''
'472894002';'2.16.840.1.113883.6.96';'Swab from cornea';'https://termgit.elga.gv.at/CodeSystem-snomed-ct-auszug';'';'Corneaabstrich';'';'36';'2';'L';'2.16.840.1.113883.5.129:CRN';'';''
'258438000';'2.16.840.1.113883.6.96';'Vitreous humor sample';'https://termgit.elga.gv.at/CodeSystem-snomed-ct-auszug';'';'Glaskörperpunktat';'';'37';'2';'L';'2.16.840.1.113883.5.129:EYE';'';''
'258498002';'2.16.840.1.113883.6.96';'Conjunctival swab';'https://termgit.elga.gv.at/CodeSystem-snomed-ct-auszug';'';'Konjunktivaabstrich';'';'38';'2';'L';'2.16.840.1.113883.5.129:CNJT';'';''
'440473005';'2.16.840.1.113883.6.96';'Contact lens submitted as specimen';'https://termgit.elga.gv.at/CodeSystem-snomed-ct-auszug';'';'Kontaktlinse';'';'39';'2';'L';'';'';''
'472927003';'2.16.840.1.113883.6.96';'Contact lens case submitted as specimen';'https://termgit.elga.gv.at/CodeSystem-snomed-ct-auszug';'';'Kontaktlinsenbehälter';'';'40';'2';'L';'';'';''
'16212771000119105';'2.16.840.1.113883.6.96';'Specimen from eyelid obtained by biopsy';'https://termgit.elga.gv.at/CodeSystem-snomed-ct-auszug';'';'Auge-Lid';'';'41';'2';'L';'';'';''
'309165001';'2.16.840.1.113883.6.96';'Ear sample';'https://termgit.elga.gv.at/CodeSystem-snomed-ct-auszug';'';'Ohr';'';'42';'1';'S';'';'';''
'258466008';'2.16.840.1.113883.6.96';'Middle ear fluid sample';'https://termgit.elga.gv.at/CodeSystem-snomed-ct-auszug';'';'Mittelohrsekret';'';'43';'2';'L';'';'';''
'472901003';'2.16.840.1.113883.6.96';'Swab from nasal sinus';'https://termgit.elga.gv.at/CodeSystem-snomed-ct-auszug';'';'Nasennebenhöhlenabstrich';'';'44';'2';'L';'';'';''
'309166000';'2.16.840.1.113883.6.96';'Ear swab sample';'https://termgit.elga.gv.at/CodeSystem-snomed-ct-auszug';'';'Ohrabstrich';'';'45';'2';'L';'2.16.840.1.113883.5.129:EAR';'';''
'122580007';'2.16.840.1.113883.6.96';'Cerumen specimen';'https://termgit.elga.gv.at/CodeSystem-snomed-ct-auszug';'';'Ohrenschmalz (Cerumen)';'';'46';'2';'L';'2.16.840.1.113883.5.129:EARW';'';''
'258412000';'2.16.840.1.113883.6.96';'Oropharyngeal aspirate';'https://termgit.elga.gv.at/CodeSystem-snomed-ct-auszug';'';'Oropharyngeal-Aspirat';'';'47';'2';'L';'';'';''
'127465007';'2.16.840.1.113883.6.96';'Specimen from gastrointestinal tract';'https://termgit.elga.gv.at/CodeSystem-snomed-ct-auszug';'';'Gastrointestinaltrakt';'';'48';'1';'S';'';'';''
'258662004';'2.16.840.1.113883.6.96';'Adhesive slide';'https://termgit.elga.gv.at/CodeSystem-snomed-ct-auszug';'';'Analabklatsch';'';'49';'2';'L';'';'';''
'258527002';'2.16.840.1.113883.6.96';'Anal swab';'https://termgit.elga.gv.at/CodeSystem-snomed-ct-auszug';'';'Analabstrich';'';'50';'2';'L';'';'';''
'309225009';'2.16.840.1.113883.6.96';'Colonic biopsy sample';'https://termgit.elga.gv.at/CodeSystem-snomed-ct-auszug';'';'Colonbiopsie';'';'51';'2';'L';'2.16.840.1.113883.5.129:TLGI';'';''
'122574004';'2.16.840.1.113883.6.96';'Duodenal fluid specimen';'https://termgit.elga.gv.at/CodeSystem-snomed-ct-auszug';'';'Duodenalsekret';'';'52';'2';'L';'2.16.840.1.113883.5.129:DUFL';'';''
'449446003';'2.16.840.1.113883.6.96';'Specimen from gallbladder';'https://termgit.elga.gv.at/CodeSystem-snomed-ct-auszug';'';'Gallenblase';'';'53';'2';'L';'2.16.840.1.113883.5.129:TISG';'';''
'119341000';'2.16.840.1.113883.6.96';'Bile specimen';'https://termgit.elga.gv.at/CodeSystem-snomed-ct-auszug';'';'Gallensekret';'';'54';'2';'L';'2.16.840.1.113883.5.129:BIFL';'';''
'309211008';'2.16.840.1.113883.6.96';'Gastric biopsy sample';'https://termgit.elga.gv.at/CodeSystem-snomed-ct-auszug';'';'Magenbiopsie';'';'55';'2';'L';'';'';''
'258459007';'2.16.840.1.113883.6.96';'Gastric fluid sample';'https://termgit.elga.gv.at/CodeSystem-snomed-ct-auszug';'';'Magensaft';'';'56';'2';'L';'2.16.840.1.113883.5.129:GAST';'';''
'418932006';'2.16.840.1.113883.6.96';'Oral swab';'https://termgit.elga.gv.at/CodeSystem-snomed-ct-auszug';'';'Mundschleimhautabstrich';'';'57';'2';'L';'';'';''
'309210009';'2.16.840.1.113883.6.96';'Esophageal brushings sample';'https://termgit.elga.gv.at/CodeSystem-snomed-ct-auszug';'';'Ösophagus Bürstenabstrich';'';'58';'2';'L';'';'';''
'472886009';'2.16.840.1.113883.6.96';'Swab from gastrostomy stoma';'https://termgit.elga.gv.at/CodeSystem-snomed-ct-auszug';'';'PEG-Sondenabstrich';'';'59';'2';'L';'';'';''
'258525005';'2.16.840.1.113883.6.96';'Perineal swab';'https://termgit.elga.gv.at/CodeSystem-snomed-ct-auszug';'';'Perineumabstrich';'';'60';'2';'L';'';'';''
'168140004';'2.16.840.1.113883.6.96';'Peritoneal dialysate sample';'https://termgit.elga.gv.at/CodeSystem-snomed-ct-auszug';'';'Peritonealdialysat';'';'61';'2';'L';'2.16.840.1.113883.5.129:DIAF';'';''
'168139001';'2.16.840.1.113883.6.96';'Peritoneal fluid sample';'https://termgit.elga.gv.at/CodeSystem-snomed-ct-auszug';'';'Peritonealsekret';'';'62';'2';'L';'2.16.840.1.113883.5.129:PRT';'';''
'258528007';'2.16.840.1.113883.6.96';'Rectal swab';'https://termgit.elga.gv.at/CodeSystem-snomed-ct-auszug';'';'Rektalabstrich';'';'63';'2';'L';'';'';''
'119339001';'2.16.840.1.113883.6.96';'Stool specimen';'https://termgit.elga.gv.at/CodeSystem-snomed-ct-auszug';'';'Stuhl';'';'64';'2';'L';'2.16.840.1.113883.5.129:STL';'';''
'472866005';'2.16.840.1.113883.6.96';'Swab from tongue';'https://termgit.elga.gv.at/CodeSystem-snomed-ct-auszug';'';'Zungenabstrich';'';'65';'2';'L';'';'';''
'258570002';'2.16.840.1.113883.6.96';'Genitourinary sample';'https://termgit.elga.gv.at/CodeSystem-snomed-ct-auszug';'';'Urogenitaltrakt';'';'66';'1';'S';'';'';''
'258524009';'2.16.840.1.113883.6.96';'Cervical swab';'https://termgit.elga.gv.at/CodeSystem-snomed-ct-auszug';'';'Cervixabstrich';'';'67';'2';'L';'2.16.840.1.113883.5.129:GENC';'';''
'708112008';'2.16.840.1.113883.6.96';'Retrouterine pouch fluid aspirate';'https://termgit.elga.gv.at/CodeSystem-snomed-ct-auszug';'';'Douglassekret';'';'68';'2';'L';'';'';''
'258508008';'2.16.840.1.113883.6.96';'Genital swab';'https://termgit.elga.gv.at/CodeSystem-snomed-ct-auszug';'';'Genitalabstrich';'';'69';'2';'L';'2.16.840.1.113883.5.129:GEN';'';''
'258512002';'2.16.840.1.113883.6.96';'Glans penis swab';'https://termgit.elga.gv.at/CodeSystem-snomed-ct-auszug';'';'Glansabstrich';'';'70';'2';'L';'2.16.840.1.113883.5.129:GEN';'';''
'119347001';'2.16.840.1.113883.6.96';'Seminal fluid specimen';'https://termgit.elga.gv.at/CodeSystem-snomed-ct-auszug';'';'Sperma';'';'71';'2';'L';'2.16.840.1.113883.5.129:SMN';'';''
'258511009';'2.16.840.1.113883.6.96';'Penile urethral swab';'https://termgit.elga.gv.at/CodeSystem-snomed-ct-auszug';'';'Urethralabstrich';'';'72';'2';'L';'2.16.840.1.113883.5.129:URTH';'';''
'258520000';'2.16.840.1.113883.6.96';'Vaginal swab';'https://termgit.elga.gv.at/CodeSystem-snomed-ct-auszug';'';'Vaginalabstrich';'';'73';'2';'L';'2.16.840.1.113883.5.129:GENV';'';''
'258523003';'2.16.840.1.113883.6.96';'Vulval swab';'https://termgit.elga.gv.at/CodeSystem-snomed-ct-auszug';'';'Vulvaabstrich';'';'74';'2';'L';'2.16.840.1.113883.5.129:GEN';'';''
'446130001';'2.16.840.1.113883.6.96';'Urine specimen from bladder';'https://termgit.elga.gv.at/CodeSystem-snomed-ct-auszug';'';'Blasenpunktat';'';'75';'2';'L';'';'';''
'446846006';'2.16.840.1.113883.6.96';'Urine specimen obtained via indwelling urinary catheter';'https://termgit.elga.gv.at/CodeSystem-snomed-ct-auszug';'';'Dauerkatheterharn';'';'76';'2';'L';'2.16.840.1.113883.5.129:URT';'';''
'16221251000119108';'2.16.840.1.113883.6.96';'Urine specimen obtained via straight catheter';'https://termgit.elga.gv.at/CodeSystem-snomed-ct-auszug';'';'Einmalkatheterharn';'';'77';'2';'L';'2.16.840.1.113883.5.129:URT';'';''
'698276005';'2.16.840.1.113883.6.96';'First stream urine sample';'https://termgit.elga.gv.at/CodeSystem-snomed-ct-auszug';'';'Erststrahlharn';'';'78';'2';'L';'2.16.840.1.113883.5.129:UR';'';''
'122575003';'2.16.840.1.113883.6.96';'Urine specimen';'https://termgit.elga.gv.at/CodeSystem-snomed-ct-auszug';'';'Harn';'';'79';'2';'L';'2.16.840.1.113883.5.129:UR';'';''
'122565001';'2.16.840.1.113883.6.96';'Urinary catheter specimen';'https://termgit.elga.gv.at/CodeSystem-snomed-ct-auszug';'';'Katheterharn';'';'80';'2';'L';'2.16.840.1.113883.5.129:URT';'';''
'258574006';'2.16.840.1.113883.6.96';'Mid-stream urine sample';'https://termgit.elga.gv.at/CodeSystem-snomed-ct-auszug';'';'Mittelstrahlharn';'';'81';'2';'L';'2.16.840.1.113883.5.129:URC';'';''
'442173007';'2.16.840.1.113883.6.96';'Urine specimen from nephrostomy tube';'https://termgit.elga.gv.at/CodeSystem-snomed-ct-auszug';'';'Nephrostomieharn';'';'82';'2';'L';'2.16.840.1.113883.5.129:UR';'';''
'444937002';'2.16.840.1.113883.6.96';'Urine specimen from ureter';'https://termgit.elga.gv.at/CodeSystem-snomed-ct-auszug';'';'Ureterkatheterharn';'';'83';'2';'L';'2.16.840.1.113883.5.129:URT';'';''
'702701006';'2.16.840.1.113883.6.96';'Specimen from cervix or vagina';'https://termgit.elga.gv.at/CodeSystem-snomed-ct-auszug';'';'Zervix+Vagina Abstrich';'';'84';'2';'L';'';'';''
'127476006';'2.16.840.1.113883.6.96';'Specimen from fallopian tube';'https://termgit.elga.gv.at/CodeSystem-snomed-ct-auszug';'';'Eileiter';'';'85';'2';'L';'2.16.840.1.113883.5.129:TUB';'';''
'258548000';'2.16.840.1.113883.6.96';'Dermatological sample';'https://termgit.elga.gv.at/CodeSystem-snomed-ct-auszug';'';'Haut & Wunden';'';'86';'1';'S';'';'';''
'445364004';'2.16.840.1.113883.6.96';'Swab of axilla';'https://termgit.elga.gv.at/CodeSystem-snomed-ct-auszug';'';'Axillaabstrich';'';'87';'2';'L';'';'';''
'472896000';'2.16.840.1.113883.6.96';'Swab from blister';'https://termgit.elga.gv.at/CodeSystem-snomed-ct-auszug';'';'Bläscheninhalt';'';'88';'2';'L';'';'';''
'119326000';'2.16.840.1.113883.6.96';'Hair specimen';'https://termgit.elga.gv.at/CodeSystem-snomed-ct-auszug';'';'Haar(e)';'';'89';'2';'L';'2.16.840.1.113883.5.129:HAR';'';''
'258503004';'2.16.840.1.113883.6.96';'Skin swab';'https://termgit.elga.gv.at/CodeSystem-snomed-ct-auszug';'';'Hautabstrich';'';'90';'2';'L';'2.16.840.1.113883.5.129:SKN';'';''
'258549008';'2.16.840.1.113883.6.96';'Skin scale sample';'https://termgit.elga.gv.at/CodeSystem-snomed-ct-auszug';'';'Hautschuppen';'';'91';'2';'L';'2.16.840.1.113883.5.129:SKN';'';''
'445444005';'2.16.840.1.113883.6.96';'Swab of groin';'https://termgit.elga.gv.at/CodeSystem-snomed-ct-auszug';'';'Leistenabstrich';'';'92';'2';'L';'';'';''
'445367006';'2.16.840.1.113883.6.96';'Swab of umbilicus';'https://termgit.elga.gv.at/CodeSystem-snomed-ct-auszug';'';'Nabelabstrich';'';'93';'2';'L';'';'';''
'119327009';'2.16.840.1.113883.6.96';'Nail specimen';'https://termgit.elga.gv.at/CodeSystem-snomed-ct-auszug';'';'Nagel';'';'94';'2';'L';'2.16.840.1.113883.5.129:NAIL';'';''
'447098004';'2.16.840.1.113883.6.96';'Specimen from nail obtained by scraping';'https://termgit.elga.gv.at/CodeSystem-snomed-ct-auszug';'';'Nagelgeschabsel';'';'95';'2';'L';'2.16.840.1.113883.5.129:NAIL';'';''
'119365002';'2.16.840.1.113883.6.96';'Specimen from wound';'https://termgit.elga.gv.at/CodeSystem-snomed-ct-auszug';'';'Wundmaterial';'';'96';'2';'L';'2.16.840.1.113883.5.129:WND';'';''
'472882006';'2.16.840.1.113883.6.96';'Swab from superficial wound';'https://termgit.elga.gv.at/CodeSystem-snomed-ct-auszug';'';'Wundabstrich oberflächlich';'';'97';'2';'L';'2.16.840.1.113883.5.129:WND';'';''
'472884007';'2.16.840.1.113883.6.96';'Swab from deep wound';'https://termgit.elga.gv.at/CodeSystem-snomed-ct-auszug';'';'Wundabstrich tief';'';'98';'2';'L';'2.16.840.1.113883.5.129:WND';'';''
'122568004';'2.16.840.1.113883.6.96';'Fluid specimen from wound';'https://termgit.elga.gv.at/CodeSystem-snomed-ct-auszug';'';'Wundsekret';'';'99';'2';'L';'2.16.840.1.113883.5.129:WNDE';'';''
'258539005';'2.16.840.1.113883.6.96';'Bone and joint sample';'https://termgit.elga.gv.at/CodeSystem-snomed-ct-auszug';'';'Knochen & Gelenke';'';'100';'1';'S';'';'';''
'258448003';'2.16.840.1.113883.6.96';'Bursa fluid sample';'https://termgit.elga.gv.at/CodeSystem-snomed-ct-auszug';'';'Bursapunktat';'';'101';'2';'L';'2.16.840.1.113883.5.129:SNV';'';''
'309124001';'2.16.840.1.113883.6.96';'Joint biopsy sample';'https://termgit.elga.gv.at/CodeSystem-snomed-ct-auszug';'';'Gelenksbiopsie';'';'102';'2';'L';'2.16.840.1.113883.5.129:SNV';'';''
'431361003';'2.16.840.1.113883.6.96';'Joint fluid specimen';'https://termgit.elga.gv.at/CodeSystem-snomed-ct-auszug';'';'Gelenkspunktat';'';'103';'2';'L';'2.16.840.1.113883.5.129:SNV';'';''
'430268003';'2.16.840.1.113883.6.96';'Specimen from bone';'https://termgit.elga.gv.at/CodeSystem-snomed-ct-auszug';'';'Knochen';'';'104';'2';'L';'2.16.840.1.113883.5.129:BON';'';''
'119359002';'2.16.840.1.113883.6.96';'Bone marrow specimen';'https://termgit.elga.gv.at/CodeSystem-snomed-ct-auszug';'';'Knochenmark';'';'105';'2';'L';'2.16.840.1.113883.5.129:MAR';'';''
'258415003';'2.16.840.1.113883.6.96';'Biopsy sample';'https://termgit.elga.gv.at/CodeSystem-snomed-ct-auszug';'';'Punktate & Biopsate';'';'106';'1';'S';'';'';''
'258497007';'2.16.840.1.113883.6.96';'Abscess swab';'https://termgit.elga.gv.at/CodeSystem-snomed-ct-auszug';'';'Abszessabstrich';'';'107';'2';'L';'2.16.840.1.113883.5.129:ABS';'';''
'446972001';'2.16.840.1.113883.6.96';'Specimen from abscess obtained by aspiration';'https://termgit.elga.gv.at/CodeSystem-snomed-ct-auszug';'';'Abszesspunktat';'';'108';'2';'L';'2.16.840.1.113883.5.129:ABS';'';''
'309201001';'2.16.840.1.113883.6.96';'Ascitic fluid sample';'https://termgit.elga.gv.at/CodeSystem-snomed-ct-auszug';'';'Ascitespunktat';'';'109';'2';'L';'2.16.840.1.113883.5.129:PRT';'';''
'119295008';'2.16.840.1.113883.6.96';'Specimen obtained by aspiration';'https://termgit.elga.gv.at/CodeSystem-snomed-ct-auszug';'';'Punktat (Aspirat)';'';'110';'2';'L';'2.16.840.1.113883.5.129:ASP';'';''
'258455001';'2.16.840.1.113883.6.96';'Drainage fluid sample';'https://termgit.elga.gv.at/CodeSystem-snomed-ct-auszug';'';'Drainageflüssigkeit';'';'111';'2';'L';'2.16.840.1.113883.5.129:DRN';'';''
'119373006';'2.16.840.1.113883.6.96';'Amniotic fluid specimen';'https://termgit.elga.gv.at/CodeSystem-snomed-ct-auszug';'';'Fruchtwasser';'';'112';'2';'L';'2.16.840.1.113883.5.129:AMN';'';''
'258588005';'2.16.840.1.113883.6.96';'Hematoma sample';'https://termgit.elga.gv.at/CodeSystem-snomed-ct-auszug';'';'Hämatom';'';'113';'2';'L';'';'';''
'16211011000119108';'2.16.840.1.113883.6.96';'Specimen from deep surgical wound';'https://termgit.elga.gv.at/CodeSystem-snomed-ct-auszug';'';'Intraoperatives Material';'';'114';'2';'L';'';'';''
'258450006';'2.16.840.1.113883.6.96';'Cerebrospinal fluid sample';'https://termgit.elga.gv.at/CodeSystem-snomed-ct-auszug';'';'Liquor';'';'115';'2';'L';'2.16.840.1.113883.5.129:CSF';'';''
'309078004';'2.16.840.1.113883.6.96';'Lymph node tissue sample';'https://termgit.elga.gv.at/CodeSystem-snomed-ct-auszug';'';'Lymphknoten';'';'116';'2';'L';'';'';''
'122571007';'2.16.840.1.113883.6.96';'Pericardial fluid specimen';'https://termgit.elga.gv.at/CodeSystem-snomed-ct-auszug';'';'Pericardpunktat';'';'117';'2';'L';'';'';''
'418564007';'2.16.840.1.113883.6.96';'Pleural fluid specimen';'https://termgit.elga.gv.at/CodeSystem-snomed-ct-auszug';'';'Pleurapunktat';'';'118';'2';'L';'2.16.840.1.113883.5.129:PLR';'';''
'127454002';'2.16.840.1.113883.6.96';'Device specimen';'https://termgit.elga.gv.at/CodeSystem-snomed-ct-auszug';'';'Medizinprodukte';'';'119';'1';'S';'';'';''
'258647001';'2.16.840.1.113883.6.96';'Drain tip';'https://termgit.elga.gv.at/CodeSystem-snomed-ct-auszug';'';'Drainagespitze';'';'120';'2';'L';'2.16.840.1.113883.5.129:CNL';'';''
'258540007';'2.16.840.1.113883.6.96';'Prosthetic joint sample';'https://termgit.elga.gv.at/CodeSystem-snomed-ct-auszug';'';'Gelenksprothese';'';'121';'2';'L';'';'';''
'473415003';'2.16.840.1.113883.6.96';'Intrauterine contraceptive device submitted as specimen';'https://termgit.elga.gv.at/CodeSystem-snomed-ct-auszug';'';'Intrauterinpessar';'';'122';'2';'L';'';'';''
'472932002';'2.16.840.1.113883.6.96';'Vascular catheter submitted as specimen';'https://termgit.elga.gv.at/CodeSystem-snomed-ct-auszug';'';'Intravasaler Katheter';'';'123';'2';'L';'2.16.840.1.113883.5.129:CTP';'';''
'119312009';'2.16.840.1.113883.6.96';'Catheter tip specimen';'https://termgit.elga.gv.at/CodeSystem-snomed-ct-auszug';'';'Katheterspitze';'';'124';'2';'L';'2.16.840.1.113883.5.129:CTP';'';''
'472919007';'2.16.840.1.113883.6.96';'Device submitted as specimen';'https://termgit.elga.gv.at/CodeSystem-snomed-ct-auszug';'';'Medizinprodukt (als Probenmaterial)';'';'125';'2';'L';'';'';''
'472938003';'2.16.840.1.113883.6.96';'Tracheal tube submitted as specimen';'https://termgit.elga.gv.at/CodeSystem-snomed-ct-auszug';'';'Tubusspitze';'';'126';'2';'L';'2.16.840.1.113883.5.129:IT';'';''
'123038009';'2.16.840.1.113883.6.96';'Specimen';'https://termgit.elga.gv.at/CodeSystem-snomed-ct-auszug';'';'Nicht näher angegebenes Material';'';'127';'1';'S';'';'';''
'257261003';'2.16.840.1.113883.6.96';'Swab';'https://termgit.elga.gv.at/CodeSystem-snomed-ct-auszug';'';'Abstrich';'';'128';'2';'L';'';'';''
'258454002';'2.16.840.1.113883.6.96';'Dialysate sample';'https://termgit.elga.gv.at/CodeSystem-snomed-ct-auszug';'';'Dialysat';'';'129';'2';'L';'';'';''
'119303007';'2.16.840.1.113883.6.96';'Microbial isolate specimen';'https://termgit.elga.gv.at/CodeSystem-snomed-ct-auszug';'';'Isolat / Reinkultur';'';'130';'2';'L';'2.16.840.1.113883.5.129:ISLT';'';''
'119328004';'2.16.840.1.113883.6.96';'Mother´s milk specimen';'https://termgit.elga.gv.at/CodeSystem-snomed-ct-auszug';'';'Muttermilch';'';'131';'2';'L';'2.16.840.1.113883.5.129:MILK';'';''
'258441009';'2.16.840.1.113883.6.96';'Exudate sample';'https://termgit.elga.gv.at/CodeSystem-snomed-ct-auszug';'';'Sekret';'';'132';'2';'L';'';'';''
'119323008';'2.16.840.1.113883.6.96';'Pus specimen';'https://termgit.elga.gv.at/CodeSystem-snomed-ct-auszug';'';'Eiter';'';'133';'2';'L';'2.16.840.1.113883.5.129:PUS';'';''
'258442002';'2.16.840.1.113883.6.96';'Fluid sample';'https://termgit.elga.gv.at/CodeSystem-snomed-ct-auszug';'';'Flüssigkeit';'';'134';'2';'L';'';'';''
'708317005';'2.16.840.1.113883.6.96';'Pooled specimen from vaginal introitus and rectal swab';'https://termgit.elga.gv.at/CodeSystem-snomed-ct-auszug';'';'Vagina-Rektalabstrich';'';'135';'2';'L';'';'';''
'309051001';'2.16.840.1.113883.6.96';'Body fluid sample';'https://termgit.elga.gv.at/CodeSystem-snomed-ct-auszug';'';'Körperflüssigkeit';'';'136';'2';'L';'2.16.840.1.113883.5.129:FLU';'';''
'119376003';'2.16.840.1.113883.6.96';'Tissue specimen';'https://termgit.elga.gv.at/CodeSystem-snomed-ct-auszug';'';'Gewebe';'';'137';'2';'L';'2.16.840.1.113883.5.129:TISS';'';''
'119324002';'2.16.840.1.113883.6.96';'Specimen of unknown material ';'https://termgit.elga.gv.at/CodeSystem-snomed-ct-auszug';'';'Unbekannte Substanz';'';'138';'2';'L';'2.16.840.1.113883.5.129:USUB';'';''
'408836004';'2.16.840.1.113883.6.96';'Sample not obtained';'https://termgit.elga.gv.at/CodeSystem-snomed-ct-auszug';'';'Kein Material eingelangt';'';'139';'1';'L';'';'';''
'_HL7Specimen';'1.2.40.0.34.5.173';'HL7 Specimen Type';'https://termgit.elga.gv.at/CodeSystem-elga-specimentype-ergaenzung';'';'';'';'140';'0';'A';'';'';''
'ABS';'2.16.840.1.113883.5.129';'Abcess';'https://termgit.elga.gv.at/CodeSystem-hl7-specimen-type';'';'Abszess';'';'141';'1';'L';'';'';''
'AMN';'2.16.840.1.113883.5.129';'Amniotic fluid';'https://termgit.elga.gv.at/CodeSystem-hl7-specimen-type';'';'Fruchtwasser';'';'142';'1';'L';'';'';''
'ASP';'2.16.840.1.113883.5.129';'Aspirate';'https://termgit.elga.gv.at/CodeSystem-hl7-specimen-type';'';'Aspirat';'';'143';'1';'L';'';'';''
'BBL';'2.16.840.1.113883.5.129';'Blood bag';'https://termgit.elga.gv.at/CodeSystem-hl7-specimen-type';'';'Blutbeutel';'';'144';'1';'L';'';'';''
'BDY';'2.16.840.1.113883.5.129';'Whole body';'https://termgit.elga.gv.at/CodeSystem-hl7-specimen-type';'';'Vollständiger Körper';'';'145';'1';'L';'';'';''
'BIFL';'2.16.840.1.113883.5.129';'Bile fluid';'https://termgit.elga.gv.at/CodeSystem-hl7-specimen-type';'';'Gallenflüssigkeit';'';'146';'1';'L';'';'';''
'BLD';'2.16.840.1.113883.5.129';'Whole blood';'https://termgit.elga.gv.at/CodeSystem-hl7-specimen-type';'';'Vollblut';'';'147';'1';'L';'';'';''
'BLDA';'2.16.840.1.113883.5.129';'Blood arterial';'https://termgit.elga.gv.at/CodeSystem-hl7-specimen-type';'';'arterielles Blut';'';'148';'1';'L';'';'';''
'BLDC';'2.16.840.1.113883.5.129';'Blood capillary';'https://termgit.elga.gv.at/CodeSystem-hl7-specimen-type';'';'Kapillarblut';'';'149';'1';'L';'';'';''
'BLDCO';'2.16.840.1.113883.5.129';'Blood - cord';'https://termgit.elga.gv.at/CodeSystem-hl7-specimen-type';'';'Nabelschnurblut';'';'150';'1';'L';'';'';''
'BLDV';'2.16.840.1.113883.5.129';'Blood venous';'https://termgit.elga.gv.at/CodeSystem-hl7-specimen-type';'';'venöses Blut';'';'151';'1';'L';'';'';''
'BON';'2.16.840.1.113883.5.129';'Bone';'https://termgit.elga.gv.at/CodeSystem-hl7-specimen-type';'';'Knochen';'';'152';'1';'L';'';'';''
'BPH';'2.16.840.1.113883.5.129';'Basophils';'https://termgit.elga.gv.at/CodeSystem-hl7-specimen-type';'';'Basophile';'';'153';'1';'L';'';'';''
'BPU';'2.16.840.1.113883.5.129';'Blood product unit';'https://termgit.elga.gv.at/CodeSystem-hl7-specimen-type';'';'Blutprodukt-Einheit';'';'154';'1';'L';'';'';''
'BRN';'2.16.840.1.113883.5.129';'Burn';'https://termgit.elga.gv.at/CodeSystem-hl7-specimen-type';'';'Verbrennung';'';'155';'1';'L';'';'';''
'BRO';'2.16.840.1.113883.5.129';'Bronchial';'https://termgit.elga.gv.at/CodeSystem-hl7-specimen-type';'';'Bronchial-';'';'156';'1';'L';'';'';''
'BRTH';'2.16.840.1.113883.5.129';'Exhaled gas (=breath) Breath (use EXG)';'https://termgit.elga.gv.at/CodeSystem-hl7-specimen-type';'';'Atem/ausgeatmete Luft';'';'157';'1';'L';'';'';''
'CALC';'2.16.840.1.113883.5.129';'Calculus (=Stone) Stone (use CALC)';'https://termgit.elga.gv.at/CodeSystem-hl7-specimen-type';'';'Stein';'';'158';'1';'L';'';'';''
'CDM';'2.16.840.1.113883.5.129';'Cardiac muscle';'https://termgit.elga.gv.at/CodeSystem-hl7-specimen-type';'';'Herzmuskel';'';'159';'1';'L';'';'';''
'CNJT';'2.16.840.1.113883.5.129';'Conjunctiva';'https://termgit.elga.gv.at/CodeSystem-hl7-specimen-type';'';'Bindehaut';'';'160';'1';'L';'';'';''
'CNL';'2.16.840.1.113883.5.129';'Cannula';'https://termgit.elga.gv.at/CodeSystem-hl7-specimen-type';'';'Kanüle';'';'161';'1';'L';'';'';''
'COL';'2.16.840.1.113883.5.129';'Colostrum';'https://termgit.elga.gv.at/CodeSystem-hl7-specimen-type';'';'Kolostralmilch';'';'162';'1';'L';'';'';''
'CRN';'2.16.840.1.113883.5.129';'Cornea';'https://termgit.elga.gv.at/CodeSystem-hl7-specimen-type';'';'Augenhornhaut';'';'163';'1';'L';'';'';''
'CSF';'2.16.840.1.113883.5.129';'Cerebral spinal fluid';'https://termgit.elga.gv.at/CodeSystem-hl7-specimen-type';'';'Cerebrospinalflüssigkeit';'';'164';'1';'L';'';'';''
'CTP';'2.16.840.1.113883.5.129';'Catheter tip';'https://termgit.elga.gv.at/CodeSystem-hl7-specimen-type';'';'Katheter';'';'165';'1';'L';'';'';''
'CUR';'2.16.840.1.113883.5.129';'Curettage';'https://termgit.elga.gv.at/CodeSystem-hl7-specimen-type';'';'Kürettage';'';'166';'1';'L';'';'';''
'CVM';'2.16.840.1.113883.5.129';'Cervical mucus';'https://termgit.elga.gv.at/CodeSystem-hl7-specimen-type';'';'Cervixschleim';'';'167';'1';'L';'';'';''
'CVX';'2.16.840.1.113883.5.129';'Cervix';'https://termgit.elga.gv.at/CodeSystem-hl7-specimen-type';'';'';'';'168';'1';'L';'';'';''
'CYST';'2.16.840.1.113883.5.129';'Cyst';'https://termgit.elga.gv.at/CodeSystem-hl7-specimen-type';'';'Zyste';'';'169';'1';'L';'';'';''
'DIAF';'2.16.840.1.113883.5.129';'Dialysis fluid';'https://termgit.elga.gv.at/CodeSystem-hl7-specimen-type';'';'Dialyseflüssigkeit';'';'170';'1';'L';'';'';''
'DOSE';'2.16.840.1.113883.5.129';'Dose med or substance';'https://termgit.elga.gv.at/CodeSystem-hl7-specimen-type';'';'Medikament oder verabreichte Substanz';'';'171';'1';'L';'';'';''
'DRN';'2.16.840.1.113883.5.129';'Drain';'https://termgit.elga.gv.at/CodeSystem-hl7-specimen-type';'';'';'';'172';'1';'L';'';'';''
'DUFL';'2.16.840.1.113883.5.129';'Duodenal fluid';'https://termgit.elga.gv.at/CodeSystem-hl7-specimen-type';'';'Flüssigkeit des Zwölffingerdarms';'';'173';'1';'L';'';'';''
'EAR';'2.16.840.1.113883.5.129';'Ear';'https://termgit.elga.gv.at/CodeSystem-hl7-specimen-type';'';'Ohr';'';'174';'1';'L';'';'';''
'EARW';'2.16.840.1.113883.5.129';'Ear wax (cerumen)';'https://termgit.elga.gv.at/CodeSystem-hl7-specimen-type';'';'Cerumen';'';'175';'1';'L';'';'';''
'ELT';'2.16.840.1.113883.5.129';'Electrode';'https://termgit.elga.gv.at/CodeSystem-hl7-specimen-type';'';'Elektrode';'';'176';'1';'L';'';'';''
'ENDC';'2.16.840.1.113883.5.129';'Endocardium';'https://termgit.elga.gv.at/CodeSystem-hl7-specimen-type';'';'Endokard';'';'177';'1';'L';'';'';''
'ENDM';'2.16.840.1.113883.5.129';'Endometrium';'https://termgit.elga.gv.at/CodeSystem-hl7-specimen-type';'';'Endometrium, Gebärmutterschleimhaut';'';'178';'1';'L';'';'';''
'EOS';'2.16.840.1.113883.5.129';'Eosinophils';'https://termgit.elga.gv.at/CodeSystem-hl7-specimen-type';'';'Eosinophile';'';'179';'1';'L';'';'';''
'EXG';'2.16.840.1.113883.5.129';'Exhaled gas (=breath) Breath (use EXG)';'https://termgit.elga.gv.at/CodeSystem-hl7-specimen-type';'';'Atem/ ausgeatmete Luft';'';'180';'1';'L';'';'';''
'EYE';'2.16.840.1.113883.5.129';'Eye';'https://termgit.elga.gv.at/CodeSystem-hl7-specimen-type';'';'Auge';'';'181';'1';'L';'';'';''
'FIB';'2.16.840.1.113883.5.129';'Fibroblasts';'https://termgit.elga.gv.at/CodeSystem-hl7-specimen-type';'';'Fibroblasten';'';'182';'1';'L';'';'';''
'FIST';'2.16.840.1.113883.5.129';'Fistula';'https://termgit.elga.gv.at/CodeSystem-hl7-specimen-type';'';'Fistel';'';'183';'1';'L';'';'';''
'FLT';'2.16.840.1.113883.5.129';'Filter';'https://termgit.elga.gv.at/CodeSystem-hl7-specimen-type';'';'';'';'184';'1';'L';'';'';''
'FLU';'2.16.840.1.113883.5.129';'Body fluid, unsp';'https://termgit.elga.gv.at/CodeSystem-hl7-specimen-type';'';'Körperflüssigkeit';'';'185';'1';'L';'';'';''
'FOOD';'2.16.840.1.113883.5.129';'Food sample';'https://termgit.elga.gv.at/CodeSystem-hl7-specimen-type';'';'Speiseprobe';'';'186';'1';'L';'';'';''
'GAS';'2.16.840.1.113883.5.129';'Gas';'https://termgit.elga.gv.at/CodeSystem-hl7-specimen-type';'';'';'';'187';'1';'L';'';'';''
'GAST';'2.16.840.1.113883.5.129';'Gastric fluid/contents';'https://termgit.elga.gv.at/CodeSystem-hl7-specimen-type';'';'Magenflüssigkeit/ -inhalt';'';'188';'1';'L';'';'';''
'GEN';'2.16.840.1.113883.5.129';'Genital';'https://termgit.elga.gv.at/CodeSystem-hl7-specimen-type';'';'';'';'189';'1';'L';'';'';''
'GENC';'2.16.840.1.113883.5.129';'Genital cervix';'https://termgit.elga.gv.at/CodeSystem-hl7-specimen-type';'';'Cervix uteri';'';'190';'1';'L';'';'';''
'GENF';'2.16.840.1.113883.5.129';'Genital fluid';'https://termgit.elga.gv.at/CodeSystem-hl7-specimen-type';'';'Genitalflüssigkeit';'';'191';'1';'L';'';'';''
'GENL';'2.16.840.1.113883.5.129';'Genital lochia';'https://termgit.elga.gv.at/CodeSystem-hl7-specimen-type';'';'Wochenfluss / Lochien';'';'192';'1';'L';'';'';''
'GENV';'2.16.840.1.113883.5.129';'Genital vaginal';'https://termgit.elga.gv.at/CodeSystem-hl7-specimen-type';'';'Genital / Vaginal';'';'193';'1';'L';'';'';''
'HAR';'2.16.840.1.113883.5.129';'Hair';'https://termgit.elga.gv.at/CodeSystem-hl7-specimen-type';'';'Haar';'';'194';'1';'L';'';'';''
'IHG';'2.16.840.1.113883.5.129';'Inhaled Gas';'https://termgit.elga.gv.at/CodeSystem-hl7-specimen-type';'';'eingeatmetes Gas';'';'195';'1';'L';'';'';''
'ISLT';'2.16.840.1.113883.5.129';'Isolate';'https://termgit.elga.gv.at/CodeSystem-hl7-specimen-type';'';'Isolat';'';'196';'1';'L';'';'';''
'IT';'2.16.840.1.113883.5.129';'Intubation tube';'https://termgit.elga.gv.at/CodeSystem-hl7-specimen-type';'';'Intubationsschlauch';'';'197';'1';'L';'';'';''
'LAM';'2.16.840.1.113883.5.129';'Lamella';'https://termgit.elga.gv.at/CodeSystem-hl7-specimen-type';'';'Lamelle';'';'198';'1';'L';'';'';''
'LIQ';'2.16.840.1.113883.5.129';'Liquid NOS';'https://termgit.elga.gv.at/CodeSystem-hl7-specimen-type';'';'Flüssigkeit (sonst nirgends spezifiziert)';'';'199';'1';'L';'';'';''
'LN';'2.16.840.1.113883.5.129';'Line';'https://termgit.elga.gv.at/CodeSystem-hl7-specimen-type';'';'Leitung';'';'200';'1';'L';'';'';''
'LNA';'2.16.840.1.113883.5.129';'Line arterial';'https://termgit.elga.gv.at/CodeSystem-hl7-specimen-type';'';'arterielle Leitung';'';'201';'1';'L';'';'';''
'LNV';'2.16.840.1.113883.5.129';'Line venous';'https://termgit.elga.gv.at/CodeSystem-hl7-specimen-type';'';'venöse Leitung';'';'202';'1';'L';'';'';''
'LYM';'2.16.840.1.113883.5.129';'Lymphocytes';'https://termgit.elga.gv.at/CodeSystem-hl7-specimen-type';'';'Lymphozyt';'';'203';'1';'L';'';'';''
'MAC';'2.16.840.1.113883.5.129';'Macrophages';'https://termgit.elga.gv.at/CodeSystem-hl7-specimen-type';'';'Makrophagen';'';'204';'1';'L';'';'';''
'MAR';'2.16.840.1.113883.5.129';'Marrow (bone)';'https://termgit.elga.gv.at/CodeSystem-hl7-specimen-type';'';'Knochenmark';'';'205';'1';'L';'';'';''
'MBLD';'2.16.840.1.113883.5.129';'Menstrual blood';'https://termgit.elga.gv.at/CodeSystem-hl7-specimen-type';'';'Menstruationsblut';'';'206';'1';'L';'';'';''
'MEC';'2.16.840.1.113883.5.129';'Meconium';'https://termgit.elga.gv.at/CodeSystem-hl7-specimen-type';'';'Mekonium';'';'207';'1';'L';'';'';''
'MILK';'2.16.840.1.113883.5.129';'Breast milk';'https://termgit.elga.gv.at/CodeSystem-hl7-specimen-type';'';'Muttermilch';'';'208';'1';'L';'';'';''
'MLK';'2.16.840.1.113883.5.129';'Milk';'https://termgit.elga.gv.at/CodeSystem-hl7-specimen-type';'';'Milch';'';'209';'1';'L';'';'';''
'NAIL';'2.16.840.1.113883.5.129';'Nail';'https://termgit.elga.gv.at/CodeSystem-hl7-specimen-type';'';'Nagel';'';'210';'1';'L';'';'';''
'NOS';'2.16.840.1.113883.5.129';'Nose (nasal passage)';'https://termgit.elga.gv.at/CodeSystem-hl7-specimen-type';'';'Nasengang';'';'211';'1';'L';'';'';''
'PAFL';'2.16.840.1.113883.5.129';'Pancreatic fluid';'https://termgit.elga.gv.at/CodeSystem-hl7-specimen-type';'';'Flüssigkeit der Bauchspeicheldrüse';'';'212';'1';'L';'';'';''
'PAT';'2.16.840.1.113883.5.129';'Patient';'https://termgit.elga.gv.at/CodeSystem-hl7-specimen-type';'';'';'';'213';'1';'L';'';'';''
'PLAS';'2.16.840.1.113883.5.129';'Plasma';'https://termgit.elga.gv.at/CodeSystem-hl7-specimen-type';'';'';'';'214';'1';'L';'';'';''
'PLB';'2.16.840.1.113883.5.129';'Plasma bag';'https://termgit.elga.gv.at/CodeSystem-hl7-specimen-type';'';'Plasmatasche';'';'215';'1';'L';'';'';''
'PLC';'2.16.840.1.113883.5.129';'Placenta';'https://termgit.elga.gv.at/CodeSystem-hl7-specimen-type';'';'Plazenta';'';'216';'1';'L';'';'';''
'PLR';'2.16.840.1.113883.5.129';'Pleural fluid (thoracentesis fld)';'https://termgit.elga.gv.at/CodeSystem-hl7-specimen-type';'';'Pleuraflüssigkeit / Lungenflüssigkeit';'';'217';'1';'L';'';'';''
'PMN';'2.16.840.1.113883.5.129';'Polymorphonuclear neutrophils';'https://termgit.elga.gv.at/CodeSystem-hl7-specimen-type';'';'Neutrophile, polymorphnukleare';'';'218';'1';'L';'';'';''
'PPP';'2.16.840.1.113883.5.129';'Platelet poor plasma';'https://termgit.elga.gv.at/CodeSystem-hl7-specimen-type';'';'Thrombozytenarmes Plasma';'';'219';'1';'L';'';'';''
'PRP';'2.16.840.1.113883.5.129';'Platelet rich plasma';'https://termgit.elga.gv.at/CodeSystem-hl7-specimen-type';'';'Thrombozytenreiches Plasma';'';'220';'1';'L';'';'';''
'PRT';'2.16.840.1.113883.5.129';'Peritoneal fluid /ascites';'https://termgit.elga.gv.at/CodeSystem-hl7-specimen-type';'';'Peritonealflüssigkeit';'';'221';'1';'L';'';'';''
'PUS';'2.16.840.1.113883.5.129';'Pus';'https://termgit.elga.gv.at/CodeSystem-hl7-specimen-type';'';'Eiter';'';'222';'1';'L';'';'';''
'RBC';'2.16.840.1.113883.5.129';'Erythrocytes';'https://termgit.elga.gv.at/CodeSystem-hl7-specimen-type';'';'Erythrozyten';'';'223';'1';'L';'';'';''
'SAL';'2.16.840.1.113883.5.129';'Saliva';'https://termgit.elga.gv.at/CodeSystem-hl7-specimen-type';'';'Speichel';'';'224';'1';'L';'';'';''
'SER';'2.16.840.1.113883.5.129';'Serum';'https://termgit.elga.gv.at/CodeSystem-hl7-specimen-type';'';'';'';'225';'1';'L';'';'';''
'SKM';'2.16.840.1.113883.5.129';'Skeletal muscle';'https://termgit.elga.gv.at/CodeSystem-hl7-specimen-type';'';'Skelettmuskel';'';'226';'1';'L';'';'';''
'SKN';'2.16.840.1.113883.5.129';'Skin';'https://termgit.elga.gv.at/CodeSystem-hl7-specimen-type';'';'Haut';'';'227';'1';'L';'';'';''
'SMN';'2.16.840.1.113883.5.129';'Seminal fluid';'https://termgit.elga.gv.at/CodeSystem-hl7-specimen-type';'';'Samenflüssigkeit';'';'228';'1';'L';'';'';''
'SMPLS';'2.16.840.1.113883.5.129';'Seminal plasma';'https://termgit.elga.gv.at/CodeSystem-hl7-specimen-type';'';'Seminalplasma';'';'229';'1';'L';'';'';''
'SNV';'2.16.840.1.113883.5.129';'Synovial fluid (Joint fluid)';'https://termgit.elga.gv.at/CodeSystem-hl7-specimen-type';'';'Synovialflüssigkeit';'';'230';'1';'L';'';'';''
'SPRM';'2.16.840.1.113883.5.129';'Spermatozoa';'https://termgit.elga.gv.at/CodeSystem-hl7-specimen-type';'';'Spermatozoen';'';'231';'1';'L';'';'';''
'SPT';'2.16.840.1.113883.5.129';'Sputum';'https://termgit.elga.gv.at/CodeSystem-hl7-specimen-type';'';'';'';'232';'1';'L';'';'';''
'SPTC';'2.16.840.1.113883.5.129';'Sputum - coughed';'https://termgit.elga.gv.at/CodeSystem-hl7-specimen-type';'';'ausgehustetes Sputum';'';'233';'1';'L';'';'';''
'SPTT';'2.16.840.1.113883.5.129';'Sputum - tracheal aspirate';'https://termgit.elga.gv.at/CodeSystem-hl7-specimen-type';'';'tracheal abgesaugtes Sputum';'';'234';'1';'L';'';'';''
'STL';'2.16.840.1.113883.5.129';'Stool = Fecal';'https://termgit.elga.gv.at/CodeSystem-hl7-specimen-type';'';'Fäzes';'';'235';'1';'L';'';'';''
'STON';'2.16.840.1.113883.5.129';'Calculus (=Stone) Stone (use CALC)';'https://termgit.elga.gv.at/CodeSystem-hl7-specimen-type';'';'Stein';'';'236';'1';'L';'';'';''
'SWAB';'1.2.40.0.34.5.173';'Swab';'https://termgit.elga.gv.at/CodeSystem-elga-specimentype-ergaenzung';'';'Abstrich';'';'237';'1';'L';'';'';''
'SWT';'2.16.840.1.113883.5.129';'Sweat';'https://termgit.elga.gv.at/CodeSystem-hl7-specimen-type';'';'Schweiß';'';'238';'1';'L';'';'';''
'TEAR';'2.16.840.1.113883.5.129';'Tears';'https://termgit.elga.gv.at/CodeSystem-hl7-specimen-type';'';'Tränen';'';'239';'1';'L';'';'';''
'THRB';'2.16.840.1.113883.5.129';'Thrombocyte (platelet)';'https://termgit.elga.gv.at/CodeSystem-hl7-specimen-type';'';'Blutplättchen';'';'240';'1';'L';'';'';''
'THRT';'2.16.840.1.113883.5.129';'Throat';'https://termgit.elga.gv.at/CodeSystem-hl7-specimen-type';'';'Rachen';'';'241';'1';'L';'';'';''
'TISG';'2.16.840.1.113883.5.129';'Tissue gall bladder';'https://termgit.elga.gv.at/CodeSystem-hl7-specimen-type';'';'Gallenblasengewebe';'';'242';'1';'L';'';'';''
'TISPL';'2.16.840.1.113883.5.129';'Tissue placenta';'https://termgit.elga.gv.at/CodeSystem-hl7-specimen-type';'';'Plazentagewebe';'';'243';'1';'L';'';'';''
'TISS';'2.16.840.1.113883.5.129';'Tissue, unspecified';'https://termgit.elga.gv.at/CodeSystem-hl7-specimen-type';'';'Gewebe, unspezifiziert';'';'244';'1';'L';'';'';''
'TISU';'2.16.840.1.113883.5.129';'Tissue ulcer';'https://termgit.elga.gv.at/CodeSystem-hl7-specimen-type';'';'Geschwürgewebe';'';'245';'1';'L';'';'';''
'TLGI';'2.16.840.1.113883.5.129';'Tissue large intestine';'https://termgit.elga.gv.at/CodeSystem-hl7-specimen-type';'';'Dickdarmgewebe';'';'246';'1';'L';'';'';''
'TLNG';'2.16.840.1.113883.5.129';'Tissue lung';'https://termgit.elga.gv.at/CodeSystem-hl7-specimen-type';'';'Lungengewebe';'';'247';'1';'L';'';'';''
'TSMI';'2.16.840.1.113883.5.129';'Tissue small intestine Tissue ulcer';'https://termgit.elga.gv.at/CodeSystem-hl7-specimen-type';'';'Dünndarmgewebe';'';'248';'1';'L';'';'';''
'TUB';'2.16.840.1.113883.5.129';'Tube, unspecified';'https://termgit.elga.gv.at/CodeSystem-hl7-specimen-type';'';'Eileiter, unspezifiziert';'';'249';'1';'L';'';'';''
'ULC';'2.16.840.1.113883.5.129';'Ulcer';'https://termgit.elga.gv.at/CodeSystem-hl7-specimen-type';'';'Geschwürgewebe';'';'250';'1';'L';'';'';''
'UMB';'2.16.840.1.113883.5.129';'Umbilical blood';'https://termgit.elga.gv.at/CodeSystem-hl7-specimen-type';'';'Nabelschnurblut';'';'251';'1';'L';'';'';''
'UMED';'2.16.840.1.113883.5.129';'Unknown medicine';'https://termgit.elga.gv.at/CodeSystem-hl7-specimen-type';'';'unbekanntes Medikament';'';'252';'1';'L';'';'';''
'UR';'2.16.840.1.113883.5.129';'Urine';'https://termgit.elga.gv.at/CodeSystem-hl7-specimen-type';'';'Harn';'';'253';'1';'L';'';'';''
'URC';'2.16.840.1.113883.5.129';'Urine clean catch';'https://termgit.elga.gv.at/CodeSystem-hl7-specimen-type';'';'Mittelstrahlurin';'';'254';'1';'L';'';'';''
'URNS';'2.16.840.1.113883.5.129';'Urine sediment';'https://termgit.elga.gv.at/CodeSystem-hl7-specimen-type';'';'Harnausscheidung';'';'255';'1';'L';'';'';''
'URT';'2.16.840.1.113883.5.129';'Urine catheter';'https://termgit.elga.gv.at/CodeSystem-hl7-specimen-type';'';'Harnkatheder';'';'256';'1';'L';'';'';''
'URTH';'2.16.840.1.113883.5.129';'Urethra';'https://termgit.elga.gv.at/CodeSystem-hl7-specimen-type';'';'Harnröhre';'';'257';'1';'L';'';'';''
'USUB';'2.16.840.1.113883.5.129';'Unknown substance';'https://termgit.elga.gv.at/CodeSystem-hl7-specimen-type';'';'unbekannte Substanz';'';'258';'1';'L';'';'';''
'VOM';'2.16.840.1.113883.5.129';'Vomitus';'https://termgit.elga.gv.at/CodeSystem-hl7-specimen-type';'';'Vomitus / Erbrochenes';'';'259';'1';'L';'';'';''
'WAT';'2.16.840.1.113883.5.129';'Water';'https://termgit.elga.gv.at/CodeSystem-hl7-specimen-type';'';'Wasser';'';'260';'1';'L';'';'';''
'WBC';'2.16.840.1.113883.5.129';'Leukocytes';'https://termgit.elga.gv.at/CodeSystem-hl7-specimen-type';'';'Leukozyten';'';'261';'1';'L';'';'';''
'WICK';'2.16.840.1.113883.5.129';'Wick';'https://termgit.elga.gv.at/CodeSystem-hl7-specimen-type';'';'Docht/Schnur';'';'262';'1';'L';'';'';''
'WND';'2.16.840.1.113883.5.129';'Wound';'https://termgit.elga.gv.at/CodeSystem-hl7-specimen-type';'';'Wunde';'';'263';'1';'L';'';'';''
'WNDA';'2.16.840.1.113883.5.129';'Wound abscess';'https://termgit.elga.gv.at/CodeSystem-hl7-specimen-type';'';'Wundabszess';'';'264';'1';'L';'';'';''
'WNDD';'2.16.840.1.113883.5.129';'Wound drainage';'https://termgit.elga.gv.at/CodeSystem-hl7-specimen-type';'';'Wunddrainage';'';'265';'1';'L';'';'';''
'WNDE';'2.16.840.1.113883.5.129';'Wound exudate';'https://termgit.elga.gv.at/CodeSystem-hl7-specimen-type';'';'Wundexsudat';'';'266';'1';'L';'';'';''
