{
  "resourceType": "ValueSet",
  "id": "eimpf-specialsituationindication",
  "url": "https://termgit.elga.gv.at/ValueSet-eimpf-specialsituationindication",
  "identifier": [
    {
      "use": "official",
      "system": "urn:ietf:rfc:3986",
      "value": "urn:oid:1.2.40.0.34.6.0.10.15"
    }
  ],
  "version": "202010",
  "name": "eimpf-specialsituationindication",
  "title": "eImpf_SpecialSituationIndication",
  "status": "active",
  "date": "2020-10-19",
  "description": "**Description:** Statement of exposure risk indication. Contains information protected by copyright of SNOMED International. Any use of SNOMED CT in Austria requires a valid affiliate license or sublicense. The corresponding license is free of charge, provided that the use only takes place in Austria and fulfills the conditions of the Affiliate License Agreement. Affiliate licenses can be requested directly from the respective NRC via the Member Licensing and Distribution Service (MLDS). https://mlds.ihtsdotools.org/#/landing/AT?lang=de\n\n**Beschreibung:** Angabe der Expositionsrisiko-Indikation. Enth\u00e4lt durch SNOMED International urheberrechtlich gesch\u00fctzte Information. Jede Verwendung von SNOMED CT in \u00d6sterreich erfordert eine aufrechte Affiliate Lizenz oder eine Sublizenz. Die entsprechende Lizenz ist kostenlos, vorausgesetzt die Verwendung findet nur in \u00d6sterreich statt und erf\u00fcllt die Bedingungen des Affiliate License Agreements. Affiliate Lizenzen k\u00f6nnen \u00fcber das Member Licensing and Distribution Service (MLDS) direkt beim jeweiligen NRC beantragt werden. https://mlds.ihtsdotools.org/#/landing/AT?lang=de",
  "compose": {
    "include": [
      {
        "system": "https://termgit.elga.gv.at/CodeSystem-eimpf-ergaenzung",
        "concept": [
          {
            "code": "_AllgemeineBev\u00f6lkerung",
            "display": "Allgemeine Bev\u00f6lkerung"
          },
          {
            "code": "_SpezielleRisikogruppef\u00fcr",
            "display": "Spezielle Risikogruppe f\u00fcr"
          }
        ]
      },
      {
        "system": "https://termgit.elga.gv.at/CodeSystem-snomed-ct-auszug",
        "concept": [
          {
            "code": "224627004",
            "display": "Allgemeine Bev\u00f6lkerung"
          },
          {
            "code": "836383009",
            "display": "Cholera Impfstoff"
          },
          {
            "code": "836381006",
            "display": "Diphtherie Impfstoff"
          },
          {
            "code": "836403007",
            "display": "Fr\u00fchsommer-Meningoencephalitis Impfstoff"
          },
          {
            "code": "836385002",
            "display": "Gelbfieber Impfstoff"
          },
          {
            "code": "836380007",
            "display": "Haemophilus influenzae Typ B Impfstoff"
          },
          {
            "code": "836375003",
            "display": "Hepatitis A Impfstoff"
          },
          {
            "code": "836374004",
            "display": "Hepatitis B Impfstoff"
          },
          {
            "code": "871919004",
            "display": "Herpes Zoster Impfstoff"
          },
          {
            "code": "836379009",
            "display": "Humane Papillomaviren Impfstoff"
          },
          {
            "code": "836377006",
            "display": "Influenza Impfstoff"
          },
          {
            "code": "871772009",
            "display": "Influenza (H1N1) Impfstoff"
          },
          {
            "code": "427036009",
            "display": "Influenza (H5N1) Impfstoff"
          },
          {
            "code": "836378001",
            "display": "Japanische Encephalitis Impfstoff"
          },
          {
            "code": "836382004",
            "display": "Masern Impfstoff"
          },
          {
            "code": "836401009",
            "display": "Meningokokken Impfstoff"
          },
          {
            "code": "1981000221108",
            "display": "Meningokokken Serotyp B Impfstoff"
          },
          {
            "code": "871866001",
            "display": "Meningokokken Serotyp C Impfstoff"
          },
          {
            "code": "871871008",
            "display": "Meningokokken Serotyp A+C Impfstoff"
          },
          {
            "code": "871873006",
            "display": "Meningokokken Serotyp A+C+W135+Y Impfstoff"
          },
          {
            "code": "871738001",
            "display": "Mumps Impfstoff"
          },
          {
            "code": "601000221108",
            "display": "Pertussis Impfstoff"
          },
          {
            "code": "836398006",
            "display": "Pneumokokken Impfstoff"
          },
          {
            "code": "836389008",
            "display": "Pocken Impfstoff"
          },
          {
            "code": "1031000221108",
            "display": "Poliomyelitis Impfstoff"
          },
          {
            "code": "836387005",
            "display": "Rotavirus Impfstoff"
          },
          {
            "code": "836388000",
            "display": "R\u00f6teln Impfstoff"
          },
          {
            "code": "1101000221104",
            "display": "Tetanus Impfstoff"
          },
          {
            "code": "836393002",
            "display": "Tollwut Impfstoff"
          },
          {
            "code": "836390004",
            "display": "Typhus Impfstoff"
          },
          {
            "code": "836495005",
            "display": "Varizellen Impfstoff"
          },
          {
            "code": "836402002",
            "display": "Tuberkulose Impfstoff"
          },
          {
            "code": "840534001",
            "display": "SARS-CoV-2 Impfstoff"
          }
        ]
      }
    ]
  },
  "expansion": {
    "timestamp": "2022-09-13T14:15:28Z",
    "contains": [
      {
        "system": "https://termgit.elga.gv.at/CodeSystem-eimpf-ergaenzung",
        "abstract": true,
        "code": "_AllgemeineBev\u00f6lkerung",
        "display": "Allgemeine Bev\u00f6lkerung",
        "contains": [
          {
            "system": "https://termgit.elga.gv.at/CodeSystem-snomed-ct-auszug",
            "code": "224627004",
            "display": "Allgemeine Bev\u00f6lkerung"
          }
        ]
      },
      {
        "system": "https://termgit.elga.gv.at/CodeSystem-eimpf-ergaenzung",
        "abstract": true,
        "code": "_SpezielleRisikogruppef\u00fcr",
        "display": "Spezielle Risikogruppe f\u00fcr",
        "contains": [
          {
            "system": "https://termgit.elga.gv.at/CodeSystem-snomed-ct-auszug",
            "code": "836383009",
            "display": "Cholera Impfstoff"
          },
          {
            "system": "https://termgit.elga.gv.at/CodeSystem-snomed-ct-auszug",
            "code": "836381006",
            "display": "Diphtherie Impfstoff"
          },
          {
            "system": "https://termgit.elga.gv.at/CodeSystem-snomed-ct-auszug",
            "code": "836403007",
            "display": "Fr\u00fchsommer-Meningoencephalitis Impfstoff"
          },
          {
            "system": "https://termgit.elga.gv.at/CodeSystem-snomed-ct-auszug",
            "code": "836385002",
            "display": "Gelbfieber Impfstoff"
          },
          {
            "system": "https://termgit.elga.gv.at/CodeSystem-snomed-ct-auszug",
            "code": "836380007",
            "display": "Haemophilus influenzae Typ B Impfstoff"
          },
          {
            "system": "https://termgit.elga.gv.at/CodeSystem-snomed-ct-auszug",
            "code": "836375003",
            "display": "Hepatitis A Impfstoff"
          },
          {
            "system": "https://termgit.elga.gv.at/CodeSystem-snomed-ct-auszug",
            "code": "836374004",
            "display": "Hepatitis B Impfstoff"
          },
          {
            "system": "https://termgit.elga.gv.at/CodeSystem-snomed-ct-auszug",
            "code": "871919004",
            "display": "Herpes Zoster Impfstoff"
          },
          {
            "system": "https://termgit.elga.gv.at/CodeSystem-snomed-ct-auszug",
            "code": "836379009",
            "display": "Humane Papillomaviren Impfstoff"
          },
          {
            "system": "https://termgit.elga.gv.at/CodeSystem-snomed-ct-auszug",
            "code": "836377006",
            "display": "Influenza Impfstoff"
          },
          {
            "system": "https://termgit.elga.gv.at/CodeSystem-snomed-ct-auszug",
            "code": "871772009",
            "display": "Influenza (H1N1) Impfstoff"
          },
          {
            "system": "https://termgit.elga.gv.at/CodeSystem-snomed-ct-auszug",
            "code": "427036009",
            "display": "Influenza (H5N1) Impfstoff"
          },
          {
            "system": "https://termgit.elga.gv.at/CodeSystem-snomed-ct-auszug",
            "code": "836378001",
            "display": "Japanische Encephalitis Impfstoff"
          },
          {
            "system": "https://termgit.elga.gv.at/CodeSystem-snomed-ct-auszug",
            "code": "836382004",
            "display": "Masern Impfstoff"
          },
          {
            "system": "https://termgit.elga.gv.at/CodeSystem-snomed-ct-auszug",
            "code": "836401009",
            "display": "Meningokokken Impfstoff"
          },
          {
            "system": "https://termgit.elga.gv.at/CodeSystem-snomed-ct-auszug",
            "code": "1981000221108",
            "display": "Meningokokken Serotyp B Impfstoff"
          },
          {
            "system": "https://termgit.elga.gv.at/CodeSystem-snomed-ct-auszug",
            "code": "871866001",
            "display": "Meningokokken Serotyp C Impfstoff"
          },
          {
            "system": "https://termgit.elga.gv.at/CodeSystem-snomed-ct-auszug",
            "code": "871871008",
            "display": "Meningokokken Serotyp A+C Impfstoff"
          },
          {
            "system": "https://termgit.elga.gv.at/CodeSystem-snomed-ct-auszug",
            "code": "871873006",
            "display": "Meningokokken Serotyp A+C+W135+Y Impfstoff"
          },
          {
            "system": "https://termgit.elga.gv.at/CodeSystem-snomed-ct-auszug",
            "code": "871738001",
            "display": "Mumps Impfstoff"
          },
          {
            "system": "https://termgit.elga.gv.at/CodeSystem-snomed-ct-auszug",
            "code": "601000221108",
            "display": "Pertussis Impfstoff"
          },
          {
            "system": "https://termgit.elga.gv.at/CodeSystem-snomed-ct-auszug",
            "code": "836398006",
            "display": "Pneumokokken Impfstoff"
          },
          {
            "system": "https://termgit.elga.gv.at/CodeSystem-snomed-ct-auszug",
            "code": "836389008",
            "display": "Pocken Impfstoff"
          },
          {
            "system": "https://termgit.elga.gv.at/CodeSystem-snomed-ct-auszug",
            "code": "1031000221108",
            "display": "Poliomyelitis Impfstoff"
          },
          {
            "system": "https://termgit.elga.gv.at/CodeSystem-snomed-ct-auszug",
            "code": "836387005",
            "display": "Rotavirus Impfstoff"
          },
          {
            "system": "https://termgit.elga.gv.at/CodeSystem-snomed-ct-auszug",
            "code": "836388000",
            "display": "R\u00f6teln Impfstoff"
          },
          {
            "system": "https://termgit.elga.gv.at/CodeSystem-snomed-ct-auszug",
            "code": "1101000221104",
            "display": "Tetanus Impfstoff"
          },
          {
            "system": "https://termgit.elga.gv.at/CodeSystem-snomed-ct-auszug",
            "code": "836393002",
            "display": "Tollwut Impfstoff"
          },
          {
            "system": "https://termgit.elga.gv.at/CodeSystem-snomed-ct-auszug",
            "code": "836390004",
            "display": "Typhus Impfstoff"
          },
          {
            "system": "https://termgit.elga.gv.at/CodeSystem-snomed-ct-auszug",
            "code": "836495005",
            "display": "Varizellen Impfstoff"
          },
          {
            "system": "https://termgit.elga.gv.at/CodeSystem-snomed-ct-auszug",
            "code": "836402002",
            "display": "Tuberkulose Impfstoff"
          },
          {
            "system": "https://termgit.elga.gv.at/CodeSystem-snomed-ct-auszug",
            "code": "840534001",
            "display": "SARS-CoV-2 Impfstoff"
          }
        ]
      }
    ]
  }
}