'code';'codeSystem';'displayName';'parentCodeSystemName';'concept_Beschreibung';'meaning';'hints';'orderNumber';'level';'type';'relationships';'einheit print';'einheit codiert'
'1';'1.2.40.0.34.5.11';'Allgemeiner Laborbefund';'https://termgit.elga.gv.at/CodeSystem-elga-laborparameterergaenzung';'Nur für EIS Basic Befunde';;'Entspricht LOINC 26436-6 (Laboratory studies)';'1';'0';'L';;;
'10';'1.2.40.0.34.5.11';'Probeninformation';'https://termgit.elga.gv.at/CodeSystem-elga-laborparameterergaenzung';;;;'2';'0';'L';;;
'100';'1.2.40.0.34.5.11';'Blutgruppenserologie';'https://termgit.elga.gv.at/CodeSystem-elga-laborparameterergaenzung';;;;'3';'0';'L';;;
'1000';'1.2.40.0.34.5.11';'Medikamente';'https://termgit.elga.gv.at/CodeSystem-elga-laborparameterergaenzung';;;'Entspricht LOINC 18721-1 (Therapeutic drug monitoring studies)';'4';'0';'L';;;
'10164-2';'2.16.840.1.113883.6.1';'History of Present illness Narrative';'http://loinc.org';;'Anamnese';;'5';'0';'L';;;
'108262000';'2.16.840.1.113883.6.96';'Molekularer Erregernachweis';'https://termgit.elga.gv.at/CodeSystem-snomed-ct-auszug';;;;'6';'0';'L';;;
'1100';'1.2.40.0.34.5.11';'Infektionsdiagnostik';'https://termgit.elga.gv.at/CodeSystem-elga-laborparameterergaenzung';;;;'7';'0';'L';;;
'1300';'1.2.40.0.34.5.11';'Autoimmundiagnostik';'https://termgit.elga.gv.at/CodeSystem-elga-laborparameterergaenzung';;;;'8';'0';'L';;;
'1400';'1.2.40.0.34.5.11';'Urindiagnostik';'https://termgit.elga.gv.at/CodeSystem-elga-laborparameterergaenzung';;;'Entspricht LOINC 18729-4 (Urinalysis studies)';'9';'0';'L';;;
'1500';'1.2.40.0.34.5.11';'Stuhldiagnostik';'https://termgit.elga.gv.at/CodeSystem-elga-laborparameterergaenzung';;;;'10';'0';'L';;;
'15220000';'2.16.840.1.113883.6.96';'Weitere Analysen';'https://termgit.elga.gv.at/CodeSystem-snomed-ct-auszug';;;;'11';'0';'L';;;
'1600';'1.2.40.0.34.5.11';'Liquordiagnostik';'https://termgit.elga.gv.at/CodeSystem-elga-laborparameterergaenzung';;;;'12';'0';'L';;;
'1800';'1.2.40.0.34.5.11';'Allergiediagnostik';'https://termgit.elga.gv.at/CodeSystem-elga-laborparameterergaenzung';;;'Entspricht LOINC 18716-1 (Allergy studies)';'13';'0';'L';;;
'18725-2';'2.16.840.1.113883.6.1';'Microbiology studies (set)';'http://loinc.org';;'Microbiology studies';;'14';'0';'L';;;
'20';'1.2.40.0.34.5.11';'Befundbewertung';'https://termgit.elga.gv.at/CodeSystem-elga-laborparameterergaenzung';;;;'15';'0';'L';;;
'200';'1.2.40.0.34.5.11';'Blutgasanalytik';'https://termgit.elga.gv.at/CodeSystem-elga-laborparameterergaenzung';;;'Entspricht LOINC 18767-4 (Blood gas studies)';'16';'0';'L';;;
'2300';'1.2.40.0.34.5.11';'Genetische Diagnostik';'https://termgit.elga.gv.at/CodeSystem-elga-laborparameterergaenzung';;;;'17';'0';'L';;;
'2500';'1.2.40.0.34.5.11';'Sonstige';'https://termgit.elga.gv.at/CodeSystem-elga-laborparameterergaenzung';;;;'18';'0';'L';;;
'300';'1.2.40.0.34.5.11';'Hämatologie';'https://termgit.elga.gv.at/CodeSystem-elga-laborparameterergaenzung';;;'Entspricht LOINC 18723-7 (Hematology studies)';'19';'0';'L';;;
'395538009';'2.16.840.1.113883.6.96';'Mikroskopie';'https://termgit.elga.gv.at/CodeSystem-snomed-ct-auszug';;;;'20';'0';'L';;;
'400';'1.2.40.0.34.5.11';'Gerinnung/Hämostaseologie';'https://termgit.elga.gv.at/CodeSystem-elga-laborparameterergaenzung';;;'Entspricht LOINC 18720-3 (Coagulation studies)';'21';'0';'L';;;
'400999005';'2.16.840.1.113883.6.96';'Angeforderte Untersuchung';'https://termgit.elga.gv.at/CodeSystem-snomed-ct-auszug';;;;'22';'0';'L';;;
'446394004';'2.16.840.1.113883.6.96';'Kultureller Erregernachweis';'https://termgit.elga.gv.at/CodeSystem-snomed-ct-auszug';;;;'23';'0';'L';;;
'46239-0';'2.16.840.1.113883.6.1';'Chief complaint+Reason for visit Narrative';'http://loinc.org';;'Überweisungsgrund';;'24';'0';'L';;;
'500';'1.2.40.0.34.5.11';'Klinische Chemie/Proteindiagnostik';'https://termgit.elga.gv.at/CodeSystem-elga-laborparameterergaenzung';;;'Entspricht LOINC 18719-5 (Chemistry studies)';'25';'0';'L';;;
'600';'1.2.40.0.34.5.11';'Hormone/Vitamine/Tumormarker';'https://termgit.elga.gv.at/CodeSystem-elga-laborparameterergaenzung';;;;'26';'0';'L';;;
'722143004';'2.16.840.1.113883.6.96';'Infektionsserologie';'https://termgit.elga.gv.at/CodeSystem-snomed-ct-auszug';;;;'27';'0';'L';;;
'900';'1.2.40.0.34.5.11';'Toxikologie';'https://termgit.elga.gv.at/CodeSystem-elga-laborparameterergaenzung';;;'Entspricht LOINC 18728-6 (Toxicology studies)';'28';'0';'L';;;
'BEIL';'1.2.40.0.34.5.40';'Beilagen';'https://termgit.elga.gv.at/CodeSystem-elga-sections';;;;'29';'0';'L';;;
