'code';'codeSystem';'displayName';'parentCodeSystemName';'concept_Beschreibung';'meaning';'hints';'orderNumber';'level';'type';'relationships';'einheit print';'einheit codiert'
'ACD';'2.16.840.1.113883.5.139';'ACD';'https://termgit.elga.gv.at/CodeSystem-hl7-timing-event';;'Mittags';;'1';'0';'L';;;
'ACM';'2.16.840.1.113883.5.139';'ACM';'https://termgit.elga.gv.at/CodeSystem-hl7-timing-event';;'Morgens';;'2';'0';'L';;;
'ACV';'2.16.840.1.113883.5.139';'ACV';'https://termgit.elga.gv.at/CodeSystem-hl7-timing-event';;'Abends';;'3';'0';'L';;;
'HS';'2.16.840.1.113883.5.139';'HS';'https://termgit.elga.gv.at/CodeSystem-hl7-timing-event';;'Nachts';;'4';'0';'L';;;
