{
  "resourceType": "CodeSystem",
  "id": "elga-pflegestufen",
  "url": "https://termgit.elga.gv.at/CodeSystem-elga-pflegestufen",
  "identifier": [
    {
      "use": "official",
      "system": "urn:ietf:rfc:3986",
      "value": "urn:oid:1.2.40.0.34.5.190"
    }
  ],
  "version": "202005",
  "name": "elga-pflegestufen",
  "title": "ELGA_Pflegestufen",
  "status": "active",
  "date": "2020-05-07",
  "contact": [
    {
      "telecom": [
        {
          "system": "url",
          "value": "https://www.svs.at/cdscontent/?contentid=10007.816625"
        }
      ]
    }
  ],
  "description": "**Description:** This code system represents the care levels possible in Austria for calculating the care allowance. To assign the care levels, the need for care must be determined in the course of an assessment by a doctor or a qualified nurse.\n\n**Beschreibung:** Dieses Codesystem stellt die in \u00d6sterreich m\u00f6glichen Pflegestufen zur Berechnung des Pflegegelds dar. F\u00fcr die Zuerkennung der Pflegestufen ist die Feststellung des Hilfe- und Betreuungsbedarfes im Rahmen einer Begutachtung durch einen Arzt oder eine diplomierte Pflegekraft notwendig.",
  "content": "complete",
  "count": 7,
  "property": [
    {
      "code": "hints",
      "type": "string"
    }
  ],
  "concept": [
    {
      "code": "Pflegestufe_1",
      "display": "Pflegestufe 1",
      "definition": "durchschnittlicher monatlicher Pflegebedarf von mehr als 65 Stunden (Wert 2020)"
    },
    {
      "code": "Pflegestufe_2",
      "display": "Pflegestufe 2",
      "definition": "durchschnittlicher monatlicher Pflegebedarf von mehr als 95 Stunden (Wert 2020)"
    },
    {
      "code": "Pflegestufe_3",
      "display": "Pflegestufe 3",
      "definition": "durchschnittlicher monatlicher Pflegebedarf von mehr als 120 Stunden (Wert 2020)"
    },
    {
      "code": "Pflegestufe_4",
      "display": "Pflegestufe 4",
      "definition": "durchschnittlicher monatlicher Pflegebedarf von mehr als 160 Stunden (Wert 2020)"
    },
    {
      "code": "Pflegestufe_5",
      "display": "Pflegestufe 5",
      "definition": "durchschnittlicher monatlicher Pflegebedarf von mehr als 180 Stunden und zus\u00e4tzlich ein au\u00dfergew\u00f6hnlicher Pflegeaufwand (Wert 2020)",
      "property": [
        {
          "code": "hints",
          "valueString": "insbesondere Notwendigkeit der dauernden Bereitschaft einer Pflegeperson; der regelm\u00e4\u00dfigen Nachschau durch eine Pflegeperson in relativ kurzen, jedoch planbaren Zeitabst\u00e4nden (mindestens auch eine einmalige Nachschau in den Nachtstunden) oder von mehr als f\u00fcnf Pflegeeinheiten, davon auch eine in den Nachtstunden"
        }
      ]
    },
    {
      "code": "Pflegestufe_6",
      "display": "Pflegestufe 6",
      "definition": "durchschnittlicher monatlicher Pflegebedarf von mehr als 180 Stunden und zeitlich nicht planbare Betreuungsma\u00dfnahmen oder dauernde Anwesenheit einer Pflegeperson (Wert 2020)",
      "property": [
        {
          "code": "hints",
          "valueString": "zeitlich nicht planbare Betreuungsma\u00dfnahmen regelm\u00e4\u00dfig w\u00e4hrend des Tages und der Nacht oder dauernde Anwesenheit einer Pflegeperson w\u00e4hrend des Tages und der Nacht auf Grund von Eigen- oder Fremdgef\u00e4hrdung"
        }
      ]
    },
    {
      "code": "Pflegestufe_7",
      "display": "Pflegestufe 7",
      "definition": "durchschnittlicher monatlicher Pflegebedarf von mehr als 180 Stunden und keine zielgerichteten Bewegungen aller vier Extremit\u00e4ten oder ein gleichzuachtender Zustand (Wert 2020)"
    }
  ]
}