'code';'codeSystem';'displayName';'parentCodeSystemName';'concept_Beschreibung';'meaning';'hints';'orderNumber';'level';'type';'relationships';'einheit print';'einheit codiert'
'111209006';'2.16.840.1.113883.6.96';'Photoallergische Dermatitis';'https://termgit.elga.gv.at/CodeSystem-snomed-ct-auszug';'SNOMED Clinical Terms';;;'1';'0';'L';;;
'115664001';'2.16.840.1.113883.6.96';'Photoallergische Dermatitis [veraltet]';'https://termgit.elga.gv.at/CodeSystem-snomed-ct-auszug';'SNOMED Clinical Terms';'Photoallergische Dermatitis';'inaktiv, ersetzt durch 111209006';'2';'0';'L';;;
'126485001';'2.16.840.1.113883.6.96';'Urtikaria';'https://termgit.elga.gv.at/CodeSystem-snomed-ct-auszug';'SNOMED Clinical Terms';'Urtikaria~Nesselsucht';;'3';'0';'L';;;
'162290004';'2.16.840.1.113883.6.96';'Trockenheit der Augen';'https://termgit.elga.gv.at/CodeSystem-snomed-ct-auszug';'SNOMED Clinical Terms';;;'4';'0';'L';;;
'195967001';'2.16.840.1.113883.6.96';'Asthma';'https://termgit.elga.gv.at/CodeSystem-snomed-ct-auszug';'SNOMED Clinical Terms';'Asthma~Asthma bronchiale';;'5';'0';'L';;;
'23924001';'2.16.840.1.113883.6.96';'Brustschmerzen';'https://termgit.elga.gv.at/CodeSystem-snomed-ct-auszug';'SNOMED Clinical Terms';'Brustschmerzen~Engegefühl in der Brust';;'6';'0';'L';;;
'24079001';'2.16.840.1.113883.6.96';'Atopische Dermatitis';'https://termgit.elga.gv.at/CodeSystem-snomed-ct-auszug';'SNOMED Clinical Terms';'Atopische Dermatitis~Atopisches Ekzem~Neurodermitis';;'7';'0';'L';;;
'247471006';'2.16.840.1.113883.6.96';'Makulopapulöser Ausschlag';'https://termgit.elga.gv.at/CodeSystem-snomed-ct-auszug';'SNOMED Clinical Terms';;;'8';'0';'L';;;
'247472004';'2.16.840.1.113883.6.96';'Quaddeln';'https://termgit.elga.gv.at/CodeSystem-snomed-ct-auszug';'SNOMED Clinical Terms';'Quaddeln~Striemen~Hautrötungen';;'9';'0';'L';;;
'267036007';'2.16.840.1.113883.6.96';'Atemnot';'https://termgit.elga.gv.at/CodeSystem-snomed-ct-auszug';'SNOMED Clinical Terms';'Atemnot~Atemlosigkeit~Kurzatmigkeit';;'10';'0';'L';;;
'271757001';'2.16.840.1.113883.6.96';'Papulöser Ausschlag';'https://termgit.elga.gv.at/CodeSystem-snomed-ct-auszug';'SNOMED Clinical Terms';'Papulöser Ausschlag~Papeln';;'11';'0';'L';;;
'271759003';'2.16.840.1.113883.6.96';'Bullöse Eruption';'https://termgit.elga.gv.at/CodeSystem-snomed-ct-auszug';'SNOMED Clinical Terms';'Bullöse Eruption~Dermatose';;'12';'0';'L';;;
'271807003';'2.16.840.1.113883.6.96';'Hautausschlag';'https://termgit.elga.gv.at/CodeSystem-snomed-ct-auszug';'SNOMED Clinical Terms';;;'13';'0';'L';;;
'31996006';'2.16.840.1.113883.6.96';'Vaskulitis';'https://termgit.elga.gv.at/CodeSystem-snomed-ct-auszug';'SNOMED Clinical Terms';'Vaskulitis~Gefäßentzündung';;'14';'0';'L';;;
'359610006';'2.16.840.1.113883.6.96';'Augenrötung [veraltet]';'https://termgit.elga.gv.at/CodeSystem-snomed-ct-auszug';'SNOMED Clinical Terms';'Augenrötung';'inaktiv, ersetzt durch 781682005';'15';'0';'L';;;
'36715001';'2.16.840.1.113883.6.96';'Erythema exsudativum multiforme';'https://termgit.elga.gv.at/CodeSystem-snomed-ct-auszug';'SNOMED Clinical Terms';;;'16';'0';'L';;;
'3723001';'2.16.840.1.113883.6.96';'Arthritis';'https://termgit.elga.gv.at/CodeSystem-snomed-ct-auszug';'SNOMED Clinical Terms';;;'17';'0';'L';;;
'39579001';'2.16.840.1.113883.6.96';'Anaphylaxie';'https://termgit.elga.gv.at/CodeSystem-snomed-ct-auszug';'SNOMED Clinical Terms';;;'18';'0';'L';;;
'40275004';'2.16.840.1.113883.6.96';'Kontaktdermatitis';'https://termgit.elga.gv.at/CodeSystem-snomed-ct-auszug';'SNOMED Clinical Terms';;;'19';'0';'L';;;
'410430005';'2.16.840.1.113883.6.96';'Herzstillstand';'https://termgit.elga.gv.at/CodeSystem-snomed-ct-auszug';'SNOMED Clinical Terms';'Herzstillstand~Kreislaufstillstand';;'20';'0';'L';;;
'41291007';'2.16.840.1.113883.6.96';'Angioödem';'https://termgit.elga.gv.at/CodeSystem-snomed-ct-auszug';'SNOMED Clinical Terms';;;'21';'0';'L';;;
'418290006';'2.16.840.1.113883.6.96';'Juckreiz';'https://termgit.elga.gv.at/CodeSystem-snomed-ct-auszug';'SNOMED Clinical Terms';;;'22';'0';'L';;;
'418363000';'2.16.840.1.113883.6.96';'Hautjuckreiz';'https://termgit.elga.gv.at/CodeSystem-snomed-ct-auszug';'SNOMED Clinical Terms';;;'23';'0';'L';;;
'422400008';'2.16.840.1.113883.6.96';'Erbrechen';'https://termgit.elga.gv.at/CodeSystem-snomed-ct-auszug';'SNOMED Clinical Terms';'Erbrechen~Emesis~Vomitus';;'24';'0';'L';;;
'422587007';'2.16.840.1.113883.6.96';'Übelkeit';'https://termgit.elga.gv.at/CodeSystem-snomed-ct-auszug';'SNOMED Clinical Terms';;;'25';'0';'L';;;
'43116000';'2.16.840.1.113883.6.96';'Ekzem';'https://termgit.elga.gv.at/CodeSystem-snomed-ct-auszug';'SNOMED Clinical Terms';'Ekzem~Juckflechte';;'26';'0';'L';;;
'4386001';'2.16.840.1.113883.6.96';'Bronchospasmus';'https://termgit.elga.gv.at/CodeSystem-snomed-ct-auszug';'SNOMED Clinical Terms';;;'27';'0';'L';;;
'49727002';'2.16.840.1.113883.6.96';'Husten';'https://termgit.elga.gv.at/CodeSystem-snomed-ct-auszug';'SNOMED Clinical Terms';;;'28';'0';'L';;;
'51599000';'2.16.840.1.113883.6.96';'Larynxödem';'https://termgit.elga.gv.at/CodeSystem-snomed-ct-auszug';'SNOMED Clinical Terms';'Larynxödem~Kehlkopfödem';;'29';'0';'L';;;
'52845002';'2.16.840.1.113883.6.96';'Nephritis';'https://termgit.elga.gv.at/CodeSystem-snomed-ct-auszug';'SNOMED Clinical Terms';'Nephritis~Nierenentzündung';;'30';'0';'L';;;
'62315008';'2.16.840.1.113883.6.96';'Diarrhoe';'https://termgit.elga.gv.at/CodeSystem-snomed-ct-auszug';'SNOMED Clinical Terms';'Diarrhoe~Durchfall';;'31';'0';'L';;;
'698247007';'2.16.840.1.113883.6.96';'Herzrhythmusstörung';'https://termgit.elga.gv.at/CodeSystem-snomed-ct-auszug';'SNOMED Clinical Terms';;;'32';'0';'L';;;
'70076002';'2.16.840.1.113883.6.96';'Rhinitis';'https://termgit.elga.gv.at/CodeSystem-snomed-ct-auszug';'SNOMED Clinical Terms';'Rhinitis~Nasenschleimhautentzündung';;'33';'0';'L';;;
'702809001';'2.16.840.1.113883.6.96';'DRESS Syndrom';'https://termgit.elga.gv.at/CodeSystem-snomed-ct-auszug';'SNOMED Clinical Terms';;;'34';'0';'L';;;
'73442001';'2.16.840.1.113883.6.96';'Stevens-Johnson-Syndrom';'https://termgit.elga.gv.at/CodeSystem-snomed-ct-auszug';'SNOMED Clinical Terms';'Stevens-Johnson-Syndrom~Dermatostomatitis Baader~ Fiessinger-Rendu-Syndrom';;'35';'0';'L';;;
'76067001';'2.16.840.1.113883.6.96';'Niesen';'https://termgit.elga.gv.at/CodeSystem-snomed-ct-auszug';'SNOMED Clinical Terms';;;'36';'0';'L';;;
'768962006';'2.16.840.1.113883.6.96';'Lyell-Syndrom';'https://termgit.elga.gv.at/CodeSystem-snomed-ct-auszug';'SNOMED Clinical Terms';'Lyell-Syndrom~Epidermolysis acuta toxica';;'37';'0';'L';;;
'781682005';'2.16.840.1.113883.6.96';'Hyperemia of eye';'https://termgit.elga.gv.at/CodeSystem-snomed-ct-auszug';'SNOMED Clinical Terms';'Augenrötung';;'38';'0';'L';;;
'91175000';'2.16.840.1.113883.6.96';'Krampfanfall';'https://termgit.elga.gv.at/CodeSystem-snomed-ct-auszug';'SNOMED Clinical Terms';;;'39';'0';'L';;;
'95361005';'2.16.840.1.113883.6.96';'Entzündungskrankheiten der Schleimhaut';'https://termgit.elga.gv.at/CodeSystem-snomed-ct-auszug';'SNOMED Clinical Terms';;;'40';'0';'L';;;
'9826008';'2.16.840.1.113883.6.96';'Conjunktivitis';'https://termgit.elga.gv.at/CodeSystem-snomed-ct-auszug';'SNOMED Clinical Terms';'Conjunktivitis~Konjunktivitis~Bindehautentzündung';;'41';'0';'L';;;
