user_id,session_id,event_date_pst,event_code,pb_id
1696290,14572421,2019-07-25 23:48:47.621,GSR_VIEW,
1696290,14572421,2019-07-25 23:48:54.322,GSR_VIEW,
1696290,14572421,2019-07-25 23:48:55.530,GSA_ENTITY_CLICK,11110-06
1696290,14572421,2019-07-25 23:48:55.689,VIP,
1696290,14572421,2019-07-25 23:51:10.028,VCP,
1696290,14572421,2019-07-25 23:51:53.819,VCP,
1696290,14572421,2019-07-25 23:51:54.079,VIP,
1696290,14572421,2019-07-25 23:52:03.627,VCP,
1696290,14572421,2019-07-25 23:52:45.914,VCP,
1696290,14572421,2019-07-26 00:43:07.858,GSR_NORESULTS_NAMES,
1696290,14572421,2019-07-26 00:43:08.493,GSR_VIEW,
1696290,14572421,2019-07-26 00:43:09.393,GSA_NORESULTS,
1696290,14572421,2019-07-26 00:43:12.707,GSR_VIEW,
1696290,14572421,2019-07-26 00:43:13.508,GSR_ENTITY_CLICK,53780-77
1696290,14572421,2019-07-26 00:43:14.709,VCP,
1696290,14572421,2019-07-26 00:43:15.239,GSR_VIEW,
1696290,14572421,2019-07-26 00:43:16.030,GSR_ENTITY_CLICK,53780-77
1696290,14572421,2019-07-26 01:07:59.491,GSR_NORESULTS_NAMES,
1696290,14572421,2019-07-26 01:08:00.121,GSR_VIEW,
1696290,14572421,2019-07-26 01:08:03.197,GSA_ENTITY_CLICK,57861-55
1696290,14572421,2019-07-26 01:08:04.002,VCP,
