[
  {
    "clave": "RESOLUCION",
    "valor": "RESOLUCIÓN"
  },
  {
    "clave": "CONSTANCIA_SANCION",
    "valor": "CONSTANCIA SANCIÓN"
  },
  {
    "clave": "CONSTANCIA_INHABILITACION",
    "valor": "CONSTANCIA INHABILITACIÓN"
  },
  {
    "clave": "CONSTANCIA_ABSTENCION",
    "valor": "CONSTANCIA ABSTENCIÓN"
  }
]