[
    {
        "id": 1,
        "nombre": "SECRETARIA EJECUTIVA DEL SISTEMA ESTATAL ANTICORRUPCION",
        "siglas": "SESEABCS"
    },
    {
        "id": 91,
        "nombre": "H. AYUNTAMIENTO DE LA PAZ",
        "siglas": "AYUNTALPZ"
    },
    {
        "id": 94,
        "nombre": "H. AYUNTAMIENTO DE LORETO",
        "siglas": "AYUNTALTO"
    },
    {
        "id": 95,
        "nombre": "ORGANISMO OPERADOR MUNICIPAL DEL SISTEMA DE AGUA POTABLE, ALCANTARILLADO Y SANEAMIENTO DE LA PAZ",
        "siglas": "OOMSAPAS"
    },
    {
        "id": 96,
        "nombre": "COMISION ESTATAL DE LOS DERECHOS HUMANOS DE BAJA CALIFORNIA SUR",
        "siglas": "CEDHBCS"
    },
    {
        "id": 97,
        "nombre": "INSTITUTO DE TRANSPARENCIA ACCESO A LA INFORMACION PUBLICA Y PROTECCION DE DATOS PERSONALES DEL ESTADO DE BAJA CALIFORNIA SUR",
        "siglas": "ITAIBCS"
    },
    {
        "id": 98,
        "nombre": "TRIBUNAL ESTATAL ELECTORAL DE BAJA CALIFORNIA SUR",
        "siglas": "TEEBCS"
    },
    {
        "id": 99,
        "nombre": "AUDITORIA SUPERIOR DEL ESTADO DE BAJA CALIFORNIA SUR",
        "siglas": "ASEBCS"
    },
    {
        "id": 100,
        "nombre": "H. CONGRESO DEL ESTADO DE BAJA CALIFORNIA SUR",
        "siglas": "CBCS"
    },
    {
        "id": 101,
        "nombre": "TRIBUNAL DE JUSTICIA ADMINISTRATIVA DEL ESTADO DE BAJA CALIFORNIA SUR",
        "siglas": "TJABCS"
    },
    {
        "id": 102,
        "nombre": "CONTRALORIA GENERAL DEL ESTADO DE BAJA CALIFORNIA SUR",
        "siglas": "CGBCS"
    },
    {
        "id": 103,
        "nombre": "PODER JUDICIAL DEL ESTADO DE BAJA CALIFORNIA SUR",
        "siglas": "PJEBCS"
    },
    {
        "id": 104,
        "nombre": "H. AYUNTAMIENTO DE COMONDU",
        "siglas": "AYUNTACMD"
    }
]