[
  {
    "clave": "NAD",
    "valor": "NEGLIGENCIA ADMINISTRATIVA"
  },
  {
    "clave": "VPC",
    "valor": "VIOLACIÓN PROCEDIMIENTOS DE CONTRATACIÓN"
  },
  {
    "clave": "VLNP",
    "valor": "VIOLACIÓN LEYES Y NORMATIVIDAD PRESUPUESTAL"
  },
  {
    "clave": "AUT",
    "valor": "ABUSO DE AUTORIDAD"
  },
  {
    "clave": "CEX",
    "valor": "COHECHO O EXTORSION"
  },
  {
    "clave": "IDSP",
    "valor": "INCUMPLIMIENTO EN DECLARACION DE SITUACION PATRIMONIAL"
  },
  {
    "clave": "DCSP",
    "valor": "DELITO COMETIDO POR SERVIDORES PUBLICOS"
  },
  {
    "clave": "EIFM",
    "valor": "EJERCICIO INDEBIDO DE SUS FUNCIONES EN MATERIA MIGRATORIA"
  },
  {
    "clave": "VDH",
    "valor": "VIOLACIÓN A LOS DERECHOS HUMANOS"
  },
  {
    "clave": "AG",
    "valor": "ADMINISTRATIVA GRAVE"
  },
  {
    "clave": "ANG",
    "valor": "ADMINISTRATIVA NO GRAVE"
  },
  {
    "clave": "AC",
    "valor": "ACTO DE CORRUPCIÓN"
  },
  {
    "clave": "HSEX",
    "valor": "COMETER O TOLERAR CONDUCTAS DE HOSTIGAMIENTO SEXUAL"
  },
  {
    "clave": "ASEX",
    "valor": "COMETER O TOLERAR CONDUCTAS DE ACOSO SEXUAL"
  },
  {
    "clave": "PEC",
    "valor": "PECULADO"
  },
  {
    "clave": "DRP",
    "valor": "DESVÍO DE RECURSOS PÚBLICOS"
  },
  {
    "clave": "UII",
    "valor": "UTILIZACIÓN INDEBIDA DE INFORMACIÓN"
  },
  {
    "clave": "AFN",
    "valor": "ABUSO DE FUNCIONES"
  },
  {
    "clave": "ABCI",
    "valor": "ACTUACIÓN BAJO CONFLICTO DE INTERÉS"
  },
  {
    "clave": "CIND",
    "valor": "CONTRATACIÓN INDEBIDA"
  },
  {
    "clave": "EOCI",
    "valor": "ENRIQUECIMIENTO OCULTO U OCULTAMIENTO DE CONFLICTO DE INTERÉS"
  },
  {
    "clave": "TINF",
    "valor": "TRÁFICO DE INFLUENCIAS"
  },
  {
    "clave": "ENCB",
    "valor": "ENCUBRIMIENTO"
  },
  {
    "clave": "DSCT",
    "valor": "DESACATO"
  },
  {
    "clave": "OJUST",
    "valor": "OBSTRUCCIÓN DE LA JUSTICIA"
  },
  {
    "clave": "OTRO",
    "valor": "OTRO"
  }
]
