<?xml version="1.0" encoding="utf-8"?>
<!DOCTYPE eagle SYSTEM "eagle.dtd">
<eagle version="9.0.1">
<drawing>
<settings>
<setting alwaysvectorfont="no"/>
<setting verticaltext="up"/>
</settings>
<grid distance="0.1" unitdist="inch" unit="mil" style="lines" multiple="1" display="no" altdistance="0.01" altunitdist="inch" altunit="inch"/>
<layers>
<layer number="1" name="Top" color="4" fill="1" visible="yes" active="yes"/>
<layer number="2" name="Route2" color="1" fill="3" visible="no" active="yes"/>
<layer number="3" name="Route3" color="4" fill="3" visible="no" active="yes"/>
<layer number="4" name="Route4" color="1" fill="4" visible="no" active="yes"/>
<layer number="5" name="Route5" color="4" fill="4" visible="no" active="yes"/>
<layer number="6" name="Route6" color="1" fill="8" visible="no" active="yes"/>
<layer number="7" name="Route7" color="4" fill="8" visible="no" active="yes"/>
<layer number="8" name="Route8" color="1" fill="2" visible="no" active="yes"/>
<layer number="9" name="Route9" color="4" fill="2" visible="no" active="yes"/>
<layer number="10" name="Route10" color="1" fill="7" visible="no" active="yes"/>
<layer number="11" name="Route11" color="4" fill="7" visible="no" active="yes"/>
<layer number="12" name="Route12" color="1" fill="5" visible="no" active="yes"/>
<layer number="13" name="Route13" color="4" fill="5" visible="no" active="yes"/>
<layer number="14" name="Route14" color="1" fill="6" visible="no" active="yes"/>
<layer number="15" name="Route15" color="4" fill="6" visible="no" active="yes"/>
<layer number="16" name="Bottom" color="1" fill="1" visible="yes" active="yes"/>
<layer number="17" name="Pads" color="2" fill="1" visible="yes" active="yes"/>
<layer number="18" name="Vias" color="2" fill="1" visible="yes" active="yes"/>
<layer number="19" name="Unrouted" color="6" fill="1" visible="yes" active="yes"/>
<layer number="20" name="Dimension" color="24" fill="1" visible="yes" active="yes"/>
<layer number="21" name="tPlace" color="7" fill="1" visible="yes" active="yes"/>
<layer number="22" name="bPlace" color="7" fill="1" visible="yes" active="yes"/>
<layer number="23" name="tOrigins" color="15" fill="1" visible="yes" active="yes"/>
<layer number="24" name="bOrigins" color="15" fill="1" visible="yes" active="yes"/>
<layer number="25" name="tNames" color="7" fill="1" visible="yes" active="yes"/>
<layer number="26" name="bNames" color="7" fill="1" visible="yes" active="yes"/>
<layer number="27" name="tValues" color="7" fill="1" visible="yes" active="yes"/>
<layer number="28" name="bValues" color="7" fill="1" visible="yes" active="yes"/>
<layer number="29" name="tStop" color="7" fill="3" visible="no" active="yes"/>
<layer number="30" name="bStop" color="7" fill="6" visible="no" active="yes"/>
<layer number="31" name="tCream" color="7" fill="4" visible="yes" active="yes"/>
<layer number="32" name="bCream" color="7" fill="5" visible="no" active="yes"/>
<layer number="33" name="tFinish" color="6" fill="3" visible="no" active="yes"/>
<layer number="34" name="bFinish" color="6" fill="6" visible="no" active="yes"/>
<layer number="35" name="tGlue" color="7" fill="4" visible="no" active="yes"/>
<layer number="36" name="bGlue" color="7" fill="5" visible="no" active="yes"/>
<layer number="37" name="tTest" color="7" fill="1" visible="no" active="yes"/>
<layer number="38" name="bTest" color="7" fill="1" visible="no" active="yes"/>
<layer number="39" name="tKeepout" color="4" fill="11" visible="yes" active="yes"/>
<layer number="40" name="bKeepout" color="1" fill="11" visible="yes" active="yes"/>
<layer number="41" name="tRestrict" color="4" fill="10" visible="yes" active="yes"/>
<layer number="42" name="bRestrict" color="1" fill="10" visible="yes" active="yes"/>
<layer number="43" name="vRestrict" color="2" fill="10" visible="yes" active="yes"/>
<layer number="44" name="Drills" color="7" fill="1" visible="no" active="yes"/>
<layer number="45" name="Holes" color="7" fill="1" visible="no" active="yes"/>
<layer number="46" name="Milling" color="3" fill="1" visible="no" active="yes"/>
<layer number="47" name="Measures" color="7" fill="1" visible="no" active="yes"/>
<layer number="48" name="Document" color="7" fill="1" visible="yes" active="yes"/>
<layer number="49" name="Reference" color="7" fill="1" visible="yes" active="yes"/>
<layer number="51" name="tDocu" color="7" fill="1" visible="yes" active="yes"/>
<layer number="52" name="bDocu" color="7" fill="1" visible="yes" active="yes"/>
<layer number="88" name="SimResults" color="9" fill="1" visible="yes" active="yes"/>
<layer number="89" name="SimProbes" color="9" fill="1" visible="yes" active="yes"/>
<layer number="90" name="Modules" color="5" fill="1" visible="yes" active="yes"/>
<layer number="91" name="Nets" color="2" fill="1" visible="yes" active="yes"/>
<layer number="92" name="Busses" color="1" fill="1" visible="yes" active="yes"/>
<layer number="93" name="Pins" color="2" fill="1" visible="yes" active="yes"/>
<layer number="94" name="Symbols" color="4" fill="1" visible="yes" active="yes"/>
<layer number="95" name="Names" color="7" fill="1" visible="yes" active="yes"/>
<layer number="96" name="Values" color="7" fill="1" visible="yes" active="yes"/>
<layer number="97" name="Info" color="7" fill="1" visible="yes" active="yes"/>
<layer number="98" name="Guide" color="6" fill="1" visible="yes" active="yes"/>
</layers>
<library>
<packages>
<package name="CP_8_27">
<smd name="1" x="-1.0024" y="0.75" dx="0.7048" dy="0.3" layer="1"/>
<smd name="2" x="-1.0024" y="0.25" dx="0.7048" dy="0.3" layer="1"/>
<smd name="3" x="-1.0024" y="-0.25" dx="0.7048" dy="0.3" layer="1"/>
<smd name="4" x="-1.0024" y="-0.75" dx="0.7048" dy="0.3" layer="1"/>
<smd name="5" x="1.0024" y="-0.75" dx="0.7048" dy="0.3" layer="1"/>
<smd name="6" x="1.0024" y="-0.25" dx="0.7048" dy="0.3" layer="1"/>
<smd name="7" x="1.0024" y="0.25" dx="0.7048" dy="0.3" layer="1"/>
<smd name="8" x="1.0024" y="0.75" dx="0.7048" dy="0.3" layer="1"/>
<smd name="9" x="0" y="0" dx="1" dy="1.5" layer="1" cream="no"/>
<polygon width="0.0254" layer="31">
<vertex x="-0.5" y="0.75"/>
<vertex x="-0.5" y="-0.75"/>
<vertex x="0.5" y="-0.75"/>
<vertex x="0.5" y="0.75"/>
</polygon>
<wire x1="-0.4064" y1="-1.1176" x2="0.4064" y2="-1.1176" width="0.1524" layer="21"/>
<wire x1="0.4064" y1="1.1176" x2="-0.4064" y2="1.1176" width="0.1524" layer="21"/>
<wire x1="-1.6764" y1="0.6858" x2="-1.6764" y2="0.8128" width="0.1524" layer="21" curve="-208"/>
<wire x1="-0.9906" y1="-0.9906" x2="0.9906" y2="-0.9906" width="0.1524" layer="51"/>
<wire x1="0.9906" y1="-0.9906" x2="0.9906" y2="0.9906" width="0.1524" layer="51"/>
<wire x1="0.9906" y1="0.9906" x2="0.3048" y2="0.9906" width="0.1524" layer="51"/>
<wire x1="0.3048" y1="0.9906" x2="-0.3048" y2="0.9906" width="0.1524" layer="51"/>
<wire x1="-0.3048" y1="0.9906" x2="-0.9906" y2="0.9906" width="0.1524" layer="51"/>
<wire x1="-0.9906" y1="0.9906" x2="-0.9906" y2="-0.9906" width="0.1524" layer="51"/>
<wire x1="0.3048" y1="0.9906" x2="-0.3048" y2="0.9906" width="0.1524" layer="51" curve="-180"/>
<text x="-3.2766" y="-0.635" size="1.27" layer="25" ratio="6" rot="SR0">&gt;Name</text>
</package>
<package name="CP_8_27-M">
<smd name="1" x="-1.0532" y="0.75" dx="0.8064" dy="0.3" layer="1"/>
<smd name="2" x="-1.0532" y="0.25" dx="0.8064" dy="0.3" layer="1"/>
<smd name="3" x="-1.0532" y="-0.25" dx="0.8064" dy="0.3" layer="1"/>
<smd name="4" x="-1.0532" y="-0.75" dx="0.8064" dy="0.3" layer="1"/>
<smd name="5" x="1.0532" y="-0.75" dx="0.8064" dy="0.3" layer="1"/>
<smd name="6" x="1.0532" y="-0.25" dx="0.8064" dy="0.3" layer="1"/>
<smd name="7" x="1.0532" y="0.25" dx="0.8064" dy="0.3" layer="1"/>
<smd name="8" x="1.0532" y="0.75" dx="0.8064" dy="0.3" layer="1"/>
<smd name="9" x="0" y="0" dx="1" dy="1.5" layer="1" cream="no"/>
<polygon width="0.0254" layer="31">
<vertex x="-0.5" y="0.75"/>
<vertex x="-0.5" y="-0.75"/>
<vertex x="0.5" y="-0.75"/>
<vertex x="0.5" y="0.75"/>
</polygon>
<wire x1="-0.4064" y1="-1.1176" x2="0.4064" y2="-1.1176" width="0.1524" layer="21"/>
<wire x1="0.4064" y1="1.1176" x2="-0.4064" y2="1.1176" width="0.1524" layer="21"/>
<wire x1="-1.778" y1="0.6858" x2="-1.778" y2="0.8128" width="0.1524" layer="21" curve="-208"/>
<wire x1="-0.9906" y1="-0.9906" x2="0.9906" y2="-0.9906" width="0.1524" layer="51"/>
<wire x1="0.9906" y1="-0.9906" x2="0.9906" y2="0.9906" width="0.1524" layer="51"/>
<wire x1="0.9906" y1="0.9906" x2="0.3048" y2="0.9906" width="0.1524" layer="51"/>
<wire x1="0.3048" y1="0.9906" x2="-0.3048" y2="0.9906" width="0.1524" layer="51"/>
<wire x1="-0.3048" y1="0.9906" x2="-0.9906" y2="0.9906" width="0.1524" layer="51"/>
<wire x1="-0.9906" y1="0.9906" x2="-0.9906" y2="-0.9906" width="0.1524" layer="51"/>
<wire x1="0.3048" y1="0.9906" x2="-0.3048" y2="0.9906" width="0.1524" layer="51" curve="-180"/>
<text x="-3.2766" y="-0.635" size="1.27" layer="25" ratio="6" rot="SR0">&gt;Name</text>
</package>
<package name="CP_8_27-L">
<smd name="1" x="-0.9516" y="0.75" dx="0.6032" dy="0.3" layer="1"/>
<smd name="2" x="-0.9516" y="0.25" dx="0.6032" dy="0.3" layer="1"/>
<smd name="3" x="-0.9516" y="-0.25" dx="0.6032" dy="0.3" layer="1"/>
<smd name="4" x="-0.9516" y="-0.75" dx="0.6032" dy="0.3" layer="1"/>
<smd name="5" x="0.9516" y="-0.75" dx="0.6032" dy="0.3" layer="1"/>
<smd name="6" x="0.9516" y="-0.25" dx="0.6032" dy="0.3" layer="1"/>
<smd name="7" x="0.9516" y="0.25" dx="0.6032" dy="0.3" layer="1"/>
<smd name="8" x="0.9516" y="0.75" dx="0.6032" dy="0.3" layer="1"/>
<smd name="9" x="0" y="0" dx="1" dy="1.5" layer="1" cream="no"/>
<polygon width="0.0254" layer="31">
<vertex x="-0.5" y="0.75"/>
<vertex x="-0.5" y="-0.75"/>
<vertex x="0.5" y="-0.75"/>
<vertex x="0.5" y="0.75"/>
</polygon>
<wire x1="-0.4064" y1="-1.1176" x2="0.4064" y2="-1.1176" width="0.1524" layer="21"/>
<wire x1="0.4064" y1="1.1176" x2="-0.4064" y2="1.1176" width="0.1524" layer="21"/>
<wire x1="-1.5748" y1="0.6858" x2="-1.5748" y2="0.8128" width="0.1524" layer="21" curve="-208"/>
<wire x1="-0.9906" y1="-0.9906" x2="0.9906" y2="-0.9906" width="0.1524" layer="51"/>
<wire x1="0.9906" y1="-0.9906" x2="0.9906" y2="0.9906" width="0.1524" layer="51"/>
<wire x1="0.9906" y1="0.9906" x2="0.3048" y2="0.9906" width="0.1524" layer="51"/>
<wire x1="0.3048" y1="0.9906" x2="-0.3048" y2="0.9906" width="0.1524" layer="51"/>
<wire x1="-0.3048" y1="0.9906" x2="-0.9906" y2="0.9906" width="0.1524" layer="51"/>
<wire x1="-0.9906" y1="0.9906" x2="-0.9906" y2="-0.9906" width="0.1524" layer="51"/>
<wire x1="0.3048" y1="0.9906" x2="-0.3048" y2="0.9906" width="0.1524" layer="51" curve="-180"/>
<text x="-3.2766" y="-0.635" size="1.27" layer="25" ratio="6" rot="SR0">&gt;Name</text>
</package>
</packages>
<symbols>
<symbol name="ADP7185ACPZN-R7">
<pin name="VOUT" x="2.54" y="0" length="middle" direction="pas"/>
<pin name="SENSE" x="2.54" y="-2.54" length="middle" direction="pas"/>
<pin name="VA" x="2.54" y="-5.08" length="middle" direction="pas"/>
<pin name="VAFB" x="2.54" y="-7.62" length="middle" direction="pas"/>
<pin name="EN" x="48.26" y="-7.62" length="middle" direction="pas" rot="R180"/>
<pin name="GND" x="48.26" y="-5.08" length="middle" direction="pas" rot="R180"/>
<pin name="VREG" x="48.26" y="-2.54" length="middle" direction="pas" rot="R180"/>
<pin name="VIN" x="48.26" y="0" length="middle" direction="pas" rot="R180"/>
<pin name="EP(GND)" x="48.26" y="5.08" length="middle" direction="pas" rot="R180"/>
<wire x1="7.62" y1="10.16" x2="7.62" y2="-12.7" width="0.1524" layer="94"/>
<wire x1="7.62" y1="-12.7" x2="43.18" y2="-12.7" width="0.1524" layer="94"/>
<wire x1="43.18" y1="-12.7" x2="43.18" y2="10.16" width="0.1524" layer="94"/>
<wire x1="43.18" y1="10.16" x2="7.62" y2="10.16" width="0.1524" layer="94"/>
<text x="20.6756" y="14.1986" size="2.0828" layer="95" ratio="6" rot="SR0">&gt;Name</text>
<text x="20.0406" y="11.6586" size="2.0828" layer="96" ratio="6" rot="SR0">&gt;Value</text>
</symbol>
</symbols>
<devicesets>
<deviceset name="ADP7185ACPZN-R7" prefix="U">
<gates>
<gate name="A" symbol="ADP7185ACPZN-R7" x="0" y="0"/>
</gates>
<devices>
<device name="" package="CP_8_27">
<connects>
<connect gate="A" pin="EN" pad="5"/>
<connect gate="A" pin="EP(GND)" pad="9"/>
<connect gate="A" pin="GND" pad="6"/>
<connect gate="A" pin="SENSE" pad="2"/>
<connect gate="A" pin="VA" pad="3"/>
<connect gate="A" pin="VAFB" pad="4"/>
<connect gate="A" pin="VIN" pad="8"/>
<connect gate="A" pin="VOUT" pad="1"/>
<connect gate="A" pin="VREG" pad="7"/>
</connects>
<technologies>
<technology name="">
<attribute name="MANUFACTURER_PART_NUMBER" value="ADP7185ACPZNR7" constant="no"/>
<attribute name="VENDOR" value="Analog Devices Inc" constant="no"/>
</technology>
</technologies>
</device>
<device name="CP_8_27-M" package="CP_8_27-M">
<connects>
<connect gate="A" pin="EN" pad="5"/>
<connect gate="A" pin="EP(GND)" pad="9"/>
<connect gate="A" pin="GND" pad="6"/>
<connect gate="A" pin="SENSE" pad="2"/>
<connect gate="A" pin="VA" pad="3"/>
<connect gate="A" pin="VAFB" pad="4"/>
<connect gate="A" pin="VIN" pad="8"/>
<connect gate="A" pin="VOUT" pad="1"/>
<connect gate="A" pin="VREG" pad="7"/>
</connects>
<technologies>
<technology name="">
<attribute name="MANUFACTURER_PART_NUMBER" value="ADP7185ACPZNR7" constant="no"/>
<attribute name="VENDOR" value="Analog Devices Inc" constant="no"/>
</technology>
</technologies>
</device>
<device name="CP_8_27-L" package="CP_8_27-L">
<connects>
<connect gate="A" pin="EN" pad="5"/>
<connect gate="A" pin="EP(GND)" pad="9"/>
<connect gate="A" pin="GND" pad="6"/>
<connect gate="A" pin="SENSE" pad="2"/>
<connect gate="A" pin="VA" pad="3"/>
<connect gate="A" pin="VAFB" pad="4"/>
<connect gate="A" pin="VIN" pad="8"/>
<connect gate="A" pin="VOUT" pad="1"/>
<connect gate="A" pin="VREG" pad="7"/>
</connects>
<technologies>
<technology name="">
<attribute name="MANUFACTURER_PART_NUMBER" value="ADP7185ACPZNR7" constant="no"/>
<attribute name="VENDOR" value="Analog Devices Inc" constant="no"/>
</technology>
</technologies>
</device>
</devices>
</deviceset>
</devicesets>
</library>
</drawing>
</eagle>
