<?xml version="1.0" encoding="utf-8"?>
<!DOCTYPE eagle SYSTEM "eagle.dtd">
<eagle version="9.0.1">
<drawing>
<settings>
<setting alwaysvectorfont="no"/>
<setting keepoldvectorfont="yes"/>
<setting verticaltext="up"/>
</settings>
<grid distance="0.1" unitdist="inch" unit="inch" style="lines" multiple="1" display="no" altdistance="0.01" altunitdist="inch" altunit="inch"/>
<layers>
<layer number="1" name="Top" color="4" fill="1" visible="yes" active="yes"/>
<layer number="2" name="Route2" color="1" fill="3" visible="no" active="no"/>
<layer number="3" name="Route3" color="4" fill="3" visible="no" active="no"/>
<layer number="4" name="Route4" color="1" fill="4" visible="no" active="no"/>
<layer number="5" name="Route5" color="4" fill="4" visible="no" active="no"/>
<layer number="6" name="Route6" color="1" fill="8" visible="no" active="no"/>
<layer number="7" name="Route7" color="4" fill="8" visible="no" active="no"/>
<layer number="8" name="Route8" color="1" fill="2" visible="no" active="no"/>
<layer number="9" name="Route9" color="4" fill="2" visible="no" active="no"/>
<layer number="10" name="Route10" color="1" fill="7" visible="no" active="no"/>
<layer number="11" name="Route11" color="4" fill="7" visible="no" active="no"/>
<layer number="12" name="Route12" color="1" fill="5" visible="no" active="no"/>
<layer number="13" name="Route13" color="4" fill="5" visible="no" active="no"/>
<layer number="14" name="Route14" color="1" fill="6" visible="no" active="no"/>
<layer number="15" name="Route15" color="4" fill="6" visible="no" active="no"/>
<layer number="16" name="Bottom" color="1" fill="1" visible="yes" active="yes"/>
<layer number="17" name="Pads" color="2" fill="1" visible="yes" active="yes"/>
<layer number="18" name="Vias" color="2" fill="1" visible="yes" active="yes"/>
<layer number="19" name="Unrouted" color="6" fill="1" visible="yes" active="yes"/>
<layer number="20" name="Dimension" color="15" fill="1" visible="yes" active="yes"/>
<layer number="21" name="tPlace" color="7" fill="1" visible="yes" active="yes"/>
<layer number="22" name="bPlace" color="7" fill="1" visible="yes" active="yes"/>
<layer number="23" name="tOrigins" color="15" fill="1" visible="yes" active="yes"/>
<layer number="24" name="bOrigins" color="15" fill="1" visible="yes" active="yes"/>
<layer number="25" name="tNames" color="7" fill="1" visible="yes" active="yes"/>
<layer number="26" name="bNames" color="7" fill="1" visible="yes" active="yes"/>
<layer number="27" name="tValues" color="7" fill="1" visible="yes" active="yes"/>
<layer number="28" name="bValues" color="7" fill="1" visible="yes" active="yes"/>
<layer number="29" name="tStop" color="7" fill="3" visible="no" active="yes"/>
<layer number="30" name="bStop" color="7" fill="6" visible="no" active="yes"/>
<layer number="31" name="tCream" color="7" fill="4" visible="no" active="yes"/>
<layer number="32" name="bCream" color="7" fill="5" visible="no" active="yes"/>
<layer number="33" name="tFinish" color="6" fill="3" visible="no" active="yes"/>
<layer number="34" name="bFinish" color="6" fill="6" visible="no" active="yes"/>
<layer number="35" name="tGlue" color="7" fill="4" visible="no" active="yes"/>
<layer number="36" name="bGlue" color="7" fill="5" visible="no" active="yes"/>
<layer number="37" name="tTest" color="7" fill="1" visible="no" active="yes"/>
<layer number="38" name="bTest" color="7" fill="1" visible="no" active="yes"/>
<layer number="39" name="tKeepout" color="4" fill="11" visible="yes" active="yes"/>
<layer number="40" name="bKeepout" color="1" fill="11" visible="yes" active="yes"/>
<layer number="41" name="tRestrict" color="4" fill="10" visible="yes" active="yes"/>
<layer number="42" name="bRestrict" color="1" fill="10" visible="yes" active="yes"/>
<layer number="43" name="vRestrict" color="2" fill="10" visible="yes" active="yes"/>
<layer number="44" name="Drills" color="7" fill="1" visible="no" active="yes"/>
<layer number="45" name="Holes" color="7" fill="1" visible="no" active="yes"/>
<layer number="46" name="Milling" color="3" fill="1" visible="no" active="yes"/>
<layer number="47" name="Measures" color="7" fill="1" visible="no" active="yes"/>
<layer number="48" name="Document" color="7" fill="1" visible="yes" active="yes"/>
<layer number="49" name="Reference" color="7" fill="1" visible="yes" active="yes"/>
<layer number="51" name="tDocu" color="7" fill="1" visible="yes" active="yes"/>
<layer number="52" name="bDocu" color="7" fill="1" visible="yes" active="yes"/>
<layer number="88" name="SimResults" color="9" fill="1" visible="yes" active="yes"/>
<layer number="89" name="SimProbes" color="9" fill="1" visible="yes" active="yes"/>
<layer number="90" name="Modules" color="5" fill="1" visible="yes" active="yes"/>
<layer number="91" name="Nets" color="2" fill="1" visible="yes" active="yes"/>
<layer number="92" name="Busses" color="1" fill="1" visible="yes" active="yes"/>
<layer number="93" name="Pins" color="2" fill="1" visible="no" active="yes"/>
<layer number="94" name="Symbols" color="4" fill="1" visible="yes" active="yes"/>
<layer number="95" name="Names" color="7" fill="1" visible="yes" active="yes"/>
<layer number="96" name="Values" color="7" fill="1" visible="yes" active="yes"/>
<layer number="97" name="Info" color="7" fill="1" visible="yes" active="yes"/>
<layer number="98" name="Guide" color="6" fill="1" visible="yes" active="yes"/>
</layers>
<library>
<description>&lt;Dual 10MHz OpAmp,MCP6292-E/MS&lt;/b&gt;&lt;p&gt;
&lt;author&gt;Created by SamacSys&lt;/author&gt;</description>
<packages>
<package name="SOP65P490X110-8N">
<description>&lt;b&gt;8 Lead MS MSOP&lt;/b&gt;&lt;br&gt;
</description>
<smd name="1" x="-2.2" y="0.975" dx="1.4" dy="0.45" layer="1"/>
<smd name="2" x="-2.2" y="0.325" dx="1.4" dy="0.45" layer="1"/>
<smd name="3" x="-2.2" y="-0.325" dx="1.4" dy="0.45" layer="1"/>
<smd name="4" x="-2.2" y="-0.975" dx="1.4" dy="0.45" layer="1"/>
<smd name="5" x="2.2" y="-0.975" dx="1.4" dy="0.45" layer="1"/>
<smd name="6" x="2.2" y="-0.325" dx="1.4" dy="0.45" layer="1"/>
<smd name="7" x="2.2" y="0.325" dx="1.4" dy="0.45" layer="1"/>
<smd name="8" x="2.2" y="0.975" dx="1.4" dy="0.45" layer="1"/>
<text x="0" y="0" size="1.27" layer="25" align="center">&gt;NAME</text>
<text x="0" y="0" size="1.27" layer="27" align="center">&gt;VALUE</text>
<wire x1="-3.15" y1="1.75" x2="3.15" y2="1.75" width="0.05" layer="51"/>
<wire x1="3.15" y1="1.75" x2="3.15" y2="-1.75" width="0.05" layer="51"/>
<wire x1="3.15" y1="-1.75" x2="-3.15" y2="-1.75" width="0.05" layer="51"/>
<wire x1="-3.15" y1="-1.75" x2="-3.15" y2="1.75" width="0.05" layer="51"/>
<wire x1="-1.5" y1="1.5" x2="1.5" y2="1.5" width="0.1" layer="51"/>
<wire x1="1.5" y1="1.5" x2="1.5" y2="-1.5" width="0.1" layer="51"/>
<wire x1="1.5" y1="-1.5" x2="-1.5" y2="-1.5" width="0.1" layer="51"/>
<wire x1="-1.5" y1="-1.5" x2="-1.5" y2="1.5" width="0.1" layer="51"/>
<wire x1="-1.5" y1="0.85" x2="-0.85" y2="1.5" width="0.1" layer="51"/>
<wire x1="-1.15" y1="1.5" x2="1.15" y2="1.5" width="0.2" layer="21"/>
<wire x1="1.15" y1="1.5" x2="1.15" y2="-1.5" width="0.2" layer="21"/>
<wire x1="1.15" y1="-1.5" x2="-1.15" y2="-1.5" width="0.2" layer="21"/>
<wire x1="-1.15" y1="-1.5" x2="-1.15" y2="1.5" width="0.2" layer="21"/>
<wire x1="-2.9" y1="1.55" x2="-1.5" y2="1.55" width="0.2" layer="21"/>
</package>
</packages>
<symbols>
<symbol name="MCP6292-E_MS">
<wire x1="5.08" y1="2.54" x2="25.4" y2="2.54" width="0.254" layer="94"/>
<wire x1="25.4" y1="-10.16" x2="25.4" y2="2.54" width="0.254" layer="94"/>
<wire x1="25.4" y1="-10.16" x2="5.08" y2="-10.16" width="0.254" layer="94"/>
<wire x1="5.08" y1="2.54" x2="5.08" y2="-10.16" width="0.254" layer="94"/>
<text x="26.67" y="7.62" size="1.778" layer="95" align="center-left">&gt;NAME</text>
<text x="26.67" y="5.08" size="1.778" layer="96" align="center-left">&gt;VALUE</text>
<pin name="VOUTA" x="0" y="0" length="middle" direction="out"/>
<pin name="VINA-" x="0" y="-2.54" length="middle" direction="in"/>
<pin name="VINA+" x="0" y="-5.08" length="middle" direction="in"/>
<pin name="VSS" x="0" y="-7.62" length="middle" direction="pwr"/>
<pin name="VDD" x="30.48" y="0" length="middle" direction="pwr" rot="R180"/>
<pin name="VOUTB" x="30.48" y="-2.54" length="middle" direction="out" rot="R180"/>
<pin name="VINB-" x="30.48" y="-5.08" length="middle" direction="in" rot="R180"/>
<pin name="VINB+" x="30.48" y="-7.62" length="middle" direction="in" rot="R180"/>
</symbol>
<symbol name="OPAMP_SEPARATE">
<pin name="VIN+" x="-10.16" y="-2.54" visible="off" length="middle" direction="in"/>
<pin name="VIN-" x="-10.16" y="2.54" visible="off" length="middle" direction="in"/>
<pin name="VOUT" x="12.7" y="0" visible="off" length="middle" direction="out" rot="R180"/>
<wire x1="-5.08" y1="7.62" x2="-5.08" y2="-7.62" width="0.4064" layer="94"/>
<text x="0.508" y="4.6482" size="2.0828" layer="95" ratio="10" rot="SR0">&gt;NAME</text>
<text x="0.9398" y="-6.0706" size="2.0828" layer="96" ratio="10" rot="SR0">&gt;VALUE</text>
<wire x1="-5.08" y1="-7.62" x2="7.62" y2="0" width="0.254" layer="94"/>
<wire x1="7.62" y1="0" x2="-5.08" y2="7.62" width="0.254" layer="94"/>
<wire x1="-5.08" y1="7.62" x2="-5.08" y2="-7.62" width="0.254" layer="94"/>
<wire x1="-3.81" y1="2.54" x2="-1.27" y2="2.54" width="0.254" layer="94"/>
<wire x1="-3.81" y1="-2.54" x2="-1.27" y2="-2.54" width="0.254" layer="94"/>
<wire x1="-2.54" y1="-1.27" x2="-2.54" y2="-3.81" width="0.254" layer="94"/>
</symbol>
<symbol name="PWR_SEPARATE">
<wire x1="-5.08" y1="5.08" x2="2.54" y2="5.08" width="0.254" layer="94"/>
<wire x1="2.54" y1="5.08" x2="2.54" y2="-7.62" width="0.254" layer="94"/>
<wire x1="2.54" y1="-7.62" x2="-5.08" y2="-7.62" width="0.254" layer="94"/>
<wire x1="-5.08" y1="-7.62" x2="-5.08" y2="5.08" width="0.254" layer="94"/>
<text x="0" y="-10.16" size="1.778" layer="94">&gt;VALUE</text>
<text x="0" y="5.08" size="1.778" layer="94">&gt;NAME</text>
<pin name="VSS" x="-10.16" y="-5.08" length="middle"/>
<pin name="VDD" x="-10.16" y="2.54" length="middle"/>
</symbol>
</symbols>
<devicesets>
<deviceset name="MCP6292-E_MS" prefix="IC">
<description>&lt;b&gt;Dual 10MHz OpAmp,MCP6292-E/MS&lt;/b&gt;&lt;p&gt;
Source: &lt;a href="http://docs-europe.electrocomponents.com/webdocs/1381/0900766b813813f3.pdf"&gt; Datasheet &lt;/a&gt;</description>
<gates>
<gate name="G$1" symbol="MCP6292-E_MS" x="0" y="0"/>
</gates>
<devices>
<device name="" package="SOP65P490X110-8N">
<connects>
<connect gate="G$1" pin="VDD" pad="8"/>
<connect gate="G$1" pin="VINA+" pad="3"/>
<connect gate="G$1" pin="VINA-" pad="2"/>
<connect gate="G$1" pin="VINB+" pad="5"/>
<connect gate="G$1" pin="VINB-" pad="6"/>
<connect gate="G$1" pin="VOUTA" pad="1"/>
<connect gate="G$1" pin="VOUTB" pad="7"/>
<connect gate="G$1" pin="VSS" pad="4"/>
</connects>
<technologies>
<technology name="">
<attribute name="ALLIED_NUMBER" value="70414242" constant="no"/>
<attribute name="ALLIED_PRICE/STOCK" value="http://www.alliedelec.com/microchip-technology-inc-mcp6292-e-ms/70414242/" constant="no"/>
<attribute name="ARROW_PART_NUMBER" value="MCP6292-E/MS" constant="no"/>
<attribute name="ARROW_PRICE/STOCK" value="https://www.arrow.com/en/products/mcp6292-ems/microchip-technology" constant="no"/>
<attribute name="DESCRIPTION" value="Dual 10MHz OpAmp,MCP6292-E/MS" constant="no"/>
<attribute name="HEIGHT" value="1.1mm" constant="no"/>
<attribute name="MANUFACTURER_NAME" value="Microchip" constant="no"/>
<attribute name="MANUFACTURER_PART_NUMBER" value="MCP6292-E/MS" constant="no"/>
<attribute name="RS_PART_NUMBER" value="1654790" constant="no"/>
<attribute name="RS_PRICE/STOCK" value="http://uk.rs-online.com/web/p/products/1654790" constant="no"/>
</technology>
</technologies>
</device>
</devices>
</deviceset>
<deviceset name="MCP6292-E/MS-SEPARATE">
<gates>
<gate name="A" symbol="OPAMP_SEPARATE" x="-99.06" y="25.4"/>
<gate name="B" symbol="OPAMP_SEPARATE" x="-99.06" y="2.54"/>
<gate name="C" symbol="PWR_SEPARATE" x="-5.08" y="20.32"/>
</gates>
<devices>
<device name="" package="SOP65P490X110-8N">
<connects>
<connect gate="A" pin="VIN+" pad="3"/>
<connect gate="A" pin="VIN-" pad="2"/>
<connect gate="A" pin="VOUT" pad="1"/>
<connect gate="B" pin="VIN+" pad="5"/>
<connect gate="B" pin="VIN-" pad="6"/>
<connect gate="B" pin="VOUT" pad="7"/>
<connect gate="C" pin="VDD" pad="8"/>
<connect gate="C" pin="VSS" pad="4"/>
</connects>
<technologies>
<technology name=""/>
</technologies>
</device>
</devices>
</deviceset>
</devicesets>
</library>
</drawing>
</eagle>
