(kicad_sch
	(version 20231120)
	(generator "eeschema")
	(generator_version "8.0")
	(uuid "4d0157cf-3901-477d-94c7-b55eb7a6f174")
	(paper "A4")
	(lib_symbols
		(symbol "Connector:Conn_01x08_Socket"
			(pin_names
				(offset 1.016) hide)
			(exclude_from_sim no)
			(in_bom yes)
			(on_board yes)
			(property "Reference" "J"
				(at 0 10.16 0)
				(effects
					(font
						(size 1.27 1.27)
					)
				)
			)
			(property "Value" "Conn_01x08_Socket"
				(at 0 -12.7 0)
				(effects
					(font
						(size 1.27 1.27)
					)
				)
			)
			(property "Footprint" ""
				(at 0 0 0)
				(effects
					(font
						(size 1.27 1.27)
					)
					(hide yes)
				)
			)
			(property "Datasheet" "~"
				(at 0 0 0)
				(effects
					(font
						(size 1.27 1.27)
					)
					(hide yes)
				)
			)
			(property "Description" "Generic connector, single row, 01x08, script generated"
				(at 0 0 0)
				(effects
					(font
						(size 1.27 1.27)
					)
					(hide yes)
				)
			)
			(property "ki_locked" ""
				(at 0 0 0)
				(effects
					(font
						(size 1.27 1.27)
					)
				)
			)
			(property "ki_keywords" "connector"
				(at 0 0 0)
				(effects
					(font
						(size 1.27 1.27)
					)
					(hide yes)
				)
			)
			(property "ki_fp_filters" "Connector*:*_1x??_*"
				(at 0 0 0)
				(effects
					(font
						(size 1.27 1.27)
					)
					(hide yes)
				)
			)
			(symbol "Conn_01x08_Socket_1_1"
				(arc
					(start 0 -9.652)
					(mid -0.5058 -10.16)
					(end 0 -10.668)
					(stroke
						(width 0.1524)
						(type default)
					)
					(fill
						(type none)
					)
				)
				(arc
					(start 0 -7.112)
					(mid -0.5058 -7.62)
					(end 0 -8.128)
					(stroke
						(width 0.1524)
						(type default)
					)
					(fill
						(type none)
					)
				)
				(arc
					(start 0 -4.572)
					(mid -0.5058 -5.08)
					(end 0 -5.588)
					(stroke
						(width 0.1524)
						(type default)
					)
					(fill
						(type none)
					)
				)
				(arc
					(start 0 -2.032)
					(mid -0.5058 -2.54)
					(end 0 -3.048)
					(stroke
						(width 0.1524)
						(type default)
					)
					(fill
						(type none)
					)
				)
				(polyline
					(pts
						(xy -1.27 -10.16) (xy -0.508 -10.16)
					)
					(stroke
						(width 0.1524)
						(type default)
					)
					(fill
						(type none)
					)
				)
				(polyline
					(pts
						(xy -1.27 -7.62) (xy -0.508 -7.62)
					)
					(stroke
						(width 0.1524)
						(type default)
					)
					(fill
						(type none)
					)
				)
				(polyline
					(pts
						(xy -1.27 -5.08) (xy -0.508 -5.08)
					)
					(stroke
						(width 0.1524)
						(type default)
					)
					(fill
						(type none)
					)
				)
				(polyline
					(pts
						(xy -1.27 -2.54) (xy -0.508 -2.54)
					)
					(stroke
						(width 0.1524)
						(type default)
					)
					(fill
						(type none)
					)
				)
				(polyline
					(pts
						(xy -1.27 0) (xy -0.508 0)
					)
					(stroke
						(width 0.1524)
						(type default)
					)
					(fill
						(type none)
					)
				)
				(polyline
					(pts
						(xy -1.27 2.54) (xy -0.508 2.54)
					)
					(stroke
						(width 0.1524)
						(type default)
					)
					(fill
						(type none)
					)
				)
				(polyline
					(pts
						(xy -1.27 5.08) (xy -0.508 5.08)
					)
					(stroke
						(width 0.1524)
						(type default)
					)
					(fill
						(type none)
					)
				)
				(polyline
					(pts
						(xy -1.27 7.62) (xy -0.508 7.62)
					)
					(stroke
						(width 0.1524)
						(type default)
					)
					(fill
						(type none)
					)
				)
				(arc
					(start 0 0.508)
					(mid -0.5058 0)
					(end 0 -0.508)
					(stroke
						(width 0.1524)
						(type default)
					)
					(fill
						(type none)
					)
				)
				(arc
					(start 0 3.048)
					(mid -0.5058 2.54)
					(end 0 2.032)
					(stroke
						(width 0.1524)
						(type default)
					)
					(fill
						(type none)
					)
				)
				(arc
					(start 0 5.588)
					(mid -0.5058 5.08)
					(end 0 4.572)
					(stroke
						(width 0.1524)
						(type default)
					)
					(fill
						(type none)
					)
				)
				(arc
					(start 0 8.128)
					(mid -0.5058 7.62)
					(end 0 7.112)
					(stroke
						(width 0.1524)
						(type default)
					)
					(fill
						(type none)
					)
				)
				(pin passive line
					(at -5.08 7.62 0)
					(length 3.81)
					(name "Pin_1"
						(effects
							(font
								(size 1.27 1.27)
							)
						)
					)
					(number "1"
						(effects
							(font
								(size 1.27 1.27)
							)
						)
					)
				)
				(pin passive line
					(at -5.08 5.08 0)
					(length 3.81)
					(name "Pin_2"
						(effects
							(font
								(size 1.27 1.27)
							)
						)
					)
					(number "2"
						(effects
							(font
								(size 1.27 1.27)
							)
						)
					)
				)
				(pin passive line
					(at -5.08 2.54 0)
					(length 3.81)
					(name "Pin_3"
						(effects
							(font
								(size 1.27 1.27)
							)
						)
					)
					(number "3"
						(effects
							(font
								(size 1.27 1.27)
							)
						)
					)
				)
				(pin passive line
					(at -5.08 0 0)
					(length 3.81)
					(name "Pin_4"
						(effects
							(font
								(size 1.27 1.27)
							)
						)
					)
					(number "4"
						(effects
							(font
								(size 1.27 1.27)
							)
						)
					)
				)
				(pin passive line
					(at -5.08 -2.54 0)
					(length 3.81)
					(name "Pin_5"
						(effects
							(font
								(size 1.27 1.27)
							)
						)
					)
					(number "5"
						(effects
							(font
								(size 1.27 1.27)
							)
						)
					)
				)
				(pin passive line
					(at -5.08 -5.08 0)
					(length 3.81)
					(name "Pin_6"
						(effects
							(font
								(size 1.27 1.27)
							)
						)
					)
					(number "6"
						(effects
							(font
								(size 1.27 1.27)
							)
						)
					)
				)
				(pin passive line
					(at -5.08 -7.62 0)
					(length 3.81)
					(name "Pin_7"
						(effects
							(font
								(size 1.27 1.27)
							)
						)
					)
					(number "7"
						(effects
							(font
								(size 1.27 1.27)
							)
						)
					)
				)
				(pin passive line
					(at -5.08 -10.16 0)
					(length 3.81)
					(name "Pin_8"
						(effects
							(font
								(size 1.27 1.27)
							)
						)
					)
					(number "8"
						(effects
							(font
								(size 1.27 1.27)
							)
						)
					)
				)
			)
		)
		(symbol "Daniel:48LM01T-I_SM"
			(pin_names
				(offset 0.762)
			)
			(exclude_from_sim no)
			(in_bom yes)
			(on_board yes)
			(property "Reference" "IC?"
				(at 0 15.24 0)
				(effects
					(font
						(size 1.27 1.27)
					)
				)
			)
			(property "Value" "48LM01T-I_SM"
				(at 5.08 12.7 0)
				(effects
					(font
						(size 1.27 1.27)
					)
				)
			)
			(property "Footprint" "SOIC127P794X203-8N"
				(at 46.99 -7.62 0)
				(effects
					(font
						(size 1.27 1.27)
					)
					(justify left)
					(hide yes)
				)
			)
			(property "Datasheet" "http://ww1.microchip.com/downloads/en/DeviceDoc/20006008C.pdf"
				(at 46.99 -10.16 0)
				(effects
					(font
						(size 1.27 1.27)
					)
					(justify left)
					(hide yes)
				)
			)
			(property "Description" "SRAM Serial SRAM with Nonvolatile bits, 1M bit SPI"
				(at 46.99 -12.7 0)
				(effects
					(font
						(size 1.27 1.27)
					)
					(justify left)
					(hide yes)
				)
			)
			(property "Height" "2.03"
				(at 46.99 -15.24 0)
				(effects
					(font
						(size 1.27 1.27)
					)
					(justify left)
					(hide yes)
				)
			)
			(property "Mouser Part Number" "579-48LM01T-I/SM"
				(at 46.99 -17.78 0)
				(effects
					(font
						(size 1.27 1.27)
					)
					(justify left)
					(hide yes)
				)
			)
			(property "Mouser Price/Stock" "https://www.mouser.co.uk/ProductDetail/Microchip-Technology/48LM01T-I-SM?qs=wnTfsH77Xs6yLtUXRf3vrg%3D%3D"
				(at 46.99 -20.32 0)
				(effects
					(font
						(size 1.27 1.27)
					)
					(justify left)
					(hide yes)
				)
			)
			(property "Manufacturer_Name" "Microchip"
				(at 46.99 -22.86 0)
				(effects
					(font
						(size 1.27 1.27)
					)
					(justify left)
					(hide yes)
				)
			)
			(property "Manufacturer_Part_Number" "48LM01T-I/SM"
				(at 46.99 -25.4 0)
				(effects
					(font
						(size 1.27 1.27)
					)
					(justify left)
					(hide yes)
				)
			)
			(symbol "48LM01T-I_SM_0_0"
				(pin passive line
					(at 0 5.08 0)
					(length 5.08)
					(name "~{CS}"
						(effects
							(font
								(size 1.27 1.27)
							)
						)
					)
					(number "1"
						(effects
							(font
								(size 1.27 1.27)
							)
						)
					)
				)
				(pin passive line
					(at 0 -2.54 0)
					(length 5.08)
					(name "SO"
						(effects
							(font
								(size 1.27 1.27)
							)
						)
					)
					(number "2"
						(effects
							(font
								(size 1.27 1.27)
							)
						)
					)
				)
				(pin passive line
					(at 12.7 -8.89 90)
					(length 5.08)
					(name "VCAP"
						(effects
							(font
								(size 1.27 1.27)
							)
						)
					)
					(number "3"
						(effects
							(font
								(size 1.27 1.27)
							)
						)
					)
				)
				(pin passive line
					(at 15.24 -8.89 90)
					(length 5.08)
					(name "VSS"
						(effects
							(font
								(size 1.27 1.27)
							)
						)
					)
					(number "4"
						(effects
							(font
								(size 1.27 1.27)
							)
						)
					)
				)
				(pin passive line
					(at 0 2.54 0)
					(length 5.08)
					(name "SI"
						(effects
							(font
								(size 1.27 1.27)
							)
						)
					)
					(number "5"
						(effects
							(font
								(size 1.27 1.27)
							)
						)
					)
				)
				(pin passive line
					(at 0 0 0)
					(length 5.08)
					(name "SCK"
						(effects
							(font
								(size 1.27 1.27)
							)
						)
					)
					(number "6"
						(effects
							(font
								(size 1.27 1.27)
							)
						)
					)
				)
				(pin passive line
					(at 0 7.62 0)
					(length 5.08)
					(name "~{HOLD}"
						(effects
							(font
								(size 1.27 1.27)
							)
						)
					)
					(number "7"
						(effects
							(font
								(size 1.27 1.27)
							)
						)
					)
				)
				(pin passive line
					(at 15.24 15.24 270)
					(length 5.08)
					(name "VCC"
						(effects
							(font
								(size 1.27 1.27)
							)
						)
					)
					(number "8"
						(effects
							(font
								(size 1.27 1.27)
							)
						)
					)
				)
			)
			(symbol "48LM01T-I_SM_0_1"
				(polyline
					(pts
						(xy 5.08 10.16) (xy 16.51 10.16) (xy 16.51 -3.81) (xy 5.08 -3.81) (xy 5.08 10.16)
					)
					(stroke
						(width 0.1524)
						(type default)
					)
					(fill
						(type none)
					)
				)
			)
		)
		(symbol "Device:C_Small"
			(pin_numbers hide)
			(pin_names
				(offset 0.254) hide)
			(exclude_from_sim no)
			(in_bom yes)
			(on_board yes)
			(property "Reference" "C"
				(at 0.254 1.778 0)
				(effects
					(font
						(size 1.27 1.27)
					)
					(justify left)
				)
			)
			(property "Value" "C_Small"
				(at 0.254 -2.032 0)
				(effects
					(font
						(size 1.27 1.27)
					)
					(justify left)
				)
			)
			(property "Footprint" ""
				(at 0 0 0)
				(effects
					(font
						(size 1.27 1.27)
					)
					(hide yes)
				)
			)
			(property "Datasheet" "~"
				(at 0 0 0)
				(effects
					(font
						(size 1.27 1.27)
					)
					(hide yes)
				)
			)
			(property "Description" "Unpolarized capacitor, small symbol"
				(at 0 0 0)
				(effects
					(font
						(size 1.27 1.27)
					)
					(hide yes)
				)
			)
			(property "ki_keywords" "capacitor cap"
				(at 0 0 0)
				(effects
					(font
						(size 1.27 1.27)
					)
					(hide yes)
				)
			)
			(property "ki_fp_filters" "C_*"
				(at 0 0 0)
				(effects
					(font
						(size 1.27 1.27)
					)
					(hide yes)
				)
			)
			(symbol "C_Small_0_1"
				(polyline
					(pts
						(xy -1.524 -0.508) (xy 1.524 -0.508)
					)
					(stroke
						(width 0.3302)
						(type default)
					)
					(fill
						(type none)
					)
				)
				(polyline
					(pts
						(xy -1.524 0.508) (xy 1.524 0.508)
					)
					(stroke
						(width 0.3048)
						(type default)
					)
					(fill
						(type none)
					)
				)
			)
			(symbol "C_Small_1_1"
				(pin passive line
					(at 0 2.54 270)
					(length 2.032)
					(name "~"
						(effects
							(font
								(size 1.27 1.27)
							)
						)
					)
					(number "1"
						(effects
							(font
								(size 1.27 1.27)
							)
						)
					)
				)
				(pin passive line
					(at 0 -2.54 90)
					(length 2.032)
					(name "~"
						(effects
							(font
								(size 1.27 1.27)
							)
						)
					)
					(number "2"
						(effects
							(font
								(size 1.27 1.27)
							)
						)
					)
				)
			)
		)
		(symbol "Memory_RAM:ESP-PSRAM32"
			(exclude_from_sim no)
			(in_bom yes)
			(on_board yes)
			(property "Reference" "U"
				(at 3.81 11.43 0)
				(effects
					(font
						(size 1.27 1.27)
					)
				)
			)
			(property "Value" "ESP-PSRAM32"
				(at -1.27 -11.43 0)
				(effects
					(font
						(size 1.27 1.27)
					)
					(justify left)
				)
			)
			(property "Footprint" "Package_SO:SOIC-8_3.9x4.9mm_P1.27mm"
				(at 0 -15.24 0)
				(effects
					(font
						(size 1.27 1.27)
					)
					(hide yes)
				)
			)
			(property "Datasheet" "https://www.espressif.com/sites/default/files/documentation/esp-psram32_datasheet_en.pdf"
				(at -10.16 12.7 0)
				(effects
					(font
						(size 1.27 1.27)
					)
					(hide yes)
				)
			)
			(property "Description" "32 Mbit serial pseudo SRAM device organized as 4Mx8 bits, 1.8 VCC, SOIC8 (SOP8)"
				(at 0 0 0)
				(effects
					(font
						(size 1.27 1.27)
					)
					(hide yes)
				)
			)
			(property "ki_keywords" "32 Mbit serial pseudo SRAM MEMORY"
				(at 0 0 0)
				(effects
					(font
						(size 1.27 1.27)
					)
					(hide yes)
				)
			)
			(property "ki_fp_filters" "SOIC*3.9x4.9mm?P1.27mm*"
				(at 0 0 0)
				(effects
					(font
						(size 1.27 1.27)
					)
					(hide yes)
				)
			)
			(symbol "ESP-PSRAM32_0_1"
				(rectangle
					(start -7.62 10.16)
					(end 7.62 -10.16)
					(stroke
						(width 0.254)
						(type default)
					)
					(fill
						(type background)
					)
				)
			)
			(symbol "ESP-PSRAM32_1_1"
				(pin input line
					(at 10.16 7.62 180)
					(length 2.54)
					(name "~{CE}"
						(effects
							(font
								(size 1.27 1.27)
							)
						)
					)
					(number "1"
						(effects
							(font
								(size 1.27 1.27)
							)
						)
					)
				)
				(pin output line
					(at 10.16 -5.08 180)
					(length 2.54)
					(name "SO/SIO"
						(effects
							(font
								(size 1.27 1.27)
							)
						)
					)
					(number "2"
						(effects
							(font
								(size 1.27 1.27)
							)
						)
					)
				)
				(pin bidirectional line
					(at 10.16 0 180)
					(length 2.54)
					(name "SIO2"
						(effects
							(font
								(size 1.27 1.27)
							)
						)
					)
					(number "3"
						(effects
							(font
								(size 1.27 1.27)
							)
						)
					)
				)
				(pin power_in line
					(at -2.54 -12.7 90)
					(length 2.54)
					(name "VSS"
						(effects
							(font
								(size 1.27 1.27)
							)
						)
					)
					(number "4"
						(effects
							(font
								(size 1.27 1.27)
							)
						)
					)
				)
				(pin input line
					(at 10.16 -2.54 180)
					(length 2.54)
					(name "SI/SIO"
						(effects
							(font
								(size 1.27 1.27)
							)
						)
					)
					(number "5"
						(effects
							(font
								(size 1.27 1.27)
							)
						)
					)
				)
				(pin output line
					(at 10.16 5.08 180)
					(length 2.54)
					(name "SCLK"
						(effects
							(font
								(size 1.27 1.27)
							)
						)
					)
					(number "6"
						(effects
							(font
								(size 1.27 1.27)
							)
						)
					)
				)
				(pin bidirectional line
					(at 10.16 2.54 180)
					(length 2.54)
					(name "SIO3"
						(effects
							(font
								(size 1.27 1.27)
							)
						)
					)
					(number "7"
						(effects
							(font
								(size 1.27 1.27)
							)
						)
					)
				)
				(pin power_in line
					(at -2.54 12.7 270)
					(length 2.54)
					(name "VCC"
						(effects
							(font
								(size 1.27 1.27)
							)
						)
					)
					(number "8"
						(effects
							(font
								(size 1.27 1.27)
							)
						)
					)
				)
			)
		)
		(symbol "power:+3V3"
			(power)
			(pin_numbers hide)
			(pin_names
				(offset 0) hide)
			(exclude_from_sim no)
			(in_bom yes)
			(on_board yes)
			(property "Reference" "#PWR"
				(at 0 -3.81 0)
				(effects
					(font
						(size 1.27 1.27)
					)
					(hide yes)
				)
			)
			(property "Value" "+3V3"
				(at 0 3.556 0)
				(effects
					(font
						(size 1.27 1.27)
					)
				)
			)
			(property "Footprint" ""
				(at 0 0 0)
				(effects
					(font
						(size 1.27 1.27)
					)
					(hide yes)
				)
			)
			(property "Datasheet" ""
				(at 0 0 0)
				(effects
					(font
						(size 1.27 1.27)
					)
					(hide yes)
				)
			)
			(property "Description" "Power symbol creates a global label with name \"+3V3\""
				(at 0 0 0)
				(effects
					(font
						(size 1.27 1.27)
					)
					(hide yes)
				)
			)
			(property "ki_keywords" "global power"
				(at 0 0 0)
				(effects
					(font
						(size 1.27 1.27)
					)
					(hide yes)
				)
			)
			(symbol "+3V3_0_1"
				(polyline
					(pts
						(xy -0.762 1.27) (xy 0 2.54)
					)
					(stroke
						(width 0)
						(type default)
					)
					(fill
						(type none)
					)
				)
				(polyline
					(pts
						(xy 0 0) (xy 0 2.54)
					)
					(stroke
						(width 0)
						(type default)
					)
					(fill
						(type none)
					)
				)
				(polyline
					(pts
						(xy 0 2.54) (xy 0.762 1.27)
					)
					(stroke
						(width 0)
						(type default)
					)
					(fill
						(type none)
					)
				)
			)
			(symbol "+3V3_1_1"
				(pin power_in line
					(at 0 0 90)
					(length 0)
					(name "~"
						(effects
							(font
								(size 1.27 1.27)
							)
						)
					)
					(number "1"
						(effects
							(font
								(size 1.27 1.27)
							)
						)
					)
				)
			)
		)
		(symbol "power:GND"
			(power)
			(pin_numbers hide)
			(pin_names
				(offset 0) hide)
			(exclude_from_sim no)
			(in_bom yes)
			(on_board yes)
			(property "Reference" "#PWR"
				(at 0 -6.35 0)
				(effects
					(font
						(size 1.27 1.27)
					)
					(hide yes)
				)
			)
			(property "Value" "GND"
				(at 0 -3.81 0)
				(effects
					(font
						(size 1.27 1.27)
					)
				)
			)
			(property "Footprint" ""
				(at 0 0 0)
				(effects
					(font
						(size 1.27 1.27)
					)
					(hide yes)
				)
			)
			(property "Datasheet" ""
				(at 0 0 0)
				(effects
					(font
						(size 1.27 1.27)
					)
					(hide yes)
				)
			)
			(property "Description" "Power symbol creates a global label with name \"GND\" , ground"
				(at 0 0 0)
				(effects
					(font
						(size 1.27 1.27)
					)
					(hide yes)
				)
			)
			(property "ki_keywords" "global power"
				(at 0 0 0)
				(effects
					(font
						(size 1.27 1.27)
					)
					(hide yes)
				)
			)
			(symbol "GND_0_1"
				(polyline
					(pts
						(xy 0 0) (xy 0 -1.27) (xy 1.27 -1.27) (xy 0 -2.54) (xy -1.27 -1.27) (xy 0 -1.27)
					)
					(stroke
						(width 0)
						(type default)
					)
					(fill
						(type none)
					)
				)
			)
			(symbol "GND_1_1"
				(pin power_in line
					(at 0 0 270)
					(length 0)
					(name "~"
						(effects
							(font
								(size 1.27 1.27)
							)
						)
					)
					(number "1"
						(effects
							(font
								(size 1.27 1.27)
							)
						)
					)
				)
			)
		)
	)
	(junction
		(at 130.81 127)
		(diameter 0)
		(color 0 0 0 0)
		(uuid "30fd4bc2-057c-4fbf-b79a-58dca9afeba7")
	)
	(junction
		(at 133.35 115.57)
		(diameter 0)
		(color 0 0 0 0)
		(uuid "49d9ca2c-e1bd-4b4f-94e1-789306973602")
	)
	(wire
		(pts
			(xy 130.81 128.27) (xy 130.81 127)
		)
		(stroke
			(width 0)
			(type default)
		)
		(uuid "191cec21-8ab0-46b9-b018-fdebea939a19")
	)
	(wire
		(pts
			(xy 133.35 115.57) (xy 133.35 113.03)
		)
		(stroke
			(width 0)
			(type default)
		)
		(uuid "194f4e5f-b72c-4c8b-8e18-c08c9c33ee52")
	)
	(wire
		(pts
			(xy 234.95 109.22) (xy 238.76 109.22)
		)
		(stroke
			(width 0)
			(type default)
		)
		(uuid "27191c6f-c55a-4c34-85e2-70ec21dd7764")
	)
	(wire
		(pts
			(xy 130.81 113.03) (xy 130.81 127)
		)
		(stroke
			(width 0)
			(type default)
		)
		(uuid "3b46e510-d37c-44a9-ab48-8571c595642c")
	)
	(wire
		(pts
			(xy 130.81 127) (xy 133.35 127)
		)
		(stroke
			(width 0)
			(type default)
		)
		(uuid "3ccb948a-5d08-42be-8f40-071ee36d3c1f")
	)
	(wire
		(pts
			(xy 133.35 118.11) (xy 133.35 115.57)
		)
		(stroke
			(width 0)
			(type default)
		)
		(uuid "7c7a8593-dba3-42c1-8a69-a8e14b83adea")
	)
	(wire
		(pts
			(xy 234.95 106.68) (xy 238.76 106.68)
		)
		(stroke
			(width 0)
			(type default)
		)
		(uuid "bcf1d380-b1e7-48d4-9033-bb7f0a41645c")
	)
	(wire
		(pts
			(xy 133.35 115.57) (xy 147.32 115.57)
		)
		(stroke
			(width 0)
			(type default)
		)
		(uuid "ee56b996-bc7f-4275-883f-906440b5609e")
	)
	(wire
		(pts
			(xy 133.35 123.19) (xy 133.35 127)
		)
		(stroke
			(width 0)
			(type default)
		)
		(uuid "fc777433-2bb8-445d-b4d5-a6d1ee64068b")
	)
	(label "SCK"
		(at 146.05 104.14 0)
		(fields_autoplaced yes)
		(effects
			(font
				(size 1.27 1.27)
			)
			(justify left bottom)
		)
		(uuid "11518328-4b85-48ec-b513-5fa08fae2a8b")
	)
	(label "SI{slash}SIO0"
		(at 146.05 101.6 0)
		(fields_autoplaced yes)
		(effects
			(font
				(size 1.27 1.27)
			)
			(justify left bottom)
		)
		(uuid "183cf09d-5e5d-47bc-ab7f-454bcb2c9070")
	)
	(label "SCK"
		(at 238.76 114.3 180)
		(fields_autoplaced yes)
		(effects
			(font
				(size 1.27 1.27)
			)
			(justify right bottom)
		)
		(uuid "1a0ed7dd-ba8a-462c-bc59-3695db3e7baa")
	)
	(label "VCAP"
		(at 135.89 115.57 0)
		(fields_autoplaced yes)
		(effects
			(font
				(size 1.27 1.27)
			)
			(justify left bottom)
		)
		(uuid "235c56a3-bd5d-4e7c-bb58-bebc2267a5ef")
	)
	(label "SO{slash}SIO1"
		(at 146.05 106.68 0)
		(fields_autoplaced yes)
		(effects
			(font
				(size 1.27 1.27)
			)
			(justify left bottom)
		)
		(uuid "39912f6f-2a58-40d6-adf7-dac67aeb62cc")
	)
	(label "~{HOLD}{slash}SIO3"
		(at 238.76 124.46 180)
		(fields_autoplaced yes)
		(effects
			(font
				(size 1.27 1.27)
			)
			(justify right bottom)
		)
		(uuid "3ab216f3-6b55-4d09-9ea8-f3bdce54f1ef")
	)
	(label "SO{slash}SIO1"
		(at 238.76 119.38 180)
		(fields_autoplaced yes)
		(effects
			(font
				(size 1.27 1.27)
			)
			(justify right bottom)
		)
		(uuid "3fec8d2c-302a-4c21-b050-1b16066a04d5")
	)
	(label "~{CS}"
		(at 238.76 111.76 180)
		(fields_autoplaced yes)
		(effects
			(font
				(size 1.27 1.27)
			)
			(justify right bottom)
		)
		(uuid "96a7855d-3deb-473f-9132-634e19e4a9b0")
	)
	(label "~{CS}"
		(at 144.78 147.32 0)
		(fields_autoplaced yes)
		(effects
			(font
				(size 1.27 1.27)
			)
			(justify left bottom)
		)
		(uuid "97cad386-3fa3-4e8f-9080-35c48b766bb0")
	)
	(label "~{CS}"
		(at 146.05 99.06 0)
		(fields_autoplaced yes)
		(effects
			(font
				(size 1.27 1.27)
			)
			(justify left bottom)
		)
		(uuid "9ca2289c-01cf-4f48-8f9d-bc6c00bbfd08")
	)
	(label "SI{slash}SIO0"
		(at 144.78 157.48 0)
		(fields_autoplaced yes)
		(effects
			(font
				(size 1.27 1.27)
			)
			(justify left bottom)
		)
		(uuid "b4fa984f-e036-4d19-8aa4-f85ebea6f603")
	)
	(label "SCK"
		(at 144.78 149.86 0)
		(fields_autoplaced yes)
		(effects
			(font
				(size 1.27 1.27)
			)
			(justify left bottom)
		)
		(uuid "b9daf5d3-7114-42ba-ad59-963440c75d8b")
	)
	(label "SIO2"
		(at 238.76 121.92 180)
		(fields_autoplaced yes)
		(effects
			(font
				(size 1.27 1.27)
			)
			(justify right bottom)
		)
		(uuid "ba769ebf-ef31-4b4f-b102-168d8caf53b8")
	)
	(label "~{HOLD}{slash}SIO3"
		(at 144.78 152.4 0)
		(fields_autoplaced yes)
		(effects
			(font
				(size 1.27 1.27)
			)
			(justify left bottom)
		)
		(uuid "be96016a-791f-46d6-975b-69024fbaf704")
	)
	(label "SO{slash}SIO1"
		(at 144.78 160.02 0)
		(fields_autoplaced yes)
		(effects
			(font
				(size 1.27 1.27)
			)
			(justify left bottom)
		)
		(uuid "c03a0055-4f3e-4cd3-882a-7fa913297ab4")
	)
	(label "~{HOLD}{slash}SIO3"
		(at 146.05 96.52 0)
		(fields_autoplaced yes)
		(effects
			(font
				(size 1.27 1.27)
			)
			(justify left bottom)
		)
		(uuid "d0d69d43-8c64-4271-a53d-58881b938322")
	)
	(label "SIO2"
		(at 144.78 154.94 0)
		(fields_autoplaced yes)
		(effects
			(font
				(size 1.27 1.27)
			)
			(justify left bottom)
		)
		(uuid "d28a0d1f-748a-4022-b320-fecb10a044b3")
	)
	(label "SI{slash}SIO0"
		(at 238.76 116.84 180)
		(fields_autoplaced yes)
		(effects
			(font
				(size 1.27 1.27)
			)
			(justify right bottom)
		)
		(uuid "d5e986d2-450f-4852-b37f-c433b672dd77")
	)
	(symbol
		(lib_id "Device:C_Small")
		(at 133.35 120.65 0)
		(unit 1)
		(exclude_from_sim no)
		(in_bom yes)
		(on_board yes)
		(dnp no)
		(fields_autoplaced yes)
		(uuid "07c7bb31-486e-45b5-a80a-c65c6e7f03fa")
		(property "Reference" "C1"
			(at 135.89 119.3862 0)
			(effects
				(font
					(size 1.27 1.27)
				)
				(justify left)
			)
		)
		(property "Value" "47u"
			(at 135.89 121.9262 0)
			(effects
				(font
					(size 1.27 1.27)
				)
				(justify left)
			)
		)
		(property "Footprint" "Capacitor_SMD:C_0805_2012Metric_Pad1.18x1.45mm_HandSolder"
			(at 133.35 120.65 0)
			(effects
				(font
					(size 1.27 1.27)
				)
				(hide yes)
			)
		)
		(property "Datasheet" "~"
			(at 133.35 120.65 0)
			(effects
				(font
					(size 1.27 1.27)
				)
				(hide yes)
			)
		)
		(property "Description" ""
			(at 133.35 120.65 0)
			(effects
				(font
					(size 1.27 1.27)
				)
				(hide yes)
			)
		)
		(pin "1"
			(uuid "d5d9e1fe-3aa7-431f-8af6-2ca147abc522")
		)
		(pin "2"
			(uuid "0d624746-a49f-4ead-bba1-8b75f5ea35c4")
		)
		(instances
			(project "SPI_mem"
				(path "/4d0157cf-3901-477d-94c7-b55eb7a6f174"
					(reference "C1")
					(unit 1)
				)
			)
		)
	)
	(symbol
		(lib_id "power:GND")
		(at 132.08 167.64 0)
		(unit 1)
		(exclude_from_sim no)
		(in_bom yes)
		(on_board yes)
		(dnp no)
		(fields_autoplaced yes)
		(uuid "10a97a1c-6054-4fc8-bb6c-745d55147d09")
		(property "Reference" "#PWR05"
			(at 132.08 173.99 0)
			(effects
				(font
					(size 1.27 1.27)
				)
				(hide yes)
			)
		)
		(property "Value" "GND"
			(at 132.08 172.72 0)
			(effects
				(font
					(size 1.27 1.27)
				)
			)
		)
		(property "Footprint" ""
			(at 132.08 167.64 0)
			(effects
				(font
					(size 1.27 1.27)
				)
				(hide yes)
			)
		)
		(property "Datasheet" ""
			(at 132.08 167.64 0)
			(effects
				(font
					(size 1.27 1.27)
				)
				(hide yes)
			)
		)
		(property "Description" "Power symbol creates a global label with name \"GND\" , ground"
			(at 132.08 167.64 0)
			(effects
				(font
					(size 1.27 1.27)
				)
				(hide yes)
			)
		)
		(pin "1"
			(uuid "cab7f0f8-02d0-45e3-91b6-e5505d6448b4")
		)
		(instances
			(project "SPI_mem"
				(path "/4d0157cf-3901-477d-94c7-b55eb7a6f174"
					(reference "#PWR05")
					(unit 1)
				)
			)
		)
	)
	(symbol
		(lib_id "power:+3V3")
		(at 234.95 106.68 90)
		(unit 1)
		(exclude_from_sim no)
		(in_bom yes)
		(on_board yes)
		(dnp no)
		(fields_autoplaced yes)
		(uuid "1c278f0c-5ed3-4190-a835-ad3a14e61cd1")
		(property "Reference" "#PWR03"
			(at 238.76 106.68 0)
			(effects
				(font
					(size 1.27 1.27)
				)
				(hide yes)
			)
		)
		(property "Value" "+3V3"
			(at 231.14 106.6799 90)
			(effects
				(font
					(size 1.27 1.27)
				)
				(justify left)
			)
		)
		(property "Footprint" ""
			(at 234.95 106.68 0)
			(effects
				(font
					(size 1.27 1.27)
				)
				(hide yes)
			)
		)
		(property "Datasheet" ""
			(at 234.95 106.68 0)
			(effects
				(font
					(size 1.27 1.27)
				)
				(hide yes)
			)
		)
		(property "Description" "Power symbol creates a global label with name \"+3V3\""
			(at 234.95 106.68 0)
			(effects
				(font
					(size 1.27 1.27)
				)
				(hide yes)
			)
		)
		(pin "1"
			(uuid "bf273e17-9fc5-49c1-bc48-062bbaf3431e")
		)
		(instances
			(project "SPI_mem"
				(path "/4d0157cf-3901-477d-94c7-b55eb7a6f174"
					(reference "#PWR03")
					(unit 1)
				)
			)
		)
	)
	(symbol
		(lib_id "power:+3V3")
		(at 130.81 88.9 0)
		(unit 1)
		(exclude_from_sim no)
		(in_bom yes)
		(on_board yes)
		(dnp no)
		(fields_autoplaced yes)
		(uuid "38708d91-e1e2-491c-affb-d7e55a6c4f30")
		(property "Reference" "#PWR01"
			(at 130.81 92.71 0)
			(effects
				(font
					(size 1.27 1.27)
				)
				(hide yes)
			)
		)
		(property "Value" "+3V3"
			(at 130.81 83.82 0)
			(effects
				(font
					(size 1.27 1.27)
				)
			)
		)
		(property "Footprint" ""
			(at 130.81 88.9 0)
			(effects
				(font
					(size 1.27 1.27)
				)
				(hide yes)
			)
		)
		(property "Datasheet" ""
			(at 130.81 88.9 0)
			(effects
				(font
					(size 1.27 1.27)
				)
				(hide yes)
			)
		)
		(property "Description" "Power symbol creates a global label with name \"+3V3\""
			(at 130.81 88.9 0)
			(effects
				(font
					(size 1.27 1.27)
				)
				(hide yes)
			)
		)
		(pin "1"
			(uuid "0415cf75-a03b-473c-950a-141c42e4dbf9")
		)
		(instances
			(project "SPI_mem"
				(path "/4d0157cf-3901-477d-94c7-b55eb7a6f174"
					(reference "#PWR01")
					(unit 1)
				)
			)
		)
	)
	(symbol
		(lib_id "power:+3V3")
		(at 132.08 142.24 0)
		(unit 1)
		(exclude_from_sim no)
		(in_bom yes)
		(on_board yes)
		(dnp no)
		(fields_autoplaced yes)
		(uuid "9048654c-3599-463d-92b1-5b0c5b77c689")
		(property "Reference" "#PWR06"
			(at 132.08 146.05 0)
			(effects
				(font
					(size 1.27 1.27)
				)
				(hide yes)
			)
		)
		(property "Value" "+3V3"
			(at 132.08 137.16 0)
			(effects
				(font
					(size 1.27 1.27)
				)
			)
		)
		(property "Footprint" ""
			(at 132.08 142.24 0)
			(effects
				(font
					(size 1.27 1.27)
				)
				(hide yes)
			)
		)
		(property "Datasheet" ""
			(at 132.08 142.24 0)
			(effects
				(font
					(size 1.27 1.27)
				)
				(hide yes)
			)
		)
		(property "Description" "Power symbol creates a global label with name \"+3V3\""
			(at 132.08 142.24 0)
			(effects
				(font
					(size 1.27 1.27)
				)
				(hide yes)
			)
		)
		(pin "1"
			(uuid "d19dbd15-5f64-44f1-b60e-cd4e5c5e34f7")
		)
		(instances
			(project "SPI_mem"
				(path "/4d0157cf-3901-477d-94c7-b55eb7a6f174"
					(reference "#PWR06")
					(unit 1)
				)
			)
		)
	)
	(symbol
		(lib_id "Connector:Conn_01x08_Socket")
		(at 243.84 114.3 0)
		(unit 1)
		(exclude_from_sim no)
		(in_bom yes)
		(on_board yes)
		(dnp no)
		(fields_autoplaced yes)
		(uuid "bd832d05-5a92-436f-a1a5-c9b41124bd41")
		(property "Reference" "J1"
			(at 245.11 114.2999 0)
			(effects
				(font
					(size 1.27 1.27)
				)
				(justify left)
			)
		)
		(property "Value" "Conn_01x08_Socket"
			(at 245.11 116.8399 0)
			(effects
				(font
					(size 1.27 1.27)
				)
				(justify left)
			)
		)
		(property "Footprint" "Connector_PinHeader_2.54mm:PinHeader_1x08_P2.54mm_Vertical"
			(at 243.84 114.3 0)
			(effects
				(font
					(size 1.27 1.27)
				)
				(hide yes)
			)
		)
		(property "Datasheet" "~"
			(at 243.84 114.3 0)
			(effects
				(font
					(size 1.27 1.27)
				)
				(hide yes)
			)
		)
		(property "Description" "Generic connector, single row, 01x08, script generated"
			(at 243.84 114.3 0)
			(effects
				(font
					(size 1.27 1.27)
				)
				(hide yes)
			)
		)
		(pin "6"
			(uuid "dc607413-a95d-4e2d-9481-fcb5a0d45ae7")
		)
		(pin "5"
			(uuid "cd5e0ada-f36a-4d81-8986-26be13e3736c")
		)
		(pin "2"
			(uuid "d4088ce9-320f-4459-8bc2-764b8440790d")
		)
		(pin "3"
			(uuid "81826e9e-8f23-4543-807e-9c13ddbbb445")
		)
		(pin "8"
			(uuid "ad61722a-f5f7-4886-a785-6d9c2ff54589")
		)
		(pin "7"
			(uuid "90ea211c-9eae-44a4-bb1d-c710dab782f1")
		)
		(pin "1"
			(uuid "8bd2ebc0-9b7b-439e-a9af-c1577a86c9c2")
		)
		(pin "4"
			(uuid "e7430a6e-5536-4a74-ac6b-0e8819ea0e05")
		)
		(instances
			(project "SPI_mem"
				(path "/4d0157cf-3901-477d-94c7-b55eb7a6f174"
					(reference "J1")
					(unit 1)
				)
			)
		)
	)
	(symbol
		(lib_id "Memory_RAM:ESP-PSRAM32")
		(at 134.62 154.94 0)
		(unit 1)
		(exclude_from_sim no)
		(in_bom yes)
		(on_board yes)
		(dnp no)
		(fields_autoplaced yes)
		(uuid "d1941d15-5f07-46f5-84cd-ae6393a5aa7b")
		(property "Reference" "U1"
			(at 125.73 153.6699 0)
			(effects
				(font
					(size 1.27 1.27)
				)
				(justify right)
			)
		)
		(property "Value" "ESP-PSRAM32"
			(at 125.73 156.2099 0)
			(effects
				(font
					(size 1.27 1.27)
				)
				(justify right)
			)
		)
		(property "Footprint" "Package_SO:SOIC-8_3.9x4.9mm_P1.27mm"
			(at 134.62 170.18 0)
			(effects
				(font
					(size 1.27 1.27)
				)
				(hide yes)
			)
		)
		(property "Datasheet" "https://www.espressif.com/sites/default/files/documentation/esp-psram32_datasheet_en.pdf"
			(at 124.46 142.24 0)
			(effects
				(font
					(size 1.27 1.27)
				)
				(hide yes)
			)
		)
		(property "Description" "32 Mbit serial pseudo SRAM device organized as 4Mx8 bits, 1.8 VCC, SOIC8 (SOP8)"
			(at 134.62 154.94 0)
			(effects
				(font
					(size 1.27 1.27)
				)
				(hide yes)
			)
		)
		(pin "2"
			(uuid "d4a48101-908b-4870-801f-f37a7fc1e9f0")
		)
		(pin "3"
			(uuid "a6efa6c2-f348-4b40-8845-1bc908e9a67a")
		)
		(pin "6"
			(uuid "86110158-2d39-4bae-94a5-13f1a81d7520")
		)
		(pin "7"
			(uuid "4f876e3e-542a-4b3a-9c56-7b4d7781c632")
		)
		(pin "5"
			(uuid "dae01611-1226-403f-a4b1-ef1286fa622c")
		)
		(pin "8"
			(uuid "681c40e6-5a33-48d7-b54e-0279deb6dce0")
		)
		(pin "4"
			(uuid "8c56c308-8603-46b8-831c-949cb397bde3")
		)
		(pin "1"
			(uuid "e9950df2-1b65-4abd-85ea-a9894bbcc440")
		)
		(instances
			(project "SPI_mem"
				(path "/4d0157cf-3901-477d-94c7-b55eb7a6f174"
					(reference "U1")
					(unit 1)
				)
			)
		)
	)
	(symbol
		(lib_id "power:GND")
		(at 234.95 109.22 270)
		(unit 1)
		(exclude_from_sim no)
		(in_bom yes)
		(on_board yes)
		(dnp no)
		(fields_autoplaced yes)
		(uuid "d5fd89b1-7341-457d-bb67-b1a930924d3a")
		(property "Reference" "#PWR04"
			(at 228.6 109.22 0)
			(effects
				(font
					(size 1.27 1.27)
				)
				(hide yes)
			)
		)
		(property "Value" "GND"
			(at 231.14 109.2199 90)
			(effects
				(font
					(size 1.27 1.27)
				)
				(justify right)
			)
		)
		(property "Footprint" ""
			(at 234.95 109.22 0)
			(effects
				(font
					(size 1.27 1.27)
				)
				(hide yes)
			)
		)
		(property "Datasheet" ""
			(at 234.95 109.22 0)
			(effects
				(font
					(size 1.27 1.27)
				)
				(hide yes)
			)
		)
		(property "Description" "Power symbol creates a global label with name \"GND\" , ground"
			(at 234.95 109.22 0)
			(effects
				(font
					(size 1.27 1.27)
				)
				(hide yes)
			)
		)
		(pin "1"
			(uuid "549514f3-bbae-4a5f-933b-73dd3bc53293")
		)
		(instances
			(project "SPI_mem"
				(path "/4d0157cf-3901-477d-94c7-b55eb7a6f174"
					(reference "#PWR04")
					(unit 1)
				)
			)
		)
	)
	(symbol
		(lib_id "power:GND")
		(at 130.81 128.27 0)
		(unit 1)
		(exclude_from_sim no)
		(in_bom yes)
		(on_board yes)
		(dnp no)
		(fields_autoplaced yes)
		(uuid "df4bdc7b-ea2b-4d67-9c5f-61b615273f22")
		(property "Reference" "#PWR02"
			(at 130.81 134.62 0)
			(effects
				(font
					(size 1.27 1.27)
				)
				(hide yes)
			)
		)
		(property "Value" "GND"
			(at 130.81 133.35 0)
			(effects
				(font
					(size 1.27 1.27)
				)
			)
		)
		(property "Footprint" ""
			(at 130.81 128.27 0)
			(effects
				(font
					(size 1.27 1.27)
				)
				(hide yes)
			)
		)
		(property "Datasheet" ""
			(at 130.81 128.27 0)
			(effects
				(font
					(size 1.27 1.27)
				)
				(hide yes)
			)
		)
		(property "Description" "Power symbol creates a global label with name \"GND\" , ground"
			(at 130.81 128.27 0)
			(effects
				(font
					(size 1.27 1.27)
				)
				(hide yes)
			)
		)
		(pin "1"
			(uuid "87b3d201-0614-41cf-afeb-ecf4cb4976fa")
		)
		(instances
			(project "SPI_mem"
				(path "/4d0157cf-3901-477d-94c7-b55eb7a6f174"
					(reference "#PWR02")
					(unit 1)
				)
			)
		)
	)
	(symbol
		(lib_id "Daniel:48LM01T-I_SM")
		(at 146.05 104.14 0)
		(mirror y)
		(unit 1)
		(exclude_from_sim no)
		(in_bom yes)
		(on_board yes)
		(dnp no)
		(uuid "ff3f92f7-cc9e-41fb-bd02-cf32dc064d87")
		(property "Reference" "IC1"
			(at 134.62 89.535 0)
			(effects
				(font
					(size 1.27 1.27)
				)
				(justify left)
			)
		)
		(property "Value" "48LM01T-I_SM"
			(at 146.05 92.075 0)
			(effects
				(font
					(size 1.27 1.27)
				)
				(justify left)
			)
		)
		(property "Footprint" "SOIC127P794X203-8N"
			(at 99.06 111.76 0)
			(effects
				(font
					(size 1.27 1.27)
				)
				(justify left)
				(hide yes)
			)
		)
		(property "Datasheet" "http://ww1.microchip.com/downloads/en/DeviceDoc/20006008C.pdf"
			(at 99.06 114.3 0)
			(effects
				(font
					(size 1.27 1.27)
				)
				(justify left)
				(hide yes)
			)
		)
		(property "Description" "SRAM Serial SRAM with Nonvolatile bits, 1M bit SPI"
			(at 99.06 116.84 0)
			(effects
				(font
					(size 1.27 1.27)
				)
				(justify left)
				(hide yes)
			)
		)
		(property "Height" "2.03"
			(at 99.06 119.38 0)
			(effects
				(font
					(size 1.27 1.27)
				)
				(justify left)
				(hide yes)
			)
		)
		(property "Mouser Part Number" "579-48LM01T-I/SM"
			(at 99.06 121.92 0)
			(effects
				(font
					(size 1.27 1.27)
				)
				(justify left)
				(hide yes)
			)
		)
		(property "Mouser Price/Stock" "https://www.mouser.co.uk/ProductDetail/Microchip-Technology/48LM01T-I-SM?qs=wnTfsH77Xs6yLtUXRf3vrg%3D%3D"
			(at 99.06 124.46 0)
			(effects
				(font
					(size 1.27 1.27)
				)
				(justify left)
				(hide yes)
			)
		)
		(property "Manufacturer_Name" "Microchip"
			(at 99.06 127 0)
			(effects
				(font
					(size 1.27 1.27)
				)
				(justify left)
				(hide yes)
			)
		)
		(property "Manufacturer_Part_Number" "48LM01T-I/SM"
			(at 99.06 129.54 0)
			(effects
				(font
					(size 1.27 1.27)
				)
				(justify left)
				(hide yes)
			)
		)
		(pin "1"
			(uuid "3d860d7f-2309-422e-b00a-45c07ef3b60b")
		)
		(pin "2"
			(uuid "c0b69c92-180f-4176-8ec6-7ab4009da721")
		)
		(pin "3"
			(uuid "31bcdb0a-778c-4fb0-966b-5e730dbb912d")
		)
		(pin "4"
			(uuid "80fcc72e-9849-4da1-9ac2-5503c8ed4b34")
		)
		(pin "5"
			(uuid "d1d71dd8-3035-4060-8c9a-f04ca475541d")
		)
		(pin "6"
			(uuid "15ccd601-8404-4a71-9700-2d27342b24c8")
		)
		(pin "7"
			(uuid "9d5a9789-97b6-480c-b39b-72eefc16c887")
		)
		(pin "8"
			(uuid "3179d874-61b1-419e-9002-e758ab5aa399")
		)
		(instances
			(project "SPI_mem"
				(path "/4d0157cf-3901-477d-94c7-b55eb7a6f174"
					(reference "IC1")
					(unit 1)
				)
			)
		)
	)
	(sheet_instances
		(path "/"
			(page "1")
		)
	)
)