M48
; DRILL file {KiCad (6.0.9)} date Sat Nov 26 18:14:14 2022
; FORMAT={-:-/ absolute / inch / decimal}
; #@! TF.CreationDate,2022-11-26T18:14:14-07:00
; #@! TF.GenerationSoftware,Kicad,Pcbnew,(6.0.9)
; #@! TF.FileFunction,Plated,1,2,PTH
FMAT,2
INCH
; #@! TA.AperFunction,Plated,PTH,ViaDrill
T1C0.0157
; #@! TA.AperFunction,Plated,PTH,ComponentDrill
T2C0.0157
; #@! TA.AperFunction,Plated,PTH,ComponentDrill
T3C0.0394
; #@! TA.AperFunction,Plated,PTH,ComponentDrill
T4C0.0469
; #@! TA.AperFunction,Plated,PTH,ComponentDrill
T5C0.1201
%
G90
G05
T1
X4.9798Y-5.185
X5.0Y-4.4016
X5.0394Y-5.1693
X5.0433Y-4.4213
X5.0984Y-5.1732
X5.1378Y-3.2559
X5.1417Y-4.0866
X5.1514Y-3.5913
X5.1614Y-4.2087
X5.1693Y-3.9488
X5.1772Y-4.1063
X5.189Y-3.1693
X5.2165Y-4.8425
X5.2323Y-4.563
X5.2795Y-3.5591
X5.2913Y-4.4409
X5.3228Y-4.4724
X5.3346Y-4.2402
X5.354Y-3.7351
X5.3543Y-3.8031
X5.3583Y-3.4646
X5.406Y-4.095
X5.4213Y-4.1457
X5.437Y-4.8307
X5.4483Y-3.8263
X5.4488Y-4.0118
X5.4528Y-3.7677
X5.4564Y-3.3774
X5.4646Y-3.7244
X5.5315Y-4.1535
X5.5354Y-3.9173
X5.582Y-4.1991
X5.5822Y-4.1598
X5.5827Y-3.7638
X5.5945Y-3.7165
X5.6024Y-3.6181
X5.6024Y-4.8976
X5.629Y-3.7756
X5.6508Y-5.0204
X5.6654Y-3.6654
X5.6732Y-3.8071
X5.7431Y-3.6142
X5.7559Y-3.7835
X5.7717Y-4.248
X5.7972Y-3.7303
X5.8051Y-3.6043
X5.8083Y-5.0499
X5.818Y-3.2265
X5.8189Y-4.5
X5.8474Y-4.4646
X5.8583Y-3.9134
X5.87Y-3.3148
X5.874Y-3.5512
X5.8819Y-4.4331
X5.8858Y-3.2283
X5.887Y-4.8334
X5.887Y-4.8826
X5.8898Y-3.9921
X5.9213Y-4.0433
X5.9498Y-4.0856
X5.9756Y-4.8432
X6.0463Y-5.0344
X6.063Y-3.8858
X6.063Y-3.9331
X6.0883Y-4.828
X6.0945Y-3.3701
X6.1063Y-3.8858
X6.1063Y-3.9331
X6.1102Y-4.8976
X6.122Y-5.0118
X6.1232Y-5.1975
X6.1626Y-4.8432
X6.2323Y-4.8346
X6.2559Y-4.9488
T2
X5.2126Y-3.6142
X5.2126Y-3.6457
T3
X4.9016Y-3.7598
X4.9016Y-4.0157
X5.0787Y-3.7598
X5.0787Y-4.0157
T4
X5.3644Y-3.0764
X5.4094Y-2.9764
X5.4094Y-3.1764
X5.4545Y-3.0764
X5.4996Y-2.9764
X5.4996Y-3.1764
X5.5447Y-3.0764
X5.5898Y-2.9764
X5.5898Y-3.1764
X5.6348Y-3.0764
X5.6799Y-2.9764
X5.6799Y-3.1764
X5.725Y-3.0764
X5.7701Y-2.9764
X5.7701Y-3.1764
T5
X5.0878Y-3.0764
X6.0717Y-3.0764
T0
M30
