(kicad_sch (version 20211123) (generator eeschema)

  (uuid b8a81739-f245-463d-aa81-c40d903a0d4b)

  (paper "A4")

  (lib_symbols
    (symbol "Daniel:LM324DT" (pin_names (offset 0.002)) (in_bom yes) (on_board yes)
      (property "Reference" "U1" (id 0) (at 0 10.16 0)
        (effects (font (size 1.524 1.524)))
      )
      (property "Value" "LM324DT" (id 1) (at 0 6.35 0)
        (effects (font (size 1.524 1.524)))
      )
      (property "Footprint" "digikey-footprints:SOIC-14_W3.9mm" (id 2) (at 5.08 5.08 0)
        (effects (font (size 1.524 1.524)) (justify left) hide)
      )
      (property "Datasheet" "http://www.st.com/content/ccc/resource/technical/document/datasheet/bd/fc/46/43/26/8f/40/7f/CD00001046.pdf/files/CD00001046.pdf/jcr:content/translations/en.CD00001046.pdf" (id 3) (at 5.08 7.62 0)
        (effects (font (size 1.524 1.524)) (justify left) hide)
      )
      (property "Digi-Key_PN" "497-1580-1-ND" (id 4) (at 5.08 10.16 0)
        (effects (font (size 1.524 1.524)) (justify left) hide)
      )
      (property "MPN" "LM324DT" (id 5) (at 5.08 12.7 0)
        (effects (font (size 1.524 1.524)) (justify left) hide)
      )
      (property "Category" "Integrated Circuits (ICs)" (id 6) (at 5.08 15.24 0)
        (effects (font (size 1.524 1.524)) (justify left) hide)
      )
      (property "Family" "Linear - Amplifiers - Instrumentation, OP Amps, Buffer Amps" (id 7) (at 5.08 17.78 0)
        (effects (font (size 1.524 1.524)) (justify left) hide)
      )
      (property "DK_Datasheet_Link" "http://www.st.com/content/ccc/resource/technical/document/datasheet/bd/fc/46/43/26/8f/40/7f/CD00001046.pdf/files/CD00001046.pdf/jcr:content/translations/en.CD00001046.pdf" (id 8) (at 5.08 20.32 0)
        (effects (font (size 1.524 1.524)) (justify left) hide)
      )
      (property "DK_Detail_Page" "/product-detail/en/stmicroelectronics/LM324DT/497-1580-1-ND/592078" (id 9) (at 5.08 22.86 0)
        (effects (font (size 1.524 1.524)) (justify left) hide)
      )
      (property "Description" "IC OPAMP GP 4 CIRCUIT 14SO" (id 10) (at 5.08 25.4 0)
        (effects (font (size 1.524 1.524)) (justify left) hide)
      )
      (property "Manufacturer" "STMicroelectronics" (id 11) (at 5.08 27.94 0)
        (effects (font (size 1.524 1.524)) (justify left) hide)
      )
      (property "Status" "Active" (id 12) (at 5.08 30.48 0)
        (effects (font (size 1.524 1.524)) (justify left) hide)
      )
      (property "ki_locked" "" (id 13) (at 0 0 0)
        (effects (font (size 1.27 1.27)))
      )
      (property "ki_keywords" "497-1580-1-ND" (id 14) (at 0 0 0)
        (effects (font (size 1.27 1.27)) hide)
      )
      (property "ki_description" "IC OPAMP GP 4 CIRCUIT 14SO" (id 15) (at 0 0 0)
        (effects (font (size 1.27 1.27)) hide)
      )
      (symbol "LM324DT_1_0"
        (rectangle (start -1.27 2.54) (end 1.27 -2.54)
          (stroke (width 0) (type default) (color 0 0 0 0))
          (fill (type none))
        )
      )
      (symbol "LM324DT_1_1"
        (pin power_in line (at 0 -5.08 90) (length 2.54)
          (name "-" (effects (font (size 1.27 1.27))))
          (number "11" (effects (font (size 1.27 1.27))))
        )
        (pin power_in line (at 0 5.08 270) (length 2.54)
          (name "+" (effects (font (size 1.27 1.27))))
          (number "4" (effects (font (size 1.27 1.27))))
        )
      )
      (symbol "LM324DT_2_0"
        (polyline
          (pts
            (xy -3.81 -2.54)
            (xy -2.54 -2.54)
          )
          (stroke (width 0) (type default) (color 0 0 0 0))
          (fill (type none))
        )
        (polyline
          (pts
            (xy -3.81 2.54)
            (xy -2.54 2.54)
          )
          (stroke (width 0) (type default) (color 0 0 0 0))
          (fill (type none))
        )
        (polyline
          (pts
            (xy -3.175 -1.905)
            (xy -3.175 -3.175)
          )
          (stroke (width 0) (type default) (color 0 0 0 0))
          (fill (type none))
        )
        (polyline
          (pts
            (xy -5.08 5.08)
            (xy -5.08 -5.08)
            (xy 5.08 0)
            (xy -5.08 5.08)
          )
          (stroke (width 0) (type default) (color 0 0 0 0))
          (fill (type background))
        )
        (text "B" (at 0 0 0)
          (effects (font (size 1.524 1.524)))
        )
      )
      (symbol "LM324DT_2_1"
        (pin input line (at -7.62 -2.54 0) (length 2.54)
          (name "~" (effects (font (size 1.27 1.27))))
          (number "5" (effects (font (size 1.27 1.27))))
        )
        (pin input line (at -7.62 2.54 0) (length 2.54)
          (name "~" (effects (font (size 1.27 1.27))))
          (number "6" (effects (font (size 1.27 1.27))))
        )
        (pin output line (at 7.62 0 180) (length 2.54)
          (name "~" (effects (font (size 1.27 1.27))))
          (number "7" (effects (font (size 1.27 1.27))))
        )
      )
      (symbol "LM324DT_3_0"
        (polyline
          (pts
            (xy -3.81 -2.54)
            (xy -2.54 -2.54)
          )
          (stroke (width 0) (type default) (color 0 0 0 0))
          (fill (type none))
        )
        (polyline
          (pts
            (xy -3.81 2.54)
            (xy -2.54 2.54)
          )
          (stroke (width 0) (type default) (color 0 0 0 0))
          (fill (type none))
        )
        (polyline
          (pts
            (xy -3.175 -1.905)
            (xy -3.175 -3.175)
          )
          (stroke (width 0) (type default) (color 0 0 0 0))
          (fill (type none))
        )
        (polyline
          (pts
            (xy -5.08 5.08)
            (xy -5.08 -5.08)
            (xy 5.08 0)
            (xy -5.08 5.08)
          )
          (stroke (width 0) (type default) (color 0 0 0 0))
          (fill (type background))
        )
        (text "C" (at 0 0 0)
          (effects (font (size 1.524 1.524)))
        )
      )
      (symbol "LM324DT_3_1"
        (pin input line (at -7.62 -2.54 0) (length 2.54)
          (name "~" (effects (font (size 1.27 1.27))))
          (number "10" (effects (font (size 1.27 1.27))))
        )
        (pin output line (at 7.62 0 180) (length 2.54)
          (name "~" (effects (font (size 1.27 1.27))))
          (number "8" (effects (font (size 1.27 1.27))))
        )
        (pin input line (at -7.62 2.54 0) (length 2.54)
          (name "~" (effects (font (size 1.27 1.27))))
          (number "9" (effects (font (size 1.27 1.27))))
        )
      )
      (symbol "LM324DT_4_0"
        (polyline
          (pts
            (xy -3.81 -2.54)
            (xy -2.54 -2.54)
          )
          (stroke (width 0) (type default) (color 0 0 0 0))
          (fill (type none))
        )
        (polyline
          (pts
            (xy -3.81 2.54)
            (xy -2.54 2.54)
          )
          (stroke (width 0) (type default) (color 0 0 0 0))
          (fill (type none))
        )
        (polyline
          (pts
            (xy -3.175 -1.905)
            (xy -3.175 -3.175)
          )
          (stroke (width 0) (type default) (color 0 0 0 0))
          (fill (type none))
        )
        (polyline
          (pts
            (xy -5.08 5.08)
            (xy -5.08 -5.08)
            (xy 5.08 0)
            (xy -5.08 5.08)
          )
          (stroke (width 0) (type default) (color 0 0 0 0))
          (fill (type background))
        )
        (text "D" (at 0 0 0)
          (effects (font (size 1.524 1.524)))
        )
      )
      (symbol "LM324DT_4_1"
        (pin input line (at -7.62 -2.54 0) (length 2.54)
          (name "~" (effects (font (size 1.27 1.27))))
          (number "12" (effects (font (size 1.27 1.27))))
        )
        (pin input line (at -7.62 2.54 0) (length 2.54)
          (name "~" (effects (font (size 1.27 1.27))))
          (number "13" (effects (font (size 1.27 1.27))))
        )
        (pin output line (at 7.62 0 180) (length 2.54)
          (name "~" (effects (font (size 1.27 1.27))))
          (number "14" (effects (font (size 1.27 1.27))))
        )
      )
      (symbol "LM324DT_5_0"
        (polyline
          (pts
            (xy -3.81 -2.54)
            (xy -2.54 -2.54)
          )
          (stroke (width 0) (type default) (color 0 0 0 0))
          (fill (type none))
        )
        (polyline
          (pts
            (xy -3.81 2.54)
            (xy -2.54 2.54)
          )
          (stroke (width 0) (type default) (color 0 0 0 0))
          (fill (type none))
        )
        (polyline
          (pts
            (xy -3.175 -1.905)
            (xy -3.175 -3.175)
          )
          (stroke (width 0) (type default) (color 0 0 0 0))
          (fill (type none))
        )
        (polyline
          (pts
            (xy -5.08 5.08)
            (xy -5.08 -5.08)
            (xy 5.08 0)
            (xy -5.08 5.08)
          )
          (stroke (width 0) (type default) (color 0 0 0 0))
          (fill (type background))
        )
        (text "E" (at 0 0 0)
          (effects (font (size 1.524 1.524)))
        )
      )
      (symbol "LM324DT_5_1"
        (pin output line (at 7.62 0 180) (length 2.54)
          (name "~" (effects (font (size 1.27 1.27))))
          (number "1" (effects (font (size 1.27 1.27))))
        )
        (pin input line (at -7.62 2.54 0) (length 2.54)
          (name "~" (effects (font (size 1.27 1.27))))
          (number "2" (effects (font (size 1.27 1.27))))
        )
        (pin input line (at -7.62 -2.54 0) (length 2.54)
          (name "~" (effects (font (size 1.27 1.27))))
          (number "3" (effects (font (size 1.27 1.27))))
        )
      )
    )
    (symbol "Device:R_Small_US" (pin_numbers hide) (pin_names (offset 0.254) hide) (in_bom yes) (on_board yes)
      (property "Reference" "R" (id 0) (at 0.762 0.508 0)
        (effects (font (size 1.27 1.27)) (justify left))
      )
      (property "Value" "R_Small_US" (id 1) (at 0.762 -1.016 0)
        (effects (font (size 1.27 1.27)) (justify left))
      )
      (property "Footprint" "" (id 2) (at 0 0 0)
        (effects (font (size 1.27 1.27)) hide)
      )
      (property "Datasheet" "~" (id 3) (at 0 0 0)
        (effects (font (size 1.27 1.27)) hide)
      )
      (property "ki_keywords" "r resistor" (id 4) (at 0 0 0)
        (effects (font (size 1.27 1.27)) hide)
      )
      (property "ki_description" "Resistor, small US symbol" (id 5) (at 0 0 0)
        (effects (font (size 1.27 1.27)) hide)
      )
      (property "ki_fp_filters" "R_*" (id 6) (at 0 0 0)
        (effects (font (size 1.27 1.27)) hide)
      )
      (symbol "R_Small_US_1_1"
        (polyline
          (pts
            (xy 0 0)
            (xy 1.016 -0.381)
            (xy 0 -0.762)
            (xy -1.016 -1.143)
            (xy 0 -1.524)
          )
          (stroke (width 0) (type default) (color 0 0 0 0))
          (fill (type none))
        )
        (polyline
          (pts
            (xy 0 1.524)
            (xy 1.016 1.143)
            (xy 0 0.762)
            (xy -1.016 0.381)
            (xy 0 0)
          )
          (stroke (width 0) (type default) (color 0 0 0 0))
          (fill (type none))
        )
        (pin passive line (at 0 2.54 270) (length 1.016)
          (name "~" (effects (font (size 1.27 1.27))))
          (number "1" (effects (font (size 1.27 1.27))))
        )
        (pin passive line (at 0 -2.54 90) (length 1.016)
          (name "~" (effects (font (size 1.27 1.27))))
          (number "2" (effects (font (size 1.27 1.27))))
        )
      )
    )
    (symbol "Simulation_SPICE:VDC" (pin_numbers hide) (pin_names (offset 0.0254)) (in_bom yes) (on_board yes)
      (property "Reference" "V" (id 0) (at 2.54 2.54 0)
        (effects (font (size 1.27 1.27)) (justify left))
      )
      (property "Value" "VDC" (id 1) (at 2.54 0 0)
        (effects (font (size 1.27 1.27)) (justify left))
      )
      (property "Footprint" "" (id 2) (at 0 0 0)
        (effects (font (size 1.27 1.27)) hide)
      )
      (property "Datasheet" "~" (id 3) (at 0 0 0)
        (effects (font (size 1.27 1.27)) hide)
      )
      (property "Spice_Netlist_Enabled" "Y" (id 4) (at 0 0 0)
        (effects (font (size 1.27 1.27)) (justify left) hide)
      )
      (property "Spice_Primitive" "V" (id 5) (at 0 0 0)
        (effects (font (size 1.27 1.27)) (justify left) hide)
      )
      (property "Spice_Model" "dc(1)" (id 6) (at 2.54 -2.54 0)
        (effects (font (size 1.27 1.27)) (justify left))
      )
      (property "ki_keywords" "simulation" (id 7) (at 0 0 0)
        (effects (font (size 1.27 1.27)) hide)
      )
      (property "ki_description" "Voltage source, DC" (id 8) (at 0 0 0)
        (effects (font (size 1.27 1.27)) hide)
      )
      (symbol "VDC_0_0"
        (polyline
          (pts
            (xy -1.27 0.254)
            (xy 1.27 0.254)
          )
          (stroke (width 0) (type default) (color 0 0 0 0))
          (fill (type none))
        )
        (polyline
          (pts
            (xy -0.762 -0.254)
            (xy -1.27 -0.254)
          )
          (stroke (width 0) (type default) (color 0 0 0 0))
          (fill (type none))
        )
        (polyline
          (pts
            (xy 0.254 -0.254)
            (xy -0.254 -0.254)
          )
          (stroke (width 0) (type default) (color 0 0 0 0))
          (fill (type none))
        )
        (polyline
          (pts
            (xy 1.27 -0.254)
            (xy 0.762 -0.254)
          )
          (stroke (width 0) (type default) (color 0 0 0 0))
          (fill (type none))
        )
        (text "+" (at 0 1.905 0)
          (effects (font (size 1.27 1.27)))
        )
      )
      (symbol "VDC_0_1"
        (circle (center 0 0) (radius 2.54)
          (stroke (width 0.254) (type default) (color 0 0 0 0))
          (fill (type background))
        )
      )
      (symbol "VDC_1_1"
        (pin passive line (at 0 5.08 270) (length 2.54)
          (name "~" (effects (font (size 1.27 1.27))))
          (number "1" (effects (font (size 1.27 1.27))))
        )
        (pin passive line (at 0 -5.08 90) (length 2.54)
          (name "~" (effects (font (size 1.27 1.27))))
          (number "2" (effects (font (size 1.27 1.27))))
        )
      )
    )
    (symbol "Simulation_SPICE:VPULSE" (pin_numbers hide) (pin_names (offset 0.0254)) (in_bom yes) (on_board yes)
      (property "Reference" "V" (id 0) (at 2.54 2.54 0)
        (effects (font (size 1.27 1.27)) (justify left))
      )
      (property "Value" "VPULSE" (id 1) (at 2.54 0 0)
        (effects (font (size 1.27 1.27)) (justify left))
      )
      (property "Footprint" "" (id 2) (at 0 0 0)
        (effects (font (size 1.27 1.27)) hide)
      )
      (property "Datasheet" "~" (id 3) (at 0 0 0)
        (effects (font (size 1.27 1.27)) hide)
      )
      (property "Spice_Netlist_Enabled" "Y" (id 4) (at 0 0 0)
        (effects (font (size 1.27 1.27)) (justify left) hide)
      )
      (property "Spice_Primitive" "V" (id 5) (at 0 0 0)
        (effects (font (size 1.27 1.27)) (justify left) hide)
      )
      (property "Spice_Model" "pulse(0 1 2n 2n 2n 50n 100n)" (id 6) (at 2.54 -2.54 0)
        (effects (font (size 1.27 1.27)) (justify left))
      )
      (property "ki_keywords" "simulation" (id 7) (at 0 0 0)
        (effects (font (size 1.27 1.27)) hide)
      )
      (property "ki_description" "Voltage source, pulse" (id 8) (at 0 0 0)
        (effects (font (size 1.27 1.27)) hide)
      )
      (symbol "VPULSE_0_0"
        (polyline
          (pts
            (xy -2.032 -0.762)
            (xy -1.397 -0.762)
            (xy -1.143 0.762)
            (xy -0.127 0.762)
            (xy 0.127 -0.762)
            (xy 1.143 -0.762)
            (xy 1.397 0.762)
            (xy 2.032 0.762)
          )
          (stroke (width 0) (type default) (color 0 0 0 0))
          (fill (type none))
        )
        (text "+" (at 0 1.905 0)
          (effects (font (size 1.27 1.27)))
        )
      )
      (symbol "VPULSE_0_1"
        (circle (center 0 0) (radius 2.54)
          (stroke (width 0.254) (type default) (color 0 0 0 0))
          (fill (type background))
        )
      )
      (symbol "VPULSE_1_1"
        (pin passive line (at 0 5.08 270) (length 2.54)
          (name "~" (effects (font (size 1.27 1.27))))
          (number "1" (effects (font (size 1.27 1.27))))
        )
        (pin passive line (at 0 -5.08 90) (length 2.54)
          (name "~" (effects (font (size 1.27 1.27))))
          (number "2" (effects (font (size 1.27 1.27))))
        )
      )
    )
    (symbol "pspice:0" (power) (pin_names (offset 0)) (in_bom yes) (on_board yes)
      (property "Reference" "#GND" (id 0) (at 0 -2.54 0)
        (effects (font (size 1.27 1.27)) hide)
      )
      (property "Value" "0" (id 1) (at 0 -1.778 0)
        (effects (font (size 1.27 1.27)))
      )
      (property "Footprint" "" (id 2) (at 0 0 0)
        (effects (font (size 1.27 1.27)) hide)
      )
      (property "Datasheet" "~" (id 3) (at 0 0 0)
        (effects (font (size 1.27 1.27)) hide)
      )
      (property "ki_keywords" "simulation" (id 4) (at 0 0 0)
        (effects (font (size 1.27 1.27)) hide)
      )
      (property "ki_description" "0V reference potential for simulation" (id 5) (at 0 0 0)
        (effects (font (size 1.27 1.27)) hide)
      )
      (symbol "0_0_1"
        (polyline
          (pts
            (xy -1.27 0)
            (xy 0 -1.27)
            (xy 1.27 0)
            (xy -1.27 0)
          )
          (stroke (width 0) (type default) (color 0 0 0 0))
          (fill (type none))
        )
      )
      (symbol "0_1_1"
        (pin power_in line (at 0 0 0) (length 0) hide
          (name "0" (effects (font (size 1.016 1.016))))
          (number "1" (effects (font (size 1.016 1.016))))
        )
      )
    )
    (symbol "pspice:CAP" (pin_names (offset 0.254)) (in_bom yes) (on_board yes)
      (property "Reference" "C" (id 0) (at 2.54 3.81 90)
        (effects (font (size 1.27 1.27)))
      )
      (property "Value" "CAP" (id 1) (at 2.54 -3.81 90)
        (effects (font (size 1.27 1.27)))
      )
      (property "Footprint" "" (id 2) (at 0 0 0)
        (effects (font (size 1.27 1.27)) hide)
      )
      (property "Datasheet" "~" (id 3) (at 0 0 0)
        (effects (font (size 1.27 1.27)) hide)
      )
      (property "ki_keywords" "simulation" (id 4) (at 0 0 0)
        (effects (font (size 1.27 1.27)) hide)
      )
      (property "ki_description" "Capacitor symbol for simulation only" (id 5) (at 0 0 0)
        (effects (font (size 1.27 1.27)) hide)
      )
      (symbol "CAP_0_1"
        (polyline
          (pts
            (xy -3.81 -1.27)
            (xy 3.81 -1.27)
          )
          (stroke (width 0) (type default) (color 0 0 0 0))
          (fill (type none))
        )
        (polyline
          (pts
            (xy -3.81 1.27)
            (xy 3.81 1.27)
          )
          (stroke (width 0) (type default) (color 0 0 0 0))
          (fill (type none))
        )
      )
      (symbol "CAP_1_1"
        (pin passive line (at 0 6.35 270) (length 5.08)
          (name "~" (effects (font (size 1.016 1.016))))
          (number "1" (effects (font (size 1.016 1.016))))
        )
        (pin passive line (at 0 -6.35 90) (length 5.08)
          (name "~" (effects (font (size 1.016 1.016))))
          (number "2" (effects (font (size 1.016 1.016))))
        )
      )
    )
  )

  (junction (at 93.98 93.345) (diameter 0) (color 0 0 0 0)
    (uuid 0243ba09-2a3d-43e7-af19-140922207e62)
  )
  (junction (at 47.625 57.15) (diameter 0) (color 0 0 0 0)
    (uuid 071cfbfb-0c7e-4066-b302-c83891da4fb8)
  )
  (junction (at 116.84 123.19) (diameter 0) (color 0 0 0 0)
    (uuid 2ef6a725-0b64-4ffa-be86-d99131573a08)
  )
  (junction (at 185.42 90.805) (diameter 0) (color 0 0 0 0)
    (uuid 35e819a0-48ca-47ef-babf-7ee09db8d5f3)
  )
  (junction (at 134.62 93.345) (diameter 0) (color 0 0 0 0)
    (uuid 71097bb2-a280-4bd4-a511-7815cc915e60)
  )
  (junction (at 81.28 124.46) (diameter 0) (color 0 0 0 0)
    (uuid 72781fb4-093b-43f1-b9a2-bc6f19f37a84)
  )
  (junction (at 93.98 57.15) (diameter 0) (color 0 0 0 0)
    (uuid 8c657673-d64a-46a3-bde1-5bbd7de852be)
  )
  (junction (at 130.175 93.345) (diameter 0) (color 0 0 0 0)
    (uuid 990616f1-dad5-46ca-b1bb-2b85d3c8a10a)
  )
  (junction (at 41.91 127) (diameter 0) (color 0 0 0 0)
    (uuid b47b0397-3a44-4b98-b3ac-417d79e030e9)
  )
  (junction (at 134.62 57.15) (diameter 0) (color 0 0 0 0)
    (uuid dd4e002b-1781-4069-99a2-be01f664969c)
  )
  (junction (at 47.625 93.345) (diameter 0) (color 0 0 0 0)
    (uuid ebe0aaa6-5f45-4b96-b372-562e680c8cf3)
  )

  (wire (pts (xy 134.62 93.345) (xy 160.02 93.345))
    (stroke (width 0) (type default) (color 0 0 0 0))
    (uuid 01bf204a-dbc9-482f-89ba-96cdba5e7abe)
  )
  (wire (pts (xy 81.28 124.46) (xy 81.28 132.08))
    (stroke (width 0) (type default) (color 0 0 0 0))
    (uuid 0b23a42e-cf4f-42fd-bab6-37b6cdf359a5)
  )
  (wire (pts (xy 234.95 52.07) (xy 234.95 60.325))
    (stroke (width 0) (type default) (color 0 0 0 0))
    (uuid 0e4ae287-b933-4b39-a958-0df700675c44)
  )
  (wire (pts (xy 73.025 57.15) (xy 73.025 65.405))
    (stroke (width 0) (type default) (color 0 0 0 0))
    (uuid 146da221-b5eb-45cd-8040-6ae8586841d9)
  )
  (wire (pts (xy 144.145 120.65) (xy 135.89 120.65))
    (stroke (width 0) (type default) (color 0 0 0 0))
    (uuid 19c91d29-77d4-4db0-a58d-874a1da623eb)
  )
  (wire (pts (xy 85.09 124.46) (xy 81.28 124.46))
    (stroke (width 0) (type default) (color 0 0 0 0))
    (uuid 1b7ba455-1937-42b5-b4d5-007d08a65256)
  )
  (wire (pts (xy 53.34 93.345) (xy 47.625 93.345))
    (stroke (width 0) (type default) (color 0 0 0 0))
    (uuid 2c5eee95-4b82-48f8-b0db-d7516131c235)
  )
  (wire (pts (xy 144.145 137.795) (xy 144.145 148.59))
    (stroke (width 0) (type default) (color 0 0 0 0))
    (uuid 313bddc1-f59c-4f49-a826-e86a02849757)
  )
  (wire (pts (xy 73.025 57.15) (xy 93.98 57.15))
    (stroke (width 0) (type default) (color 0 0 0 0))
    (uuid 36357eb5-4109-4128-a3a9-08d5a0682382)
  )
  (wire (pts (xy 26.67 57.15) (xy 47.625 57.15))
    (stroke (width 0) (type default) (color 0 0 0 0))
    (uuid 3d40426b-cbbc-450d-a2f6-50180f12257d)
  )
  (wire (pts (xy 113.665 57.15) (xy 134.62 57.15))
    (stroke (width 0) (type default) (color 0 0 0 0))
    (uuid 408471df-98b8-4463-9b7a-f601874158bc)
  )
  (wire (pts (xy 93.98 89.535) (xy 93.98 93.345))
    (stroke (width 0) (type default) (color 0 0 0 0))
    (uuid 47335bcd-e6cf-408c-bcb3-23b81dff497f)
  )
  (wire (pts (xy 26.67 75.565) (xy 26.67 83.82))
    (stroke (width 0) (type default) (color 0 0 0 0))
    (uuid 4a70c77c-0884-47e7-9e5f-7971bb2fe405)
  )
  (wire (pts (xy 73.025 75.565) (xy 73.025 79.375))
    (stroke (width 0) (type default) (color 0 0 0 0))
    (uuid 4c40fe63-e693-4c61-92af-eb9902ba103e)
  )
  (wire (pts (xy 234.95 70.485) (xy 234.95 76.835))
    (stroke (width 0) (type default) (color 0 0 0 0))
    (uuid 54a0b182-92b9-4786-84eb-406382fe951f)
  )
  (wire (pts (xy 41.91 121.92) (xy 41.91 127))
    (stroke (width 0) (type default) (color 0 0 0 0))
    (uuid 61fc1417-1873-4816-8f6a-d3d542a92fa8)
  )
  (wire (pts (xy 113.665 74.93) (xy 113.665 81.28))
    (stroke (width 0) (type default) (color 0 0 0 0))
    (uuid 6692abbb-bfee-483b-9a2c-e89e05b967c0)
  )
  (wire (pts (xy 93.98 45.72) (xy 93.98 57.15))
    (stroke (width 0) (type default) (color 0 0 0 0))
    (uuid 74209718-cfc6-40d7-9ed2-8a50e65bc007)
  )
  (wire (pts (xy 67.31 124.46) (xy 67.31 129.54))
    (stroke (width 0) (type default) (color 0 0 0 0))
    (uuid 74cfedf2-4c3b-4dd4-b8ec-0330b05ec258)
  )
  (wire (pts (xy 108.585 140.335) (xy 108.585 151.13))
    (stroke (width 0) (type default) (color 0 0 0 0))
    (uuid 7caccf78-0a88-4c10-baa5-54b958ca357b)
  )
  (wire (pts (xy 144.145 120.65) (xy 144.145 125.095))
    (stroke (width 0) (type default) (color 0 0 0 0))
    (uuid 7e06ed47-4e9d-46e0-8537-7a9acb99a26f)
  )
  (wire (pts (xy 185.42 106.045) (xy 185.42 116.84))
    (stroke (width 0) (type default) (color 0 0 0 0))
    (uuid 7e740152-9518-47d2-b891-ea46a660ab4c)
  )
  (wire (pts (xy 67.31 124.46) (xy 60.96 124.46))
    (stroke (width 0) (type default) (color 0 0 0 0))
    (uuid 814d542e-ba04-4b24-bcb8-4ef09574a5ae)
  )
  (wire (pts (xy 45.72 127) (xy 41.91 127))
    (stroke (width 0) (type default) (color 0 0 0 0))
    (uuid 82178e1d-e5ab-4651-b963-ec2acbe4e9c9)
  )
  (wire (pts (xy 134.62 45.72) (xy 134.62 57.15))
    (stroke (width 0) (type default) (color 0 0 0 0))
    (uuid 868d39db-fcea-4f34-995f-8fb776158c4d)
  )
  (wire (pts (xy 26.67 57.15) (xy 26.67 65.405))
    (stroke (width 0) (type default) (color 0 0 0 0))
    (uuid 8934c31d-7273-470c-bfe0-23c6474451d0)
  )
  (wire (pts (xy 134.62 57.15) (xy 134.62 85.09))
    (stroke (width 0) (type default) (color 0 0 0 0))
    (uuid 89b4c7a9-40bf-4213-8d08-1e7a0f97fae8)
  )
  (wire (pts (xy 130.175 93.345) (xy 134.62 93.345))
    (stroke (width 0) (type default) (color 0 0 0 0))
    (uuid 8a5dba53-c675-4a18-bc6f-e5316b3eab22)
  )
  (wire (pts (xy 215.265 52.07) (xy 234.95 52.07))
    (stroke (width 0) (type default) (color 0 0 0 0))
    (uuid 8b85166d-6e9d-4601-9ad3-b0f0f3e704ce)
  )
  (wire (pts (xy 185.42 90.805) (xy 185.42 93.345))
    (stroke (width 0) (type default) (color 0 0 0 0))
    (uuid 945b570d-7263-418b-a786-c3d920b992cd)
  )
  (wire (pts (xy 120.65 123.19) (xy 116.84 123.19))
    (stroke (width 0) (type default) (color 0 0 0 0))
    (uuid a097c4f4-8c78-4a45-b0d8-33cdf7ab2d22)
  )
  (wire (pts (xy 116.84 118.11) (xy 116.84 123.19))
    (stroke (width 0) (type default) (color 0 0 0 0))
    (uuid a4ae2d92-a231-43dd-bac7-fecd527d621a)
  )
  (wire (pts (xy 47.625 93.345) (xy 47.625 98.425))
    (stroke (width 0) (type default) (color 0 0 0 0))
    (uuid ab8ad61d-aba5-43ef-bee5-24a9fe4db704)
  )
  (wire (pts (xy 67.31 142.24) (xy 67.31 153.035))
    (stroke (width 0) (type default) (color 0 0 0 0))
    (uuid afa75290-2cd0-4c49-9cf0-57f648f694b1)
  )
  (wire (pts (xy 100.33 121.92) (xy 108.585 121.92))
    (stroke (width 0) (type default) (color 0 0 0 0))
    (uuid b3d1ed7e-7239-42d6-a8d2-ec00c143e727)
  )
  (wire (pts (xy 93.98 93.345) (xy 100.33 93.345))
    (stroke (width 0) (type default) (color 0 0 0 0))
    (uuid b45df930-d0a3-4c10-bfcb-51d0393161e8)
  )
  (wire (pts (xy 47.625 45.72) (xy 47.625 57.15))
    (stroke (width 0) (type default) (color 0 0 0 0))
    (uuid b5ba617d-57cf-4589-9db9-238b864b71e4)
  )
  (wire (pts (xy 81.28 119.38) (xy 81.28 124.46))
    (stroke (width 0) (type default) (color 0 0 0 0))
    (uuid b9978a7a-6381-40e9-b01f-5e0f1474ca13)
  )
  (wire (pts (xy 215.265 52.07) (xy 215.265 60.325))
    (stroke (width 0) (type default) (color 0 0 0 0))
    (uuid bfcd7559-0d1a-4670-af8b-dfeae12e465e)
  )
  (wire (pts (xy 81.28 119.38) (xy 85.09 119.38))
    (stroke (width 0) (type default) (color 0 0 0 0))
    (uuid c08d3791-55fd-4b35-8a92-010ee4942046)
  )
  (wire (pts (xy 105.41 93.345) (xy 130.175 93.345))
    (stroke (width 0) (type default) (color 0 0 0 0))
    (uuid c21d6d0b-8129-45c7-82ae-73f703c27dc8)
  )
  (wire (pts (xy 134.62 93.345) (xy 134.62 90.17))
    (stroke (width 0) (type default) (color 0 0 0 0))
    (uuid c4471055-d659-46db-b1a1-591a3cbe6370)
  )
  (wire (pts (xy 185.42 71.12) (xy 185.42 90.805))
    (stroke (width 0) (type default) (color 0 0 0 0))
    (uuid c5824a5e-f995-42e4-9872-d1f1d23dbf29)
  )
  (wire (pts (xy 58.42 93.345) (xy 93.98 93.345))
    (stroke (width 0) (type default) (color 0 0 0 0))
    (uuid c730be5f-40ba-43c2-8ca9-4001454d8cd8)
  )
  (wire (pts (xy 93.98 57.15) (xy 93.98 84.455))
    (stroke (width 0) (type default) (color 0 0 0 0))
    (uuid c7953d3d-5d90-4c99-80fe-16ebe02869b5)
  )
  (wire (pts (xy 113.665 57.15) (xy 113.665 64.77))
    (stroke (width 0) (type default) (color 0 0 0 0))
    (uuid cdf986ad-c745-4279-b50f-83574da91377)
  )
  (wire (pts (xy 47.625 88.9) (xy 47.625 93.345))
    (stroke (width 0) (type default) (color 0 0 0 0))
    (uuid cf793b92-e9f2-41b5-83fe-573f3a66c6b3)
  )
  (wire (pts (xy 154.305 88.265) (xy 160.02 88.265))
    (stroke (width 0) (type default) (color 0 0 0 0))
    (uuid d5f19fef-f8c5-47d3-b70b-4abfd8b25e47)
  )
  (wire (pts (xy 163.83 71.12) (xy 154.305 71.12))
    (stroke (width 0) (type default) (color 0 0 0 0))
    (uuid dbba742f-d881-4c81-961e-76c0d824b308)
  )
  (wire (pts (xy 154.305 71.12) (xy 154.305 88.265))
    (stroke (width 0) (type default) (color 0 0 0 0))
    (uuid dfa29b2c-607c-4a02-9236-acc890dc7a51)
  )
  (wire (pts (xy 116.84 123.19) (xy 116.84 130.81))
    (stroke (width 0) (type default) (color 0 0 0 0))
    (uuid e26b3b43-e8aa-40cb-9aac-940af68952fa)
  )
  (wire (pts (xy 168.91 71.12) (xy 185.42 71.12))
    (stroke (width 0) (type default) (color 0 0 0 0))
    (uuid e642cfcf-73b3-425d-953b-c6011357cd0d)
  )
  (wire (pts (xy 132.715 99.06) (xy 130.175 99.06))
    (stroke (width 0) (type default) (color 0 0 0 0))
    (uuid eb49da8c-aa47-4a7e-9549-9ab0da034b2d)
  )
  (wire (pts (xy 175.26 90.805) (xy 185.42 90.805))
    (stroke (width 0) (type default) (color 0 0 0 0))
    (uuid eb83143f-0d3b-495c-9e32-2998016e7ee8)
  )
  (wire (pts (xy 116.84 118.11) (xy 120.65 118.11))
    (stroke (width 0) (type default) (color 0 0 0 0))
    (uuid ee62e64a-6cc2-445c-863f-0efc140d1543)
  )
  (wire (pts (xy 108.585 121.92) (xy 108.585 127.635))
    (stroke (width 0) (type default) (color 0 0 0 0))
    (uuid ef56b17c-9657-486c-b4f8-0184860b2cbf)
  )
  (wire (pts (xy 215.265 70.485) (xy 215.265 78.105))
    (stroke (width 0) (type default) (color 0 0 0 0))
    (uuid f4d1123c-d1de-4112-8b47-5cdde3855b10)
  )
  (wire (pts (xy 47.625 57.15) (xy 47.625 83.82))
    (stroke (width 0) (type default) (color 0 0 0 0))
    (uuid f76dda70-28d5-4857-911d-a7bd638b743c)
  )
  (wire (pts (xy 47.625 103.505) (xy 47.625 108.585))
    (stroke (width 0) (type default) (color 0 0 0 0))
    (uuid f879b4bc-cad5-43a7-a5ee-a66c468b82fc)
  )
  (wire (pts (xy 41.91 127) (xy 41.91 134.62))
    (stroke (width 0) (type default) (color 0 0 0 0))
    (uuid fbcb2f43-d612-4128-a444-a000a67f09fa)
  )
  (wire (pts (xy 41.91 121.92) (xy 45.72 121.92))
    (stroke (width 0) (type default) (color 0 0 0 0))
    (uuid fd201574-7d16-47d0-93f1-48c86e84cf62)
  )
  (wire (pts (xy 130.175 93.345) (xy 130.175 99.06))
    (stroke (width 0) (type default) (color 0 0 0 0))
    (uuid ff723b05-3ba7-464a-96ab-d4f7dc316ae9)
  )

  (text ".tran 10u 4m" (at 95.885 27.94 0)
    (effects (font (size 1.27 1.27)) (justify left bottom))
    (uuid 24e6d48d-676e-4583-ad77-71142211af5e)
  )

  (label "Aout" (at 185.42 77.47 0)
    (effects (font (size 1.27 1.27)) (justify left bottom))
    (uuid fba14b71-0158-4b20-bef1-628dc1db8bd1)
  )
  (label "vcc" (at 222.885 52.07 0)
    (effects (font (size 1.27 1.27)) (justify left bottom))
    (uuid fc287b7f-796d-4859-af38-b4f23b54d407)
  )

  (global_label "B0" (shape input) (at 47.625 45.72 90) (fields_autoplaced)
    (effects (font (size 1.27 1.27)) (justify left))
    (uuid 5e9c1210-01f0-4cd6-a358-7cff0f36ff51)
    (property "Intersheet References" "${INTERSHEET_REFS}" (id 0) (at 47.5456 40.8274 90)
      (effects (font (size 1.27 1.27)) (justify left) hide)
    )
  )
  (global_label "Aout_pre" (shape output) (at 132.715 99.06 0) (fields_autoplaced)
    (effects (font (size 1.27 1.27)) (justify left))
    (uuid 63d9f215-4739-4a61-acb8-8420a2c86e78)
    (property "Intersheet References" "${INTERSHEET_REFS}" (id 0) (at 143.2319 98.9806 0)
      (effects (font (size 1.27 1.27)) (justify left) hide)
    )
  )
  (global_label "B2" (shape input) (at 134.62 45.72 90) (fields_autoplaced)
    (effects (font (size 1.27 1.27)) (justify left))
    (uuid 9a136f7a-6cba-46a4-be96-42dd28f12883)
    (property "Intersheet References" "${INTERSHEET_REFS}" (id 0) (at 134.5406 40.8274 90)
      (effects (font (size 1.27 1.27)) (justify left) hide)
    )
  )
  (global_label "B1" (shape input) (at 93.98 45.72 90) (fields_autoplaced)
    (effects (font (size 1.27 1.27)) (justify left))
    (uuid dd837889-ebc5-452d-849d-6fdb34067620)
    (property "Intersheet References" "${INTERSHEET_REFS}" (id 0) (at 93.9006 40.8274 90)
      (effects (font (size 1.27 1.27)) (justify left) hide)
    )
  )

  (symbol (lib_id "Simulation_SPICE:VDC") (at 215.265 65.405 0) (unit 1)
    (in_bom yes) (on_board yes)
    (uuid 0653c94f-cf61-45b6-bea6-7f7b1f438b1d)
    (property "Reference" "V4" (id 0) (at 219.075 62.6751 0)
      (effects (font (size 1.27 1.27)) (justify left))
    )
    (property "Value" "VDC" (id 1) (at 219.075 65.2151 0)
      (effects (font (size 1.27 1.27)) (justify left))
    )
    (property "Footprint" "" (id 2) (at 215.265 65.405 0)
      (effects (font (size 1.27 1.27)) hide)
    )
    (property "Datasheet" "~" (id 3) (at 215.265 65.405 0)
      (effects (font (size 1.27 1.27)) hide)
    )
    (property "Spice_Netlist_Enabled" "Y" (id 4) (at 215.265 65.405 0)
      (effects (font (size 1.27 1.27)) (justify left) hide)
    )
    (property "Spice_Primitive" "V" (id 5) (at 215.265 65.405 0)
      (effects (font (size 1.27 1.27)) (justify left) hide)
    )
    (property "Spice_Model" "dc 5 ac 0" (id 6) (at 219.075 67.7551 0)
      (effects (font (size 1.27 1.27)) (justify left))
    )
    (pin "1" (uuid a9686dbc-c406-4f73-9f0d-0d71f837ad41))
    (pin "2" (uuid b265b37d-5098-4868-9406-b75ad3e186a4))
  )

  (symbol (lib_id "pspice:0") (at 26.67 83.82 0) (unit 1)
    (in_bom yes) (on_board yes) (fields_autoplaced)
    (uuid 0affaae4-32a6-438b-af24-ce5b73b7348c)
    (property "Reference" "#GND02" (id 0) (at 26.67 86.36 0)
      (effects (font (size 1.27 1.27)) hide)
    )
    (property "Value" "0" (id 1) (at 26.67 80.645 0))
    (property "Footprint" "" (id 2) (at 26.67 83.82 0)
      (effects (font (size 1.27 1.27)) hide)
    )
    (property "Datasheet" "~" (id 3) (at 26.67 83.82 0)
      (effects (font (size 1.27 1.27)) hide)
    )
    (pin "1" (uuid 1bf32707-8be5-46eb-9a66-42ce4c620929))
  )

  (symbol (lib_id "Daniel:LM324DT") (at 92.71 121.92 0) (unit 4)
    (in_bom yes) (on_board yes) (fields_autoplaced)
    (uuid 0d13162d-409b-4420-b4c5-e46af686576a)
    (property "Reference" "U1" (id 0) (at 92.71 111.76 0)
      (effects (font (size 1.524 1.524)))
    )
    (property "Value" "LM324DT" (id 1) (at 92.71 115.57 0)
      (effects (font (size 1.524 1.524)))
    )
    (property "Footprint" "digikey-footprints:SOIC-14_W3.9mm" (id 2) (at 97.79 116.84 0)
      (effects (font (size 1.524 1.524)) (justify left) hide)
    )
    (property "Datasheet" "http://www.st.com/content/ccc/resource/technical/document/datasheet/bd/fc/46/43/26/8f/40/7f/CD00001046.pdf/files/CD00001046.pdf/jcr:content/translations/en.CD00001046.pdf" (id 3) (at 97.79 114.3 0)
      (effects (font (size 1.524 1.524)) (justify left) hide)
    )
    (property "Digi-Key_PN" "497-1580-1-ND" (id 4) (at 97.79 111.76 0)
      (effects (font (size 1.524 1.524)) (justify left) hide)
    )
    (property "MPN" "LM324DT" (id 5) (at 97.79 109.22 0)
      (effects (font (size 1.524 1.524)) (justify left) hide)
    )
    (property "Category" "Integrated Circuits (ICs)" (id 6) (at 97.79 106.68 0)
      (effects (font (size 1.524 1.524)) (justify left) hide)
    )
    (property "Family" "Linear - Amplifiers - Instrumentation, OP Amps, Buffer Amps" (id 7) (at 97.79 104.14 0)
      (effects (font (size 1.524 1.524)) (justify left) hide)
    )
    (property "DK_Datasheet_Link" "http://www.st.com/content/ccc/resource/technical/document/datasheet/bd/fc/46/43/26/8f/40/7f/CD00001046.pdf/files/CD00001046.pdf/jcr:content/translations/en.CD00001046.pdf" (id 8) (at 97.79 101.6 0)
      (effects (font (size 1.524 1.524)) (justify left) hide)
    )
    (property "DK_Detail_Page" "/product-detail/en/stmicroelectronics/LM324DT/497-1580-1-ND/592078" (id 9) (at 97.79 99.06 0)
      (effects (font (size 1.524 1.524)) (justify left) hide)
    )
    (property "Description" "IC OPAMP GP 4 CIRCUIT 14SO" (id 10) (at 97.79 96.52 0)
      (effects (font (size 1.524 1.524)) (justify left) hide)
    )
    (property "Manufacturer" "STMicroelectronics" (id 11) (at 97.79 93.98 0)
      (effects (font (size 1.524 1.524)) (justify left) hide)
    )
    (property "Status" "Active" (id 12) (at 97.79 91.44 0)
      (effects (font (size 1.524 1.524)) (justify left) hide)
    )
    (pin "12" (uuid 3a11a8dd-1daf-4c6d-8671-f9c263e8e084))
    (pin "13" (uuid b6b07d3a-cfd9-4017-a968-acd41eb4e0a4))
    (pin "14" (uuid 14c4fae5-fb28-4920-ad2f-60cb673c2b3d))
  )

  (symbol (lib_id "Device:R_Small_US") (at 166.37 71.12 90) (unit 1)
    (in_bom yes) (on_board yes) (fields_autoplaced)
    (uuid 1430a34b-9f0e-4909-a4cb-98789333953f)
    (property "Reference" "R7" (id 0) (at 166.37 65.405 90))
    (property "Value" "1000" (id 1) (at 166.37 67.945 90))
    (property "Footprint" "" (id 2) (at 166.37 71.12 0)
      (effects (font (size 1.27 1.27)) hide)
    )
    (property "Datasheet" "~" (id 3) (at 166.37 71.12 0)
      (effects (font (size 1.27 1.27)) hide)
    )
    (pin "1" (uuid a3edad85-3755-4627-98c0-a47d321b830c))
    (pin "2" (uuid eb671ae5-4dd8-4934-b96d-d766692b04c1))
  )

  (symbol (lib_id "pspice:0") (at 144.145 148.59 0) (unit 1)
    (in_bom yes) (on_board yes) (fields_autoplaced)
    (uuid 1b0871ab-e2e5-43df-9f5c-31c916aeff04)
    (property "Reference" "#GND013" (id 0) (at 144.145 151.13 0)
      (effects (font (size 1.27 1.27)) hide)
    )
    (property "Value" "0" (id 1) (at 144.145 145.415 0))
    (property "Footprint" "" (id 2) (at 144.145 148.59 0)
      (effects (font (size 1.27 1.27)) hide)
    )
    (property "Datasheet" "~" (id 3) (at 144.145 148.59 0)
      (effects (font (size 1.27 1.27)) hide)
    )
    (pin "1" (uuid c02c772d-7760-4524-be30-e60c2d1d56f5))
  )

  (symbol (lib_id "Simulation_SPICE:VPULSE") (at 26.67 70.485 0) (unit 1)
    (in_bom yes) (on_board yes) (fields_autoplaced)
    (uuid 1fd30794-997a-4d1e-9145-0140f7006e15)
    (property "Reference" "V1" (id 0) (at 30.48 67.7551 0)
      (effects (font (size 1.27 1.27)) (justify left))
    )
    (property "Value" "VPULSE" (id 1) (at 30.48 70.2951 0)
      (effects (font (size 1.27 1.27)) (justify left))
    )
    (property "Footprint" "" (id 2) (at 26.67 70.485 0)
      (effects (font (size 1.27 1.27)) hide)
    )
    (property "Datasheet" "~" (id 3) (at 26.67 70.485 0)
      (effects (font (size 1.27 1.27)) hide)
    )
    (property "Spice_Netlist_Enabled" "Y" (id 4) (at 26.67 70.485 0)
      (effects (font (size 1.27 1.27)) (justify left) hide)
    )
    (property "Spice_Primitive" "V" (id 5) (at 26.67 70.485 0)
      (effects (font (size 1.27 1.27)) (justify left) hide)
    )
    (property "Spice_Model" "pulse(0 5 500u 2n 2n 500u 1m)" (id 6) (at 30.48 72.8351 0)
      (effects (font (size 1.27 1.27)) (justify left))
    )
    (pin "1" (uuid 50a18967-e16f-43b4-8999-c3edd8be0c2d))
    (pin "2" (uuid 507e0c88-add5-43b8-a9a8-048f7ddc59ec))
  )

  (symbol (lib_id "Daniel:LM324DT") (at 167.64 90.805 0) (unit 2)
    (in_bom yes) (on_board yes)
    (uuid 242dd165-1a81-4709-90c9-97d1ab48ca8d)
    (property "Reference" "U1" (id 0) (at 164.465 97.79 0)
      (effects (font (size 1.524 1.524)))
    )
    (property "Value" "LM324DT" (id 1) (at 167.64 84.455 0)
      (effects (font (size 1.524 1.524)))
    )
    (property "Footprint" "digikey-footprints:SOIC-14_W3.9mm" (id 2) (at 172.72 85.725 0)
      (effects (font (size 1.524 1.524)) (justify left) hide)
    )
    (property "Datasheet" "http://www.st.com/content/ccc/resource/technical/document/datasheet/bd/fc/46/43/26/8f/40/7f/CD00001046.pdf/files/CD00001046.pdf/jcr:content/translations/en.CD00001046.pdf" (id 3) (at 172.72 83.185 0)
      (effects (font (size 1.524 1.524)) (justify left) hide)
    )
    (property "Digi-Key_PN" "497-1580-1-ND" (id 4) (at 172.72 80.645 0)
      (effects (font (size 1.524 1.524)) (justify left) hide)
    )
    (property "MPN" "LM324DT" (id 5) (at 172.72 78.105 0)
      (effects (font (size 1.524 1.524)) (justify left) hide)
    )
    (property "Category" "Integrated Circuits (ICs)" (id 6) (at 172.72 75.565 0)
      (effects (font (size 1.524 1.524)) (justify left) hide)
    )
    (property "Family" "Linear - Amplifiers - Instrumentation, OP Amps, Buffer Amps" (id 7) (at 172.72 73.025 0)
      (effects (font (size 1.524 1.524)) (justify left) hide)
    )
    (property "DK_Datasheet_Link" "http://www.st.com/content/ccc/resource/technical/document/datasheet/bd/fc/46/43/26/8f/40/7f/CD00001046.pdf/files/CD00001046.pdf/jcr:content/translations/en.CD00001046.pdf" (id 8) (at 172.72 70.485 0)
      (effects (font (size 1.524 1.524)) (justify left) hide)
    )
    (property "DK_Detail_Page" "/product-detail/en/stmicroelectronics/LM324DT/497-1580-1-ND/592078" (id 9) (at 172.72 67.945 0)
      (effects (font (size 1.524 1.524)) (justify left) hide)
    )
    (property "Description" "IC OPAMP GP 4 CIRCUIT 14SO" (id 10) (at 172.72 65.405 0)
      (effects (font (size 1.524 1.524)) (justify left) hide)
    )
    (property "Manufacturer" "STMicroelectronics" (id 11) (at 172.72 62.865 0)
      (effects (font (size 1.524 1.524)) (justify left) hide)
    )
    (property "Status" "Active" (id 12) (at 172.72 60.325 0)
      (effects (font (size 1.524 1.524)) (justify left) hide)
    )
    (property "Spice_Primitive" "X" (id 13) (at 167.64 90.805 0)
      (effects (font (size 1.27 1.27)) hide)
    )
    (property "Spice_Model" "LMX24_LM2902" (id 14) (at 167.64 90.805 0)
      (effects (font (size 1.27 1.27)) hide)
    )
    (property "Spice_Netlist_Enabled" "Y" (id 15) (at 167.64 90.805 0)
      (effects (font (size 1.27 1.27)) hide)
    )
    (property "Spice_Lib_File" "C:\\git\\spice models\\LM324_PSPICE\\lmx24_lm2902.lib" (id 16) (at 167.64 90.805 0)
      (effects (font (size 1.27 1.27)) hide)
    )
    (pin "5" (uuid 06bd27df-3465-413b-8e85-658fd65e2aee))
    (pin "6" (uuid f93f4a85-1b9a-4af2-800f-6d992ef00668))
    (pin "7" (uuid ea15f953-5924-45c8-a638-e67a6fd51113))
  )

  (symbol (lib_id "Device:R_Small_US") (at 55.88 93.345 90) (unit 1)
    (in_bom yes) (on_board yes) (fields_autoplaced)
    (uuid 46329349-3c56-4193-9db4-d71ea485cb91)
    (property "Reference" "R3" (id 0) (at 55.88 87.63 90))
    (property "Value" "500" (id 1) (at 55.88 90.17 90))
    (property "Footprint" "" (id 2) (at 55.88 93.345 0)
      (effects (font (size 1.27 1.27)) hide)
    )
    (property "Datasheet" "~" (id 3) (at 55.88 93.345 0)
      (effects (font (size 1.27 1.27)) hide)
    )
    (pin "1" (uuid 258aff96-fec5-4659-86db-6513f5d0702f))
    (pin "2" (uuid e0f30397-c5d2-4ce5-b80d-52607088d98b))
  )

  (symbol (lib_id "pspice:0") (at 234.95 76.835 0) (unit 1)
    (in_bom yes) (on_board yes) (fields_autoplaced)
    (uuid 49429740-0b7f-46f7-9a66-b3e007c4c760)
    (property "Reference" "#GND07" (id 0) (at 234.95 79.375 0)
      (effects (font (size 1.27 1.27)) hide)
    )
    (property "Value" "0" (id 1) (at 234.95 73.66 0))
    (property "Footprint" "" (id 2) (at 234.95 76.835 0)
      (effects (font (size 1.27 1.27)) hide)
    )
    (property "Datasheet" "~" (id 3) (at 234.95 76.835 0)
      (effects (font (size 1.27 1.27)) hide)
    )
    (pin "1" (uuid bba5da3c-ae6d-4be3-875c-3f7ef6e3d315))
  )

  (symbol (lib_id "Device:R_Small_US") (at 47.625 86.36 0) (unit 1)
    (in_bom yes) (on_board yes) (fields_autoplaced)
    (uuid 4aafe0f6-8cf9-4338-8a9f-4662f012cb4e)
    (property "Reference" "R1" (id 0) (at 50.165 85.0899 0)
      (effects (font (size 1.27 1.27)) (justify left))
    )
    (property "Value" "1000" (id 1) (at 50.165 87.6299 0)
      (effects (font (size 1.27 1.27)) (justify left))
    )
    (property "Footprint" "" (id 2) (at 47.625 86.36 0)
      (effects (font (size 1.27 1.27)) hide)
    )
    (property "Datasheet" "~" (id 3) (at 47.625 86.36 0)
      (effects (font (size 1.27 1.27)) hide)
    )
    (pin "1" (uuid d826a91d-de56-4a72-9ed3-fbb59f60104d))
    (pin "2" (uuid 35c1992b-f7b6-40f0-9a63-c34be08afb81))
  )

  (symbol (lib_id "pspice:CAP") (at 67.31 135.89 0) (unit 1)
    (in_bom yes) (on_board yes) (fields_autoplaced)
    (uuid 65662229-2912-449b-8d78-95c42c204b93)
    (property "Reference" "C2" (id 0) (at 72.39 134.6199 0)
      (effects (font (size 1.27 1.27)) (justify left))
    )
    (property "Value" "1n" (id 1) (at 72.39 137.1599 0)
      (effects (font (size 1.27 1.27)) (justify left))
    )
    (property "Footprint" "" (id 2) (at 67.31 135.89 0)
      (effects (font (size 1.27 1.27)) hide)
    )
    (property "Datasheet" "~" (id 3) (at 67.31 135.89 0)
      (effects (font (size 1.27 1.27)) hide)
    )
    (property "Spice_Primitive" "C" (id 4) (at 67.31 135.89 0)
      (effects (font (size 1.27 1.27)) hide)
    )
    (property "Spice_Model" "1n" (id 5) (at 67.31 135.89 0)
      (effects (font (size 1.27 1.27)) hide)
    )
    (property "Spice_Netlist_Enabled" "Y" (id 6) (at 67.31 135.89 0)
      (effects (font (size 1.27 1.27)) hide)
    )
    (pin "1" (uuid 068cabf6-1739-4095-b064-2c8859eb6905))
    (pin "2" (uuid 0fb09d75-11ba-446c-b089-2deed4c1899e))
  )

  (symbol (lib_id "pspice:0") (at 41.91 134.62 0) (unit 1)
    (in_bom yes) (on_board yes) (fields_autoplaced)
    (uuid 68832318-5241-4fce-b581-b0373149e0f0)
    (property "Reference" "#GND08" (id 0) (at 41.91 137.16 0)
      (effects (font (size 1.27 1.27)) hide)
    )
    (property "Value" "0" (id 1) (at 41.91 131.445 0))
    (property "Footprint" "" (id 2) (at 41.91 134.62 0)
      (effects (font (size 1.27 1.27)) hide)
    )
    (property "Datasheet" "~" (id 3) (at 41.91 134.62 0)
      (effects (font (size 1.27 1.27)) hide)
    )
    (pin "1" (uuid 50678b7d-1d4a-4dd8-bb70-023a804eaa8d))
  )

  (symbol (lib_id "pspice:0") (at 67.31 153.035 0) (unit 1)
    (in_bom yes) (on_board yes) (fields_autoplaced)
    (uuid 6daea703-dc7e-44c4-a837-8b936f9c0b80)
    (property "Reference" "#GND09" (id 0) (at 67.31 155.575 0)
      (effects (font (size 1.27 1.27)) hide)
    )
    (property "Value" "0" (id 1) (at 67.31 149.86 0))
    (property "Footprint" "" (id 2) (at 67.31 153.035 0)
      (effects (font (size 1.27 1.27)) hide)
    )
    (property "Datasheet" "~" (id 3) (at 67.31 153.035 0)
      (effects (font (size 1.27 1.27)) hide)
    )
    (pin "1" (uuid 0845b079-8620-4514-b892-c8d0ab0d847c))
  )

  (symbol (lib_id "Device:R_Small_US") (at 134.62 87.63 0) (unit 1)
    (in_bom yes) (on_board yes) (fields_autoplaced)
    (uuid 74b08a0e-1ba5-48fc-a43e-e139d3689b89)
    (property "Reference" "R6" (id 0) (at 137.16 86.3599 0)
      (effects (font (size 1.27 1.27)) (justify left))
    )
    (property "Value" "1000" (id 1) (at 137.16 88.8999 0)
      (effects (font (size 1.27 1.27)) (justify left))
    )
    (property "Footprint" "" (id 2) (at 134.62 87.63 0)
      (effects (font (size 1.27 1.27)) hide)
    )
    (property "Datasheet" "~" (id 3) (at 134.62 87.63 0)
      (effects (font (size 1.27 1.27)) hide)
    )
    (pin "1" (uuid 8b42740f-f46d-4da7-9907-3b2bfcb629af))
    (pin "2" (uuid e04174ec-9924-4a88-b7dc-39b94d2d73b2))
  )

  (symbol (lib_id "Daniel:LM324DT") (at 128.27 120.65 0) (unit 3)
    (in_bom yes) (on_board yes) (fields_autoplaced)
    (uuid 790757e7-194b-4cfc-ab85-0ba9b1e7a17c)
    (property "Reference" "U1" (id 0) (at 128.27 110.49 0)
      (effects (font (size 1.524 1.524)))
    )
    (property "Value" "LM324DT" (id 1) (at 128.27 114.3 0)
      (effects (font (size 1.524 1.524)))
    )
    (property "Footprint" "digikey-footprints:SOIC-14_W3.9mm" (id 2) (at 133.35 115.57 0)
      (effects (font (size 1.524 1.524)) (justify left) hide)
    )
    (property "Datasheet" "http://www.st.com/content/ccc/resource/technical/document/datasheet/bd/fc/46/43/26/8f/40/7f/CD00001046.pdf/files/CD00001046.pdf/jcr:content/translations/en.CD00001046.pdf" (id 3) (at 133.35 113.03 0)
      (effects (font (size 1.524 1.524)) (justify left) hide)
    )
    (property "Digi-Key_PN" "497-1580-1-ND" (id 4) (at 133.35 110.49 0)
      (effects (font (size 1.524 1.524)) (justify left) hide)
    )
    (property "MPN" "LM324DT" (id 5) (at 133.35 107.95 0)
      (effects (font (size 1.524 1.524)) (justify left) hide)
    )
    (property "Category" "Integrated Circuits (ICs)" (id 6) (at 133.35 105.41 0)
      (effects (font (size 1.524 1.524)) (justify left) hide)
    )
    (property "Family" "Linear - Amplifiers - Instrumentation, OP Amps, Buffer Amps" (id 7) (at 133.35 102.87 0)
      (effects (font (size 1.524 1.524)) (justify left) hide)
    )
    (property "DK_Datasheet_Link" "http://www.st.com/content/ccc/resource/technical/document/datasheet/bd/fc/46/43/26/8f/40/7f/CD00001046.pdf/files/CD00001046.pdf/jcr:content/translations/en.CD00001046.pdf" (id 8) (at 133.35 100.33 0)
      (effects (font (size 1.524 1.524)) (justify left) hide)
    )
    (property "DK_Detail_Page" "/product-detail/en/stmicroelectronics/LM324DT/497-1580-1-ND/592078" (id 9) (at 133.35 97.79 0)
      (effects (font (size 1.524 1.524)) (justify left) hide)
    )
    (property "Description" "IC OPAMP GP 4 CIRCUIT 14SO" (id 10) (at 133.35 95.25 0)
      (effects (font (size 1.524 1.524)) (justify left) hide)
    )
    (property "Manufacturer" "STMicroelectronics" (id 11) (at 133.35 92.71 0)
      (effects (font (size 1.524 1.524)) (justify left) hide)
    )
    (property "Status" "Active" (id 12) (at 133.35 90.17 0)
      (effects (font (size 1.524 1.524)) (justify left) hide)
    )
    (pin "10" (uuid 04b23d07-0b5c-449f-abd1-410c928736ae))
    (pin "8" (uuid a21de0e9-d7b9-49dc-86f8-07dc74c0b9be))
    (pin "9" (uuid ec9a6455-c6a8-4cb1-afa2-a43b3d73b030))
  )

  (symbol (lib_id "Simulation_SPICE:VPULSE") (at 113.665 69.85 0) (unit 1)
    (in_bom yes) (on_board yes)
    (uuid 88f31963-f574-479c-b082-3bf88193e8a0)
    (property "Reference" "V3" (id 0) (at 117.475 67.1201 0)
      (effects (font (size 1.27 1.27)) (justify left))
    )
    (property "Value" "VPULSE" (id 1) (at 117.475 69.6601 0)
      (effects (font (size 1.27 1.27)) (justify left))
    )
    (property "Footprint" "" (id 2) (at 113.665 69.85 0)
      (effects (font (size 1.27 1.27)) hide)
    )
    (property "Datasheet" "~" (id 3) (at 113.665 69.85 0)
      (effects (font (size 1.27 1.27)) hide)
    )
    (property "Spice_Netlist_Enabled" "Y" (id 4) (at 113.665 69.85 0)
      (effects (font (size 1.27 1.27)) (justify left) hide)
    )
    (property "Spice_Primitive" "V" (id 5) (at 113.665 69.85 0)
      (effects (font (size 1.27 1.27)) (justify left) hide)
    )
    (property "Spice_Model" "pulse(0 5 2m 2n 2n 2m 4m)" (id 6) (at 117.475 72.39 0)
      (effects (font (size 1.27 1.27)) (justify left))
    )
    (pin "1" (uuid 641d2440-91de-4e7b-b3cc-ea98d1e2192a))
    (pin "2" (uuid 7f5fa170-7938-422e-8987-371c0522e15a))
  )

  (symbol (lib_id "pspice:0") (at 47.625 108.585 0) (unit 1)
    (in_bom yes) (on_board yes) (fields_autoplaced)
    (uuid 93a9c6b2-215c-4847-b3e5-82a44b7586e7)
    (property "Reference" "#GND03" (id 0) (at 47.625 111.125 0)
      (effects (font (size 1.27 1.27)) hide)
    )
    (property "Value" "0" (id 1) (at 47.625 105.41 0))
    (property "Footprint" "" (id 2) (at 47.625 108.585 0)
      (effects (font (size 1.27 1.27)) hide)
    )
    (property "Datasheet" "~" (id 3) (at 47.625 108.585 0)
      (effects (font (size 1.27 1.27)) hide)
    )
    (pin "1" (uuid 20fbe28f-f758-4b2b-981a-12e8e8a633a4))
  )

  (symbol (lib_id "pspice:CAP") (at 185.42 99.695 0) (unit 1)
    (in_bom yes) (on_board yes) (fields_autoplaced)
    (uuid 93c89fd6-128f-42db-89bb-361e82bc2aae)
    (property "Reference" "C1" (id 0) (at 190.5 98.4249 0)
      (effects (font (size 1.27 1.27)) (justify left))
    )
    (property "Value" "1n" (id 1) (at 190.5 100.9649 0)
      (effects (font (size 1.27 1.27)) (justify left))
    )
    (property "Footprint" "" (id 2) (at 185.42 99.695 0)
      (effects (font (size 1.27 1.27)) hide)
    )
    (property "Datasheet" "~" (id 3) (at 185.42 99.695 0)
      (effects (font (size 1.27 1.27)) hide)
    )
    (property "Spice_Primitive" "C" (id 4) (at 185.42 99.695 0)
      (effects (font (size 1.27 1.27)) hide)
    )
    (property "Spice_Model" "1n" (id 5) (at 185.42 99.695 0)
      (effects (font (size 1.27 1.27)) hide)
    )
    (property "Spice_Netlist_Enabled" "Y" (id 6) (at 185.42 99.695 0)
      (effects (font (size 1.27 1.27)) hide)
    )
    (pin "1" (uuid 252c6669-e57a-40fe-b47d-50fde6a24c70))
    (pin "2" (uuid 11496e30-4bb4-4474-953e-ba05a27b3919))
  )

  (symbol (lib_id "pspice:CAP") (at 108.585 133.985 0) (unit 1)
    (in_bom yes) (on_board yes) (fields_autoplaced)
    (uuid 9f159477-ff3e-45b7-8509-550b7ce7f26e)
    (property "Reference" "C3" (id 0) (at 113.665 132.7149 0)
      (effects (font (size 1.27 1.27)) (justify left))
    )
    (property "Value" "1n" (id 1) (at 113.665 135.2549 0)
      (effects (font (size 1.27 1.27)) (justify left))
    )
    (property "Footprint" "" (id 2) (at 108.585 133.985 0)
      (effects (font (size 1.27 1.27)) hide)
    )
    (property "Datasheet" "~" (id 3) (at 108.585 133.985 0)
      (effects (font (size 1.27 1.27)) hide)
    )
    (property "Spice_Primitive" "C" (id 4) (at 108.585 133.985 0)
      (effects (font (size 1.27 1.27)) hide)
    )
    (property "Spice_Model" "1n" (id 5) (at 108.585 133.985 0)
      (effects (font (size 1.27 1.27)) hide)
    )
    (property "Spice_Netlist_Enabled" "Y" (id 6) (at 108.585 133.985 0)
      (effects (font (size 1.27 1.27)) hide)
    )
    (pin "1" (uuid a69e72e4-965f-4ba7-b35f-a4075a7358e5))
    (pin "2" (uuid ba218f16-f015-4542-8a12-cb64f8aaab72))
  )

  (symbol (lib_id "Device:R_Small_US") (at 47.625 100.965 0) (unit 1)
    (in_bom yes) (on_board yes) (fields_autoplaced)
    (uuid a1966828-8590-4c79-a6f0-1550784116c2)
    (property "Reference" "R2" (id 0) (at 50.165 99.6949 0)
      (effects (font (size 1.27 1.27)) (justify left))
    )
    (property "Value" "1000" (id 1) (at 50.165 102.2349 0)
      (effects (font (size 1.27 1.27)) (justify left))
    )
    (property "Footprint" "" (id 2) (at 47.625 100.965 0)
      (effects (font (size 1.27 1.27)) hide)
    )
    (property "Datasheet" "~" (id 3) (at 47.625 100.965 0)
      (effects (font (size 1.27 1.27)) hide)
    )
    (pin "1" (uuid d3751458-a7be-453d-b111-dab9ebc0bc4b))
    (pin "2" (uuid e8af25d4-ba0f-4ee0-a3d2-8e37334f462e))
  )

  (symbol (lib_id "pspice:0") (at 185.42 116.84 0) (unit 1)
    (in_bom yes) (on_board yes) (fields_autoplaced)
    (uuid a677c2da-099d-4dba-bc7a-f077c2db3c24)
    (property "Reference" "#GND06" (id 0) (at 185.42 119.38 0)
      (effects (font (size 1.27 1.27)) hide)
    )
    (property "Value" "0" (id 1) (at 185.42 113.665 0))
    (property "Footprint" "" (id 2) (at 185.42 116.84 0)
      (effects (font (size 1.27 1.27)) hide)
    )
    (property "Datasheet" "~" (id 3) (at 185.42 116.84 0)
      (effects (font (size 1.27 1.27)) hide)
    )
    (pin "1" (uuid abb054d9-47d4-4441-a6a0-533189f2af00))
  )

  (symbol (lib_id "Daniel:LM324DT") (at 234.95 65.405 0) (unit 1)
    (in_bom yes) (on_board yes) (fields_autoplaced)
    (uuid a8460718-c38c-470d-93e0-ab2ad7616ba6)
    (property "Reference" "U1" (id 0) (at 237.49 64.135 0)
      (effects (font (size 1.524 1.524)) (justify left))
    )
    (property "Value" "LM324DT" (id 1) (at 237.49 67.945 0)
      (effects (font (size 1.524 1.524)) (justify left))
    )
    (property "Footprint" "digikey-footprints:SOIC-14_W3.9mm" (id 2) (at 240.03 60.325 0)
      (effects (font (size 1.524 1.524)) (justify left) hide)
    )
    (property "Datasheet" "http://www.st.com/content/ccc/resource/technical/document/datasheet/bd/fc/46/43/26/8f/40/7f/CD00001046.pdf/files/CD00001046.pdf/jcr:content/translations/en.CD00001046.pdf" (id 3) (at 240.03 57.785 0)
      (effects (font (size 1.524 1.524)) (justify left) hide)
    )
    (property "Digi-Key_PN" "497-1580-1-ND" (id 4) (at 240.03 55.245 0)
      (effects (font (size 1.524 1.524)) (justify left) hide)
    )
    (property "MPN" "LM324DT" (id 5) (at 240.03 52.705 0)
      (effects (font (size 1.524 1.524)) (justify left) hide)
    )
    (property "Category" "Integrated Circuits (ICs)" (id 6) (at 240.03 50.165 0)
      (effects (font (size 1.524 1.524)) (justify left) hide)
    )
    (property "Family" "Linear - Amplifiers - Instrumentation, OP Amps, Buffer Amps" (id 7) (at 240.03 47.625 0)
      (effects (font (size 1.524 1.524)) (justify left) hide)
    )
    (property "DK_Datasheet_Link" "http://www.st.com/content/ccc/resource/technical/document/datasheet/bd/fc/46/43/26/8f/40/7f/CD00001046.pdf/files/CD00001046.pdf/jcr:content/translations/en.CD00001046.pdf" (id 8) (at 240.03 45.085 0)
      (effects (font (size 1.524 1.524)) (justify left) hide)
    )
    (property "DK_Detail_Page" "/product-detail/en/stmicroelectronics/LM324DT/497-1580-1-ND/592078" (id 9) (at 240.03 42.545 0)
      (effects (font (size 1.524 1.524)) (justify left) hide)
    )
    (property "Description" "IC OPAMP GP 4 CIRCUIT 14SO" (id 10) (at 240.03 40.005 0)
      (effects (font (size 1.524 1.524)) (justify left) hide)
    )
    (property "Manufacturer" "STMicroelectronics" (id 11) (at 240.03 37.465 0)
      (effects (font (size 1.524 1.524)) (justify left) hide)
    )
    (property "Status" "Active" (id 12) (at 240.03 34.925 0)
      (effects (font (size 1.524 1.524)) (justify left) hide)
    )
    (pin "11" (uuid 03258676-c648-49c4-ba77-898eff68a8dc))
    (pin "4" (uuid e316dba4-911c-48eb-9724-42c54b75054f))
  )

  (symbol (lib_id "pspice:0") (at 81.28 132.08 0) (unit 1)
    (in_bom yes) (on_board yes) (fields_autoplaced)
    (uuid aac8bdf6-4305-4ee6-b852-1bb3b323e7ab)
    (property "Reference" "#GND010" (id 0) (at 81.28 134.62 0)
      (effects (font (size 1.27 1.27)) hide)
    )
    (property "Value" "0" (id 1) (at 81.28 128.905 0))
    (property "Footprint" "" (id 2) (at 81.28 132.08 0)
      (effects (font (size 1.27 1.27)) hide)
    )
    (property "Datasheet" "~" (id 3) (at 81.28 132.08 0)
      (effects (font (size 1.27 1.27)) hide)
    )
    (pin "1" (uuid 0b74d9b3-a1f0-4179-82de-250533c51c21))
  )

  (symbol (lib_id "pspice:0") (at 116.84 130.81 0) (unit 1)
    (in_bom yes) (on_board yes) (fields_autoplaced)
    (uuid af40fa6f-cc4e-4da9-b580-c8949b9d7bee)
    (property "Reference" "#GND011" (id 0) (at 116.84 133.35 0)
      (effects (font (size 1.27 1.27)) hide)
    )
    (property "Value" "0" (id 1) (at 116.84 127.635 0))
    (property "Footprint" "" (id 2) (at 116.84 130.81 0)
      (effects (font (size 1.27 1.27)) hide)
    )
    (property "Datasheet" "~" (id 3) (at 116.84 130.81 0)
      (effects (font (size 1.27 1.27)) hide)
    )
    (pin "1" (uuid c62118a9-a6bf-41eb-ba51-b11f7a8fc264))
  )

  (symbol (lib_id "pspice:0") (at 73.025 79.375 0) (unit 1)
    (in_bom yes) (on_board yes) (fields_autoplaced)
    (uuid b5a89c21-ca4a-4dde-ae5e-891b488bff81)
    (property "Reference" "#GND04" (id 0) (at 73.025 81.915 0)
      (effects (font (size 1.27 1.27)) hide)
    )
    (property "Value" "0" (id 1) (at 73.025 76.2 0))
    (property "Footprint" "" (id 2) (at 73.025 79.375 0)
      (effects (font (size 1.27 1.27)) hide)
    )
    (property "Datasheet" "~" (id 3) (at 73.025 79.375 0)
      (effects (font (size 1.27 1.27)) hide)
    )
    (pin "1" (uuid ca4f062d-044f-4464-8205-bf5a2e9ec952))
  )

  (symbol (lib_id "pspice:0") (at 113.665 81.28 0) (unit 1)
    (in_bom yes) (on_board yes) (fields_autoplaced)
    (uuid b8747592-1c17-4ee5-acd5-bbd45338cc81)
    (property "Reference" "#GND05" (id 0) (at 113.665 83.82 0)
      (effects (font (size 1.27 1.27)) hide)
    )
    (property "Value" "0" (id 1) (at 113.665 78.105 0))
    (property "Footprint" "" (id 2) (at 113.665 81.28 0)
      (effects (font (size 1.27 1.27)) hide)
    )
    (property "Datasheet" "~" (id 3) (at 113.665 81.28 0)
      (effects (font (size 1.27 1.27)) hide)
    )
    (pin "1" (uuid 98b18d3f-a204-4e54-86c2-7a969c7dc399))
  )

  (symbol (lib_id "Simulation_SPICE:VPULSE") (at 73.025 70.485 0) (unit 1)
    (in_bom yes) (on_board yes) (fields_autoplaced)
    (uuid c565c994-7cbf-45d7-8631-915effea4042)
    (property "Reference" "V2" (id 0) (at 77.47 67.7551 0)
      (effects (font (size 1.27 1.27)) (justify left))
    )
    (property "Value" "VPULSE" (id 1) (at 77.47 70.2951 0)
      (effects (font (size 1.27 1.27)) (justify left))
    )
    (property "Footprint" "" (id 2) (at 73.025 70.485 0)
      (effects (font (size 1.27 1.27)) hide)
    )
    (property "Datasheet" "~" (id 3) (at 73.025 70.485 0)
      (effects (font (size 1.27 1.27)) hide)
    )
    (property "Spice_Netlist_Enabled" "Y" (id 4) (at 73.025 70.485 0)
      (effects (font (size 1.27 1.27)) (justify left) hide)
    )
    (property "Spice_Primitive" "V" (id 5) (at 73.025 70.485 0)
      (effects (font (size 1.27 1.27)) (justify left) hide)
    )
    (property "Spice_Model" "pulse(0 5 1m 2n 2n 1m 2m)" (id 6) (at 77.47 72.8351 0)
      (effects (font (size 1.27 1.27)) (justify left))
    )
    (pin "1" (uuid e3333c4b-9837-42d8-82fb-062481520e81))
    (pin "2" (uuid 9413d8f3-ae54-408f-9336-c3375a80e247))
  )

  (symbol (lib_id "pspice:0") (at 215.265 78.105 0) (unit 1)
    (in_bom yes) (on_board yes) (fields_autoplaced)
    (uuid c60b6478-6539-4421-85ad-7566fd84c1f0)
    (property "Reference" "#GND01" (id 0) (at 215.265 80.645 0)
      (effects (font (size 1.27 1.27)) hide)
    )
    (property "Value" "0" (id 1) (at 215.265 74.93 0))
    (property "Footprint" "" (id 2) (at 215.265 78.105 0)
      (effects (font (size 1.27 1.27)) hide)
    )
    (property "Datasheet" "~" (id 3) (at 215.265 78.105 0)
      (effects (font (size 1.27 1.27)) hide)
    )
    (pin "1" (uuid 20383598-e3f7-48a3-b91c-a409851c7fe5))
  )

  (symbol (lib_id "pspice:0") (at 108.585 151.13 0) (unit 1)
    (in_bom yes) (on_board yes) (fields_autoplaced)
    (uuid cc2cab03-99f4-4a36-aff0-399af1820dcf)
    (property "Reference" "#GND012" (id 0) (at 108.585 153.67 0)
      (effects (font (size 1.27 1.27)) hide)
    )
    (property "Value" "0" (id 1) (at 108.585 147.955 0))
    (property "Footprint" "" (id 2) (at 108.585 151.13 0)
      (effects (font (size 1.27 1.27)) hide)
    )
    (property "Datasheet" "~" (id 3) (at 108.585 151.13 0)
      (effects (font (size 1.27 1.27)) hide)
    )
    (pin "1" (uuid 4c57ab23-24ba-47d8-a2a9-4f3ee0e8dc00))
  )

  (symbol (lib_id "Daniel:LM324DT") (at 53.34 124.46 0) (unit 5)
    (in_bom yes) (on_board yes) (fields_autoplaced)
    (uuid df4ae055-8edb-4b92-91b9-bbdcbc16dc96)
    (property "Reference" "U1" (id 0) (at 53.34 114.3 0)
      (effects (font (size 1.524 1.524)))
    )
    (property "Value" "LM324DT" (id 1) (at 53.34 118.11 0)
      (effects (font (size 1.524 1.524)))
    )
    (property "Footprint" "digikey-footprints:SOIC-14_W3.9mm" (id 2) (at 58.42 119.38 0)
      (effects (font (size 1.524 1.524)) (justify left) hide)
    )
    (property "Datasheet" "http://www.st.com/content/ccc/resource/technical/document/datasheet/bd/fc/46/43/26/8f/40/7f/CD00001046.pdf/files/CD00001046.pdf/jcr:content/translations/en.CD00001046.pdf" (id 3) (at 58.42 116.84 0)
      (effects (font (size 1.524 1.524)) (justify left) hide)
    )
    (property "Digi-Key_PN" "497-1580-1-ND" (id 4) (at 58.42 114.3 0)
      (effects (font (size 1.524 1.524)) (justify left) hide)
    )
    (property "MPN" "LM324DT" (id 5) (at 58.42 111.76 0)
      (effects (font (size 1.524 1.524)) (justify left) hide)
    )
    (property "Category" "Integrated Circuits (ICs)" (id 6) (at 58.42 109.22 0)
      (effects (font (size 1.524 1.524)) (justify left) hide)
    )
    (property "Family" "Linear - Amplifiers - Instrumentation, OP Amps, Buffer Amps" (id 7) (at 58.42 106.68 0)
      (effects (font (size 1.524 1.524)) (justify left) hide)
    )
    (property "DK_Datasheet_Link" "http://www.st.com/content/ccc/resource/technical/document/datasheet/bd/fc/46/43/26/8f/40/7f/CD00001046.pdf/files/CD00001046.pdf/jcr:content/translations/en.CD00001046.pdf" (id 8) (at 58.42 104.14 0)
      (effects (font (size 1.524 1.524)) (justify left) hide)
    )
    (property "DK_Detail_Page" "/product-detail/en/stmicroelectronics/LM324DT/497-1580-1-ND/592078" (id 9) (at 58.42 101.6 0)
      (effects (font (size 1.524 1.524)) (justify left) hide)
    )
    (property "Description" "IC OPAMP GP 4 CIRCUIT 14SO" (id 10) (at 58.42 99.06 0)
      (effects (font (size 1.524 1.524)) (justify left) hide)
    )
    (property "Manufacturer" "STMicroelectronics" (id 11) (at 58.42 96.52 0)
      (effects (font (size 1.524 1.524)) (justify left) hide)
    )
    (property "Status" "Active" (id 12) (at 58.42 93.98 0)
      (effects (font (size 1.524 1.524)) (justify left) hide)
    )
    (pin "1" (uuid 94349518-71ce-46c7-af31-bfdfee2b7e33))
    (pin "2" (uuid 079af237-58ff-4e33-8818-2e8c99811b80))
    (pin "3" (uuid dae92faa-1a97-4d74-938a-7d59f3add11f))
  )

  (symbol (lib_id "Device:R_Small_US") (at 93.98 86.995 180) (unit 1)
    (in_bom yes) (on_board yes) (fields_autoplaced)
    (uuid e457e621-a68e-4e02-adcf-5bff5441a9d7)
    (property "Reference" "R4" (id 0) (at 95.885 85.7249 0)
      (effects (font (size 1.27 1.27)) (justify right))
    )
    (property "Value" "1000" (id 1) (at 95.885 88.2649 0)
      (effects (font (size 1.27 1.27)) (justify right))
    )
    (property "Footprint" "" (id 2) (at 93.98 86.995 0)
      (effects (font (size 1.27 1.27)) hide)
    )
    (property "Datasheet" "~" (id 3) (at 93.98 86.995 0)
      (effects (font (size 1.27 1.27)) hide)
    )
    (pin "1" (uuid 025194c8-e5be-4e10-b05e-db97aaab28a1))
    (pin "2" (uuid 33f4acb7-2a8a-46f3-99c1-00ea9a1abe03))
  )

  (symbol (lib_id "pspice:CAP") (at 144.145 131.445 0) (unit 1)
    (in_bom yes) (on_board yes) (fields_autoplaced)
    (uuid ea8a6737-e5a4-4276-bd71-27f98f85ee56)
    (property "Reference" "C4" (id 0) (at 149.225 130.1749 0)
      (effects (font (size 1.27 1.27)) (justify left))
    )
    (property "Value" "1n" (id 1) (at 149.225 132.7149 0)
      (effects (font (size 1.27 1.27)) (justify left))
    )
    (property "Footprint" "" (id 2) (at 144.145 131.445 0)
      (effects (font (size 1.27 1.27)) hide)
    )
    (property "Datasheet" "~" (id 3) (at 144.145 131.445 0)
      (effects (font (size 1.27 1.27)) hide)
    )
    (property "Spice_Primitive" "C" (id 4) (at 144.145 131.445 0)
      (effects (font (size 1.27 1.27)) hide)
    )
    (property "Spice_Model" "1n" (id 5) (at 144.145 131.445 0)
      (effects (font (size 1.27 1.27)) hide)
    )
    (property "Spice_Netlist_Enabled" "Y" (id 6) (at 144.145 131.445 0)
      (effects (font (size 1.27 1.27)) hide)
    )
    (pin "1" (uuid b673e105-9df7-46f5-aeb9-7e47313605af))
    (pin "2" (uuid d996f105-c473-46b6-bc6c-7491b872595b))
  )

  (symbol (lib_id "Device:R_Small_US") (at 102.87 93.345 90) (unit 1)
    (in_bom yes) (on_board yes) (fields_autoplaced)
    (uuid f30a08f8-1777-41f6-9399-93012db3c2ab)
    (property "Reference" "R5" (id 0) (at 102.87 87.63 90))
    (property "Value" "500" (id 1) (at 102.87 90.17 90))
    (property "Footprint" "" (id 2) (at 102.87 93.345 0)
      (effects (font (size 1.27 1.27)) hide)
    )
    (property "Datasheet" "~" (id 3) (at 102.87 93.345 0)
      (effects (font (size 1.27 1.27)) hide)
    )
    (pin "1" (uuid 66122b9d-deeb-4262-9db2-69aceb9884fc))
    (pin "2" (uuid 8592e01c-4a4f-41d2-ac6a-665aec164db9))
  )

  (sheet_instances
    (path "/" (page "1"))
  )

  (symbol_instances
    (path "/c60b6478-6539-4421-85ad-7566fd84c1f0"
      (reference "#GND01") (unit 1) (value "0") (footprint "")
    )
    (path "/0affaae4-32a6-438b-af24-ce5b73b7348c"
      (reference "#GND02") (unit 1) (value "0") (footprint "")
    )
    (path "/93a9c6b2-215c-4847-b3e5-82a44b7586e7"
      (reference "#GND03") (unit 1) (value "0") (footprint "")
    )
    (path "/b5a89c21-ca4a-4dde-ae5e-891b488bff81"
      (reference "#GND04") (unit 1) (value "0") (footprint "")
    )
    (path "/b8747592-1c17-4ee5-acd5-bbd45338cc81"
      (reference "#GND05") (unit 1) (value "0") (footprint "")
    )
    (path "/a677c2da-099d-4dba-bc7a-f077c2db3c24"
      (reference "#GND06") (unit 1) (value "0") (footprint "")
    )
    (path "/49429740-0b7f-46f7-9a66-b3e007c4c760"
      (reference "#GND07") (unit 1) (value "0") (footprint "")
    )
    (path "/68832318-5241-4fce-b581-b0373149e0f0"
      (reference "#GND08") (unit 1) (value "0") (footprint "")
    )
    (path "/6daea703-dc7e-44c4-a837-8b936f9c0b80"
      (reference "#GND09") (unit 1) (value "0") (footprint "")
    )
    (path "/aac8bdf6-4305-4ee6-b852-1bb3b323e7ab"
      (reference "#GND010") (unit 1) (value "0") (footprint "")
    )
    (path "/af40fa6f-cc4e-4da9-b580-c8949b9d7bee"
      (reference "#GND011") (unit 1) (value "0") (footprint "")
    )
    (path "/cc2cab03-99f4-4a36-aff0-399af1820dcf"
      (reference "#GND012") (unit 1) (value "0") (footprint "")
    )
    (path "/1b0871ab-e2e5-43df-9f5c-31c916aeff04"
      (reference "#GND013") (unit 1) (value "0") (footprint "")
    )
    (path "/93c89fd6-128f-42db-89bb-361e82bc2aae"
      (reference "C1") (unit 1) (value "1n") (footprint "")
    )
    (path "/65662229-2912-449b-8d78-95c42c204b93"
      (reference "C2") (unit 1) (value "1n") (footprint "")
    )
    (path "/9f159477-ff3e-45b7-8509-550b7ce7f26e"
      (reference "C3") (unit 1) (value "1n") (footprint "")
    )
    (path "/ea8a6737-e5a4-4276-bd71-27f98f85ee56"
      (reference "C4") (unit 1) (value "1n") (footprint "")
    )
    (path "/4aafe0f6-8cf9-4338-8a9f-4662f012cb4e"
      (reference "R1") (unit 1) (value "1000") (footprint "")
    )
    (path "/a1966828-8590-4c79-a6f0-1550784116c2"
      (reference "R2") (unit 1) (value "1000") (footprint "")
    )
    (path "/46329349-3c56-4193-9db4-d71ea485cb91"
      (reference "R3") (unit 1) (value "500") (footprint "")
    )
    (path "/e457e621-a68e-4e02-adcf-5bff5441a9d7"
      (reference "R4") (unit 1) (value "1000") (footprint "")
    )
    (path "/f30a08f8-1777-41f6-9399-93012db3c2ab"
      (reference "R5") (unit 1) (value "500") (footprint "")
    )
    (path "/74b08a0e-1ba5-48fc-a43e-e139d3689b89"
      (reference "R6") (unit 1) (value "1000") (footprint "")
    )
    (path "/1430a34b-9f0e-4909-a4cb-98789333953f"
      (reference "R7") (unit 1) (value "1000") (footprint "")
    )
    (path "/a8460718-c38c-470d-93e0-ab2ad7616ba6"
      (reference "U1") (unit 1) (value "LM324DT") (footprint "digikey-footprints:SOIC-14_W3.9mm")
    )
    (path "/242dd165-1a81-4709-90c9-97d1ab48ca8d"
      (reference "U1") (unit 2) (value "LM324DT") (footprint "digikey-footprints:SOIC-14_W3.9mm")
    )
    (path "/790757e7-194b-4cfc-ab85-0ba9b1e7a17c"
      (reference "U1") (unit 3) (value "LM324DT") (footprint "digikey-footprints:SOIC-14_W3.9mm")
    )
    (path "/0d13162d-409b-4420-b4c5-e46af686576a"
      (reference "U1") (unit 4) (value "LM324DT") (footprint "digikey-footprints:SOIC-14_W3.9mm")
    )
    (path "/df4ae055-8edb-4b92-91b9-bbdcbc16dc96"
      (reference "U1") (unit 5) (value "LM324DT") (footprint "digikey-footprints:SOIC-14_W3.9mm")
    )
    (path "/1fd30794-997a-4d1e-9145-0140f7006e15"
      (reference "V1") (unit 1) (value "VPULSE") (footprint "")
    )
    (path "/c565c994-7cbf-45d7-8631-915effea4042"
      (reference "V2") (unit 1) (value "VPULSE") (footprint "")
    )
    (path "/88f31963-f574-479c-b082-3bf88193e8a0"
      (reference "V3") (unit 1) (value "VPULSE") (footprint "")
    )
    (path "/0653c94f-cf61-45b6-bea6-7f7b1f438b1d"
      (reference "V4") (unit 1) (value "VDC") (footprint "")
    )
  )
)
