^C:\git\ConwaysGamesofLIfe\C++\gpu\GameofLifeCuda\GameofLifeCuda\GameofLifeCuda.vcxproj
C:\git\ConwaysGamesofLIfe\C++\gpu\GameofLifeCuda\x64\Debug\GameofLifeCuda.lib
C:\git\ConwaysGamesofLIfe\C++\gpu\GameofLifeCuda\x64\Debug\GameofLifeCuda.exp
