{
  "project_info": {
    "project_number": "320030924402",
    "project_id": "calltest-f77c4",
    "storage_bucket": "calltest-f77c4.appspot.com"
  },
  "client": [
    {
      "client_info": {
        "mobilesdk_app_id": "1:320030924402:android:90f192bbcdaca2841daceb",
        "android_client_info": {
          "package_name": "com.teste.call"
        }
      },
      "oauth_client": [
        {
          "client_id": "320030924402-qrsffo1f3q164vbhcm0pdh5a333um8fu.apps.googleusercontent.com",
          "client_type": 3
        }
      ],
      "api_key": [
        {
          "current_key": "AIzaSyB_SdaqtiYYdxaUuY4KYX-DKD0z6URCNII"
        }
      ],
      "services": {
        "appinvite_service": {
          "other_platform_oauth_client": [
            {
              "client_id": "320030924402-qrsffo1f3q164vbhcm0pdh5a333um8fu.apps.googleusercontent.com",
              "client_type": 3
            }
          ]
        }
      }
    }
  ],
  "configuration_version": "1"
}