<?xml version="1.0" standalone="no"?>
<!DOCTYPE svg PUBLIC "-//W3C//DTD SVG 1.1//EN" "http://www.w3.org/Graphics/SVG/1.1/DTD/svg11.dtd" >
<svg xmlns="http://www.w3.org/2000/svg">
<metadata>Generated by IcoMoon</metadata>
<svg style="position: absolute; width: 0; height: 0; overflow: hidden;" version="1.1" xmlns="http://www.w3.org/2000/svg" xmlns:xlink="http://www.w3.org/1999/xlink">
<defs>
<font id="icomoon" horiz-adv-x="1024">
<font-face units-per-em="1024" ascent="960" descent="-64" />
<missing-glyph horiz-adv-x="1024" />
<glyph unicode="&#x20;" horiz-adv-x="512" d="" />
<glyph unicode="&#xe900;" glyph-name="logo" d="M343.381-33.963c-1.707 0-3.755 0-5.461 0-3.413 0-33.451 1.024-42.325 5.803-6.827 3.413-11.605 7.168-12.629 14.336-0.341 2.389 0.683 4.437 2.389 5.803s4.096 1.707 6.485 1.024c6.827-2.731 13.653-4.437 20.48-4.779 5.12-0.341 10.581-0.683 16.043-0.683 46.080 0 96.939 13.312 145.408 26.965 3.072 1.024 11.947 3.413 20.821 5.803 9.216 2.731 19.115 5.461 22.869 6.485 41.984 11.947 91.136 24.917 139.605 29.013 6.485 0.683 12.629 0.683 18.773 0.683 51.541 0 86.016-19.797 95.915-38.229 4.437-8.192 2.731-13.653 1.024-16.043-1.024-1.707-3.072-2.731-5.12-3.072-2.048 0-4.096 0.683-5.461 2.048-9.557 10.923-27.989 24.235-62.123 25.6-45.056 1.365-116.053-15.019-184.32-31.061-66.901-15.019-129.707-29.696-172.373-29.696zM283.989 707.072c-9.557 13.312-51.2 15.36-67.243-2.389-10.923-11.947-34.475-52.907-57.003-108.203-24.235-13.995-51.541-37.205-83.968-74.411-69.973-79.872-28.672-168.96 5.12-172.032 72.704-6.827 248.491 115.371 309.931 227.328 61.099 111.957 6.485 149.163-5.12 164.181-11.605 15.36-22.869 32.768-66.56 39.936-25.941 4.437-94.208 1.707-160.768-35.499-78.165-43.691-100.693-91.136-88.064-169.301 0.683-5.12 12.629-4.096 11.264 0.683-14.677 53.589 130.731 181.931 267.605 161.792 20.821-3.072 44.032-15.36 42.667-50.859-1.024-35.157-53.931-136.875-139.947-202.752-34.816-26.624-69.632-48.469-100.352-63.829 0 11.264 3.072 29.355 13.995 57.685 9.557 25.259 25.259 63.147 42.667 101.035 20.48 6.144 40.619 8.533 59.051 5.461 14.677-1.365 8.192-20.821 4.779-27.648 15.36-8.533 19.115 5.12 19.115 14.336 0.341 9.216-14.336 46.080-54.955 45.056-3.413 0-7.168-0.341-10.923-0.683 22.528 45.397 45.056 83.285 58.709 90.112zM135.509 414.549c-36.523-16.384-64.171-21.845-73.387-12.629-15.701 16.384-8.875 66.219 26.283 103.424 13.312 13.995 31.061 29.013 51.541 42.667 0.683 0.341 14.336 9.216 20.139 11.605-1.365-3.413-20.48-18.091-21.163-19.456-4.096-11.947-6.144-19.456-9.899-32.085-15.36-55.979-5.461-81.579 6.485-93.525zM935.936 627.2c-9.899 3.413-2.048-5.12 6.144-11.264s14.677-49.835-13.312-106.155c-28.331-56.32-60.757-100.011-91.136-98.987s-47.104 60.757-45.397 108.544c1.024 27.648 4.096 64.171 20.139 111.275 23.552 8.533 72.363 65.536 97.963 106.496 28.672 46.421 47.787 87.723 47.445 100.011-0.341 16.725-25.941 38.229-42.325 37.888-16.043-0.341-75.776-74.411-125.952-189.44-10.24-23.211-17.749-44.715-23.893-64.512v0c0 0 0 0 0 0-1.365-5.12-3.072-10.24-4.096-15.019-10.581-32.768-29.696-66.901-41.301-78.165-13.653-13.312-19.115-2.389-1.707 45.397 18.432 50.176 34.475 76.459 36.523 84.992-0.683 4.437-3.413 8.533-7.168 12.629 8.533 9.557 7.851 26.283-1.365 38.912-9.557 13.312-50.176 33.451-102.741-23.211-29.696-32.085-49.493-76.8-60.075-114.347-19.797-37.547-45.739-73.728-51.541-80.213-7.168-8.192-19.115-3.072 10.24 63.488s50.176 91.819 50.176 104.107c0 12.288-26.283 38.571-32.768 35.84-4.437-2.048-14.336-29.355-32.427-70.656 0 0 0 0-0.341 0.341-30.72-75.435-101.717-171.349-108.544-168.619s9.216 39.595 27.648 76.117c18.432 36.523 37.888 67.584 44.373 98.645-2.731 32.768-38.229 54.613-53.248 40.96-0.683-4.779 9.557-4.096 8.533-17.067s-16.043-52.224-38.571-99.328c-22.528-47.104-41.643-81.92-38.912-94.891 2.731-13.312 37.547-36.181 49.152-35.84 11.947 0.341 50.859 61.44 60.757 81.579 1.707 3.755 4.437 9.899 7.851 16.725 0.683 0.341 1.365-0.683 1.024-1.365-7.851-27.307-12.288-49.152-11.947-54.613 0.341-9.899 31.403-21.845 41.301-19.115 10.24 2.731 30.72 38.229 45.056 62.805 3.755 6.485 8.533 16.725 13.653 26.624 0 0.341 0.683 0.341 0.683 0-1.707-12.971-2.048-23.211-0.341-28.672 6.485-23.211 43.008-41.643 50.517-36.864 12.629 7.851 30.379 55.637 44.032 81.579 0.683 1.365 1.024 0 1.024-0.341-4.779-17.067-7.168-30.72-5.803-39.253 2.389-15.019 32.427-37.888 42.667-32.427 10.24 5.12 23.893 33.109 37.547 60.416 1.707 3.413 2.731 8.192 4.437 11.947 0 0.341 1.024 0.341 1.024-0.341-4.437-40.96 0.683-70.315 7.168-88.405 11.947-33.792 62.123-70.315 89.429-71.339s83.627 17.749 131.755 127.317c13.995 30.037 10.24 73.728-43.349 105.813zM936.96 832.341c3.072-3.413-1.707-24.235-53.931-103.765-29.696-45.056-50.859-69.973-64.171-80.555 11.605 29.355 29.355 65.536 52.565 103.083 49.152 82.603 62.464 84.651 65.536 81.237zM627.371 505.685c-5.461-3.413-18.091 31.403 15.019 100.352 41.984 87.040 70.997 99.328 80.555 96.939 5.803-1.365 7.851-10.581 5.803-19.115-3.755 1.024-6.485 1.024-7.851-0.341-2.048-2.389-6.827-12.629-12.971-26.965-30.379-66.56-64.512-140.971-80.555-150.869zM955.051 399.872c18.773 21.504 10.923 35.157 8.875 42.325s-8.192 6.827-7.509 1.024c0.683-5.803-7.851-17.067-25.941-37.547-18.432-20.48-49.835-26.965-58.709-24.576 13.312-14.677 64.512-2.731 83.285 18.773zM924.331 198.144c-1.365 0-2.048-1.707-0.683-2.389 16.725-8.533 24.576-37.205 20.821-63.147-4.096-28.331-23.893-101.035-86.699-100.693-32.768 4.779-46.421 39.936-47.445 79.189-2.389 88.405 63.488 164.523 63.147 175.787 0 4.096-4.779 11.264-6.827 15.701-7.851 16.043-25.941 23.893-25.941 23.893s-6.144-15.019-12.971-24.576c-10.923-16.384-21.845-11.947-26.624-9.899-8.875 4.096 7.851 48.811 12.288 61.099 5.12 15.019-5.803 36.181-45.397 33.109 1.024-9.216-0.341-23.211-11.947-46.763-16.725-33.792-3.413-38.912 4.437-43.349 4.096-2.389 9.557-5.12 15.36-8.192-21.845-57.003-47.445-79.189-67.584-88.064 0.341 0.683 0.341 1.024 0.341 1.365 8.875 19.115 13.653 37.888 19.797 59.733 17.408 61.781-34.133 119.125-80.896 65.536-1.365-1.707-2.731-3.413-4.096-5.461-6.827-3.072-12.629-7.851-16.384-13.312-7.168-11.264-19.797-36.523-29.696-67.243 0 0 0-0.341-0.341-0.341-5.803-15.36-36.864-92.501-59.392-118.101-11.605-12.971-17.408 1.024-16.043 26.965 0.683 16.384 6.144 44.373 16.725 76.8 49.835 15.019 128 176.811 122.197 192.512-6.144 17.067-26.965 33.792-45.056 29.696-24.235-5.803-86.699-122.539-104.789-174.763-7.168-20.821-18.773-50.517-26.624-81.579-10.581-20.48-21.163-32.085-30.72-36.181 8.533 19.115 13.653 37.888 19.797 59.733 17.408 61.781-34.133 119.125-80.896 65.536-1.365-1.707-2.731-3.413-4.096-5.461-6.827-3.072-12.629-7.851-16.384-13.312-7.509-11.605-20.48-37.888-30.379-69.973 0-0.341-0.341-0.683-0.341-1.024 0 0 0 0 0 0-2.048-6.485-3.755-12.971-5.461-19.456-26.624-73.728-126.635-173.056-184.32-176.469-18.091-1.024-42.325 25.941-45.739 56.32-5.461 52.224 22.528 126.635 76.459 203.093 53.248 75.776 118.784 135.168 137.899 124.928 17.067-9.216 17.749-48.469-1.365-88.064-20.48-42.325-93.184-121.856-123.904-115.712-1.365 0.341-2.389-1.024-2.048-2.389 3.072-14.336 16.725-21.504 36.523-20.139 30.379 2.048 73.387 28.331 113.323 119.125 36.864 83.627-21.845 147.456-50.859 143.701-93.184-11.947-245.419-208.896-237.909-345.771 4.437-78.165 68.608-116.053 100.693-109.909 44.032 8.533 98.987 50.859 131.072 96.256 16.043 22.528 29.696 42.667 42.667 74.069-0.341-4.779-0.683-9.216-0.683-13.995-1.365-59.051 39.936-67.925 52.565-63.488 8.875 3.072 37.547 29.696 62.805 79.531 9.216 2.048 23.211 14.336 35.157 29.696-2.731-18.091-3.072-35.84 0.341-51.883 3.072-13.995 20.139-33.109 33.109-29.355 44.715 13.312 67.243 96.256 72.704 110.592 0 0.341 0.683 0.341 0.683-0.341-1.365-9.216-2.389-19.797-2.731-29.013-1.365-59.051 39.936-67.925 52.565-63.488 8.192 2.731 35.157 28.672 59.392 74.752 15.701 4.096 35.157 15.019 51.2 31.744 14.336 15.019 31.403 52.565 41.643 77.483 8.533-2.731 17.749-4.437 27.307-3.072-4.437-12.971-9.557-7.168-28.672-69.291-7.168-23.552-7.168-47.445-6.827-69.291 0 0 0 0 0 0s0-0.341 0-0.341c0-4.096 0.341-7.509 0.341-11.605 0.341-13.995 5.461-33.451 12.288-51.2 11.264-29.355 35.499-59.392 73.045-58.368 33.792 1.024 83.285 27.648 106.496 74.411 36.523 71.339-20.48 102.059-46.421 104.107zM640 412.501c7.509 0.683-10.581-42.667-25.6-69.291-12.971-23.211-47.787-90.112-70.997-104.107 3.413 9.557 7.509 19.456 11.947 29.355 22.187 48.811 77.141 143.36 84.651 144.043zM379.904 88.235c-7.168 11.605-17.408 38.229-0.341 83.285 8.192-18.432 22.187-38.229 41.984-40.619-18.091-42.667-33.109-56.32-41.643-42.667zM438.613 177.664c-3.755-11.605-6.485-19.456-10.24-29.013-16.384 2.048-35.157 13.312-39.936 44.373 9.216 19.115 22.187 43.008 40.96 66.56-2.389 11.947-8.192 15.36-15.019 18.432 55.637 39.253 29.355-84.309 24.235-100.352zM684.032 305.664c-2.389 11.947-8.192 15.36-15.019 18.432 55.637 39.253 29.696-84.309 24.576-100.352-3.755-11.605-6.485-19.456-10.24-29.013-5.803 0.683-11.947 2.731-17.749 6.144-3.413 2.389-6.827 5.12-9.899 8.533-5.803 6.827-10.24 16.384-12.288 29.696 9.216 19.115 22.187 43.008 40.619 66.56zM634.539 134.656c-7.168 11.605-17.408 38.229-0.341 83.285 8.533-28.672 31.061-40.277 39.936-43.691-16.725-39.595-31.403-52.907-39.595-39.595zM279.552 849.067c-2.731 7.509 1.024 16.043 8.533 18.773s16.043-1.024 18.773-8.533c2.731-7.509-0.683-16.043-8.533-18.773-7.509-2.731-16.043 1.024-18.773 8.533zM348.16 900.267c12.629 3.413 20.48-1.365 20.48-1.365l-3.413-10.581c0 0-6.144 3.072-13.312 1.365-10.24-2.731-12.629-10.581-10.581-17.749 2.389-9.216 10.581-12.971 18.091-10.923 5.803 1.707 8.875 6.144 8.875 6.144l-1.024 3.755-6.827-2.048-2.731 10.24 17.408 4.779 7.509-27.648-9.899-2.731-0.341 1.365c-0.341 1.024-0.341 2.048-0.341 2.048v0c0 0-3.413-5.461-11.605-7.851-12.629-3.413-26.624 2.731-31.061 18.773-4.096 14.336 3.755 28.331 18.773 32.427zM398.336 911.189l17.408 2.731c5.12 0.683 7.509 1.024 9.899 0.341 6.144-1.365 10.581-5.803 11.605-12.971 1.024-5.461-0.683-11.605-5.461-15.019v0c0 0 0.683-0.683 2.389-2.731l12.629-16.043-13.653-2.048-11.605 15.36-5.803-1.024 2.731-17.067-12.288-2.048-7.851 50.517zM419.84 891.051c4.096 0.683 6.144 3.072 5.461 7.168-0.683 3.755-2.389 5.803-8.533 4.779l-4.096-0.683 2.048-12.288 5.12 1.024zM493.909 881.835l-15.701-1.024-2.389-10.923-12.629-0.683 14.336 51.883 12.971 0.683 20.139-49.493-12.629-0.683-4.096 10.24zM483.669 935.424l12.288 0.683-7.851-11.264-9.557-0.683 5.12 11.264zM484.352 909.824c0 0-0.683-5.461-1.365-8.875l-2.389-9.899 9.899 0.683-3.413 9.557c-1.024 3.072-2.731 8.533-2.731 8.533v0zM532.821 922.795l31.061-1.024-0.341-10.581-18.773 0.683-0.341-10.581 15.36-0.341-0.341-10.581-15.36 0.341-0.683-18.773-12.288 0.341 1.707 50.517zM590.507 919.381l12.288-1.365-5.461-50.517-12.288 1.365 5.461 50.517zM656.725 910.507c12.288-2.389 17.408-10.581 17.408-10.581l-7.509-8.192c0 0-4.437 6.144-11.605 7.509-9.557 1.707-15.36-4.437-16.725-11.605-1.365-7.509 2.048-16.043 11.264-17.749 7.509-1.365 14.336 3.755 14.336 3.755l4.437-10.24c0 0-8.533-7.168-21.845-4.437-15.701 3.072-23.893 16.043-21.163 30.72 3.072 14.677 16.384 23.893 31.403 20.821zM715.776 853.163l-15.019 4.437-6.144-9.216-12.288 3.755 31.061 43.691 12.629-3.755 2.048-53.589-12.288 3.755v10.923zM716.459 882.859c0 0-2.731-5.12-4.437-7.851l-5.803-8.533 9.557-2.731v10.24c0.341 3.413 0.683 8.875 0.683 8.875v0zM755.029 854.869c3.072 7.509 11.605 10.923 19.115 8.192 7.509-3.072 10.923-11.605 8.192-19.115-3.072-7.509-11.605-11.264-19.115-8.192-7.851 3.072-11.264 11.605-8.192 19.115z" />
<glyph unicode="&#xe901;" glyph-name="facebook" d="M521.899-33.28c-264.533 0-479.573 215.040-479.573 479.573s215.040 479.573 479.573 479.573c264.533 0 479.573-215.040 479.573-479.573-0.341-264.533-215.381-479.573-479.573-479.573zM521.899 887.637c-243.371 0-441.344-197.973-441.344-441.344s197.973-441.344 441.344-441.344c243.371 0 441.344 197.973 441.344 441.344s-197.973 441.344-441.344 441.344zM636.245 429.909h-74.752c0-119.808 0-266.923 0-266.923h-110.933c0 0 0 145.749 0 266.923h-52.907v94.208h52.907v61.099c0 43.691 20.821 111.957 111.957 111.957l82.261-0.341v-91.477c0 0-49.835 0-59.733 0-9.557 0-23.552-4.779-23.552-25.6v-55.637h84.651l-9.899-94.208z" />
<glyph unicode="&#xe902;" glyph-name="mail" d="M517.461-33.28c-264.533 0-479.573 215.040-479.573 479.573s215.040 479.573 479.573 479.573c264.533 0 479.573-215.040 479.573-479.573-0.341-264.533-215.381-479.573-479.573-479.573zM517.461 887.637c-243.371 0-441.344-197.973-441.344-441.344s197.973-441.344 441.344-441.344c243.371 0 441.344 197.973 441.344 441.344s-197.973 441.344-441.344 441.344zM295.595 274.603h443.051l-157.013 134.827-64.512-56.32-64.512 56.32zM295.595 617.643l221.525-189.781 221.525 189.781zM271.36 568.149v-246.784l143.36 121.856zM619.52 443.221l143.36-121.856v246.784z" />
<glyph unicode="&#xe903;" glyph-name="user" d="M516.779-33.28c-264.192 0-478.891 214.699-478.891 478.891s214.699 478.549 478.891 478.549c263.851 0 478.891-214.699 478.891-478.891s-215.040-478.549-478.891-478.549zM516.779 886.272c-243.029 0-440.661-197.632-440.661-440.661s197.632-440.661 440.661-440.661c243.029 0 440.661 197.632 440.661 440.661s-197.632 440.661-440.661 440.661zM516.779 767.829c83.968 0 152.235-67.925 152.235-152.235 0-83.968-67.925-152.235-152.235-152.235-83.968 0-152.235 67.925-152.235 152.235 0 83.968 68.267 152.235 152.235 152.235zM516.437 105.984c-83.968 0-160.427 30.72-219.819 80.896-14.336 12.288-22.869 30.379-22.869 49.152 0 85.333 68.949 153.259 153.941 153.259h177.152c85.333 0 153.941-67.925 153.941-153.259 0-18.773-8.192-36.864-22.528-49.152-59.051-50.517-135.851-80.896-219.819-80.896z" />
</font></defs></svg>
<symbol id="icon-envelop" viewBox="0 0 32 32">
<title>envelop</title>
<path d="M29 4h-26c-1.65 0-3 1.35-3 3v20c0 1.65 1.35 3 3 3h26c1.65 0 3-1.35 3-3v-20c0-1.65-1.35-3-3-3zM12.461 17.199l-8.461 6.59v-15.676l8.461 9.086zM5.512 8h20.976l-10.488 7.875-10.488-7.875zM12.79 17.553l3.21 3.447 3.21-3.447 6.58 8.447h-19.579l6.58-8.447zM19.539 17.199l8.461-9.086v15.676l-8.461-6.59z"></path>
</symbol>
<symbol id="icon-user" viewBox="0 0 32 32">
<title>user</title>
<path d="M18 22.082v-1.649c2.203-1.241 4-4.337 4-7.432 0-4.971 0-9-6-9s-6 4.029-6 9c0 3.096 1.797 6.191 4 7.432v1.649c-6.784 0.555-12 3.888-12 7.918h28c0-4.030-5.216-7.364-12-7.918z"></path>
</symbol>
<symbol id="icon-facebook" viewBox="0 0 32 32">
<title>facebook</title>
<path d="M19 6h5v-6h-5c-3.86 0-7 3.14-7 7v3h-4v6h4v16h6v-16h5l1-6h-6v-3c0-0.542 0.458-1 1-1z"></path>
</symbol>
<symbol id="icon-instagram" viewBox="0 0 32 32">
<title>instagram</title>
<path d="M16 2.881c4.275 0 4.781 0.019 6.462 0.094 1.563 0.069 2.406 0.331 2.969 0.55 0.744 0.288 1.281 0.638 1.837 1.194 0.563 0.563 0.906 1.094 1.2 1.838 0.219 0.563 0.481 1.412 0.55 2.969 0.075 1.688 0.094 2.194 0.094 6.463s-0.019 4.781-0.094 6.463c-0.069 1.563-0.331 2.406-0.55 2.969-0.288 0.744-0.637 1.281-1.194 1.837-0.563 0.563-1.094 0.906-1.837 1.2-0.563 0.219-1.413 0.481-2.969 0.55-1.688 0.075-2.194 0.094-6.463 0.094s-4.781-0.019-6.463-0.094c-1.563-0.069-2.406-0.331-2.969-0.55-0.744-0.288-1.281-0.637-1.838-1.194-0.563-0.563-0.906-1.094-1.2-1.837-0.219-0.563-0.481-1.413-0.55-2.969-0.075-1.688-0.094-2.194-0.094-6.463s0.019-4.781 0.094-6.463c0.069-1.563 0.331-2.406 0.55-2.969 0.288-0.744 0.638-1.281 1.194-1.838 0.563-0.563 1.094-0.906 1.838-1.2 0.563-0.219 1.412-0.481 2.969-0.55 1.681-0.075 2.188-0.094 6.463-0.094zM16 0c-4.344 0-4.887 0.019-6.594 0.094-1.7 0.075-2.869 0.35-3.881 0.744-1.056 0.412-1.95 0.956-2.837 1.85-0.894 0.888-1.438 1.781-1.85 2.831-0.394 1.019-0.669 2.181-0.744 3.881-0.075 1.713-0.094 2.256-0.094 6.6s0.019 4.887 0.094 6.594c0.075 1.7 0.35 2.869 0.744 3.881 0.413 1.056 0.956 1.95 1.85 2.837 0.887 0.887 1.781 1.438 2.831 1.844 1.019 0.394 2.181 0.669 3.881 0.744 1.706 0.075 2.25 0.094 6.594 0.094s4.888-0.019 6.594-0.094c1.7-0.075 2.869-0.35 3.881-0.744 1.050-0.406 1.944-0.956 2.831-1.844s1.438-1.781 1.844-2.831c0.394-1.019 0.669-2.181 0.744-3.881 0.075-1.706 0.094-2.25 0.094-6.594s-0.019-4.887-0.094-6.594c-0.075-1.7-0.35-2.869-0.744-3.881-0.394-1.063-0.938-1.956-1.831-2.844-0.887-0.887-1.781-1.438-2.831-1.844-1.019-0.394-2.181-0.669-3.881-0.744-1.712-0.081-2.256-0.1-6.6-0.1v0z"></path>
<path d="M16 7.781c-4.537 0-8.219 3.681-8.219 8.219s3.681 8.219 8.219 8.219 8.219-3.681 8.219-8.219c0-4.537-3.681-8.219-8.219-8.219zM16 21.331c-2.944 0-5.331-2.387-5.331-5.331s2.387-5.331 5.331-5.331c2.944 0 5.331 2.387 5.331 5.331s-2.387 5.331-5.331 5.331z"></path>
<path d="M26.462 7.456c0 1.060-0.859 1.919-1.919 1.919s-1.919-0.859-1.919-1.919c0-1.060 0.859-1.919 1.919-1.919s1.919 0.859 1.919 1.919z"></path>
</symbol>
</defs>
</svg>
