<?xml version="1.0" encoding="utf-8"?>
<!-- Generator: Adobe Illustrator 21.1.0, SVG Export Plug-In . SVG Version: 6.00 Build 0)  -->
<svg version="1.1" xmlns="http://www.w3.org/2000/svg" xmlns:xlink="http://www.w3.org/1999/xlink" x="0px" y="0px"
	 viewBox="0 0 14 9.6" style="enable-background:new 0 0 14 9.6;" xml:space="preserve">
<style type="text/css">
	.st0{fill:#2B2544;}
	.st1{fill:none;stroke:#D65915;stroke-miterlimit:10;}
	.st2{fill:#BFC0C5;}
	.st3{fill:#FFFFFF;}
	.st4{fill:#D65915;}
	.st5{fill:#3E3762;}
	.st6{fill:none;stroke:#FFFFFF;stroke-miterlimit:10;}
	.st7{fill:#BEBFC3;}
	.st8{fill:none;stroke:#BEBFC3;stroke-miterlimit:10;}
	.st9{fill-rule:evenodd;clip-rule:evenodd;fill:#D65915;}
	.st10{fill:none;stroke:#413966;stroke-miterlimit:10;}
	.st11{fill:#80BA84;}
	.st12{fill:#18AAC7;}
	.st13{fill:#7063D6;}
	.st14{opacity:0.7;fill:#413966;}
	.st15{fill:#C85821;}
	.st16{fill:#38FF00;}
	.st17{fill:none;stroke:#FFFFFF;stroke-width:2;stroke-linecap:round;stroke-linejoin:round;stroke-miterlimit:10;}
	.st18{fill:none;stroke:#FFFFFF;stroke-width:2;stroke-miterlimit:10;}
	.st19{opacity:0.5;}
	.st20{fill:none;stroke:#423966;stroke-miterlimit:10;}
	.st21{fill:#C0BFC5;}
	.st22{fill:none;stroke:#BFC0C5;stroke-linecap:round;stroke-linejoin:round;stroke-miterlimit:10;}
	.st23{display:none;opacity:0.1;enable-background:new    ;}
	.st24{display:inline;}
	.st25{fill:#FF0000;}
</style>
<g id="Fondo">
</g>
<g id="invitaciones">
	<polyline class="st22" points="13.5,0.5 4.9,9.1 0.5,4.7 	"/>
</g>
<g id="_x31_2_Col_Grid" class="st23">
	<g id="grilla_vertical" class="st24">
	</g>
</g>
</svg>
