<?xml version="1.0" encoding="utf-8"?>
<!-- Generator: Adobe Illustrator 21.0.2, SVG Export Plug-In . SVG Version: 6.00 Build 0)  -->
<svg version="1.1" id="Layer_1" xmlns="http://www.w3.org/2000/svg" xmlns:xlink="http://www.w3.org/1999/xlink" x="0px" y="0px"
	 viewBox="0 0 20.9 20.9" style="enable-background:new 0 0 20.9 20.9;" xml:space="preserve">
<style type="text/css">
	.st0{fill:#C55590;}
	.st1{fill:#198BC3;}
	.st2{fill:#D65915;}
	.st3{fill:#7CB080;}
	.st4{fill:#1F1713;}
	.st5{fill:#E9E33C;}
	.st6{fill:#AF1F16;}
	.st7{fill:#2C2544;}
	.st8{fill:#CACBCC;}
	.st9{fill-rule:evenodd;clip-rule:evenodd;fill:#D65915;}
	.st10{fill:#BDBEC1;}
	.st11{fill:#3C365F;}
</style>
<g>
	<g>
		<g>
			<path class="st11" d="M5.1,19.3c-0.1,0-0.3-0.1-0.4-0.2l-3-3c-0.1-0.1-0.2-0.2-0.2-0.4c0-0.1,0.1-0.3,0.2-0.4L16.4,0.8
				c0.2-0.2,0.6-0.2,0.8,0l3,3c0.1,0.1,0.2,0.2,0.2,0.4c0,0.1-0.1,0.3-0.2,0.4L5.4,19.1C5.3,19.2,5.2,19.3,5.1,19.3z M2.9,15.8
				L5.1,18L18.9,4.1l-2.2-2.2L2.9,15.8z"/>
		</g>
		<g>
			<path class="st11" d="M0.5,20.9c-0.1,0-0.1,0-0.2,0c-0.3-0.1-0.4-0.4-0.3-0.7l1.5-4.4c0.1-0.3,0.4-0.4,0.7-0.3
				c0.3,0.1,0.4,0.4,0.3,0.7l-1.5,4.4C1,20.7,0.8,20.9,0.5,20.9z"/>
		</g>
		<g>
			<path class="st11" d="M0.5,20.9c-0.2,0-0.4-0.1-0.5-0.4c-0.1-0.3,0.1-0.6,0.3-0.7l4.4-1.5c0.3-0.1,0.6,0.1,0.7,0.3
				c0.1,0.3-0.1,0.6-0.3,0.7l-4.4,1.5C0.7,20.8,0.6,20.9,0.5,20.9z"/>
		</g>
		<g>
			<path class="st11" d="M19.7,4.6c-0.1,0-0.3-0.1-0.4-0.2c-0.2-0.2-0.2-0.6,0-0.8c0.3-0.3,0.5-0.7,0.5-1.1c0-0.4-0.2-0.8-0.5-1.1
				c-0.6-0.6-1.6-0.6-2.2,0c-0.2,0.2-0.6,0.2-0.8,0c-0.2-0.2-0.2-0.6,0-0.8c1-1,2.7-1,3.7,0c0.5,0.5,0.8,1.2,0.8,1.9
				c0,0.7-0.3,1.4-0.8,1.9C20,4.6,19.8,4.6,19.7,4.6z"/>
		</g>
	</g>
</g>
</svg>
