<?xml version="1.0" encoding="utf-8"?>
<!-- Generator: Adobe Illustrator 21.0.2, SVG Export Plug-In . SVG Version: 6.00 Build 0)  -->
<svg version="1.1" id="Layer_1" xmlns="http://www.w3.org/2000/svg" xmlns:xlink="http://www.w3.org/1999/xlink" x="0px" y="0px"
	 viewBox="0 0 22.9 22.9" style="enable-background:new 0 0 22.9 22.9;" xml:space="preserve">
<style type="text/css">
	.st0{fill:#C55590;}
	.st1{fill:#198BC3;}
	.st2{fill:#D65915;}
	.st3{fill:#7CB080;}
	.st4{fill:#1F1713;}
	.st5{fill:#E9E33C;}
	.st6{fill:#AF1F16;}
	.st7{fill:#2C2544;}
	.st8{fill:#CACBCC;}
	.st9{fill-rule:evenodd;clip-rule:evenodd;fill:#D65915;}
	.st10{fill:#BDBEC1;}
	.st11{fill:#3C365F;}
	.st12{fill:#C85822;}
</style>
<g>
	<g>
		<rect class="st12" width="22.9" height="22.9"/>
	</g>
	<g>
		<g>
			<path class="st8" d="M8.2,18.5c-0.3,0-0.5-0.1-0.7-0.3c-0.4-0.4-0.4-1,0-1.4l12-12c0.4-0.4,1-0.4,1.4,0c0.4,0.4,0.4,1,0,1.4
				l-12,12C8.7,18.4,8.5,18.5,8.2,18.5z"/>
		</g>
		<g>
			<path class="st8" d="M8.1,18.5c-0.3,0-0.5-0.1-0.7-0.3L2,12.8c-0.4-0.4-0.4-1,0-1.4c0.4-0.4,1-0.4,1.4,0l5.4,5.4
				c0.4,0.4,0.4,1,0,1.4C8.7,18.4,8.4,18.5,8.1,18.5z"/>
		</g>
	</g>
</g>
</svg>
