<?xml version="1.0" encoding="utf-8"?>
<!-- Generator: Adobe Illustrator 21.0.2, SVG Export Plug-In . SVG Version: 6.00 Build 0)  -->
<svg version="1.1" id="Layer_1" xmlns="http://www.w3.org/2000/svg" xmlns:xlink="http://www.w3.org/1999/xlink" x="0px" y="0px"
	 viewBox="0 0 13.1 13.1" style="enable-background:new 0 0 13.1 13.1;" xml:space="preserve">
<style type="text/css">
	.st0{fill:#C55590;}
	.st1{fill:#198BC3;}
	.st2{fill:#D65915;}
	.st3{fill:#7CB080;}
	.st4{fill:#1F1713;}
	.st5{fill:#E9E33C;}
	.st6{fill:#AF1F16;}
	.st7{fill:#2C2544;}
	.st8{fill:#CACBCC;}
	.st9{fill-rule:evenodd;clip-rule:evenodd;fill:#D65915;}
	.st10{fill:#BDBEC1;}
	.st11{fill:#3C365F;}
</style>
<g>
	<circle class="st2" cx="6.5" cy="6.5" r="6.5"/>
</g>
</svg>
