<?xml version="1.0" encoding="utf-8"?>
<!-- Generator: Adobe Illustrator 21.0.2, SVG Export Plug-In . SVG Version: 6.00 Build 0)  -->
<svg version="1.1" id="Layer_1" xmlns="http://www.w3.org/2000/svg" xmlns:xlink="http://www.w3.org/1999/xlink" x="0px" y="0px"
	 viewBox="0 0 70.8 52.1" style="enable-background:new 0 0 70.8 52.1;" xml:space="preserve">
<style type="text/css">
	.st0{fill:#C55590;}
	.st1{fill:#198BC3;}
	.st2{fill:#D65915;}
	.st3{fill:#7CB080;}
	.st4{fill:#1F1713;}
	.st5{fill:#E9E33C;}
	.st6{fill:#AF1F16;}
	.st7{fill:#2C2544;}
	.st8{fill:#CACBCC;}
	.st9{fill-rule:evenodd;clip-rule:evenodd;fill:#D65915;}
	.st10{fill:#BDBEC1;}
	.st11{fill:#3C365F;}
</style>
<g>
	<g>
		<g>
			<path class="st8" d="M65.5,47.5h-4.6c-0.3,0-0.6-0.3-0.6-0.6c0-0.3,0.3-0.6,0.6-0.6h4v-8.1H10.5v8.1h4c0.3,0,0.6,0.3,0.6,0.6
				c0,0.3-0.3,0.6-0.6,0.6H9.9c-0.3,0-0.6-0.3-0.6-0.6v-9.3c0-0.3,0.3-0.6,0.6-0.6h55.6c0.3,0,0.6,0.3,0.6,0.6v9.3
				C66.1,47.2,65.8,47.5,65.5,47.5z"/>
		</g>
		<g>
			<path class="st8" d="M51.6,47.5H23.8c-0.3,0-0.6-0.3-0.6-0.6c0-0.3,0.3-0.6,0.6-0.6h27.8c0.3,0,0.6,0.3,0.6,0.6
				C52.2,47.2,51.9,47.5,51.6,47.5z"/>
		</g>
		<g>
			<path class="st8" d="M47,38.2c-0.3,0-0.6-0.3-0.6-0.6V1.2H1.2V37h8.7c0.3,0,0.6,0.3,0.6,0.6c0,0.3-0.3,0.6-0.6,0.6H0.6
				c-0.3,0-0.6-0.3-0.6-0.6v-37C0,0.3,0.3,0,0.6,0H47c0.3,0,0.6,0.3,0.6,0.6v37C47.6,37.9,47.3,38.2,47,38.2z"/>
		</g>
		<g>
			<path class="st8" d="M70.1,42.9h-4.6c-0.3,0-0.6-0.3-0.6-0.6c0-0.3,0.3-0.6,0.6-0.6h4V24l-8.9-8.9H47c-0.3,0-0.6-0.3-0.6-0.6
				c0-0.3,0.3-0.6,0.6-0.6h13.9c0.2,0,0.3,0.1,0.4,0.2l9.2,9.2c0.2,0.1,0.3,0.3,0.3,0.5v18.5C70.8,42.6,70.5,42.9,70.1,42.9z"/>
		</g>
		<g>
			<path class="st8" d="M70.1,29H56.2c-0.3,0-0.6-0.3-0.6-0.6v-9.3c0-0.3,0.3-0.6,0.6-0.6h9.3c0.3,0,0.6,0.3,0.6,0.6
				c0,0.3-0.3,0.6-0.6,0.6h-8.7v8.1h13.3c0.3,0,0.6,0.3,0.6,0.6C70.7,28.7,70.5,29,70.1,29z"/>
		</g>
		<g>
			<path class="st8" d="M60.9,38.2c-0.3,0-0.6-0.3-0.6-0.6v-9.2c0-0.3,0.3-0.6,0.6-0.6c0.3,0,0.6,0.3,0.6,0.6v9.2
				C61.5,37.9,61.2,38.2,60.9,38.2z"/>
		</g>
		<g>
			<path class="st8" d="M19.1,52.1c-2.9,0-5.2-2.3-5.2-5.2c0-2.9,2.3-5.2,5.2-5.2c2.9,0,5.2,2.3,5.2,5.2
				C24.4,49.8,22,52.1,19.1,52.1z M19.1,42.9c-2.2,0-4,1.8-4,4c0,2.2,1.8,4,4,4c2.2,0,4-1.8,4-4C23.2,44.7,21.4,42.9,19.1,42.9z"/>
		</g>
		<g>
			<path class="st8" d="M56.2,52.1c-2.9,0-5.2-2.3-5.2-5.2c0-2.9,2.3-5.2,5.2-5.2c2.9,0,5.2,2.3,5.2,5.2
				C61.5,49.8,59.1,52.1,56.2,52.1z M56.2,42.9c-2.2,0-4,1.8-4,4c0,2.2,1.8,4,4,4c2.2,0,4-1.8,4-4C60.3,44.7,58.5,42.9,56.2,42.9z"
				/>
		</g>
		<g>
			<g>
				<path class="st8" d="M13.8,25.5V12.9c0-0.1,0.1-0.2,0.2-0.3c0.1-0.1,0.2-0.1,0.4-0.1h3.3c1.2,0,2.1,0.3,2.8,0.9
					c0.7,0.6,1,1.6,1,3V22c0,1.4-0.3,2.4-1,3c-0.7,0.6-1.6,0.9-2.8,0.9h-3.3c-0.2,0-0.3,0-0.4-0.1C13.8,25.7,13.8,25.6,13.8,25.5z
					 M15,24.8h2.6c0.8,0,1.5-0.2,1.9-0.7c0.5-0.5,0.7-1.2,0.7-2.1v-5.6c0-0.9-0.2-1.6-0.7-2.1c-0.5-0.5-1.1-0.7-1.9-0.7H15V24.8z"/>
			</g>
			<g>
				<path class="st8" d="M25.8,22.1v-5.7c0-1.3,0.4-2.3,1.1-3c0.7-0.6,1.6-1,2.8-1c1.2,0,2.1,0.3,2.8,0.9c0.7,0.6,1,1.3,1,2.2
					c0,0.3,0,0.5-0.1,0.6c-0.1,0.1-0.2,0.1-0.5,0.1c-0.4,0-0.6-0.2-0.6-0.5c0-0.2,0-0.4-0.1-0.5c0-0.2-0.1-0.4-0.2-0.6
					c-0.1-0.2-0.3-0.4-0.4-0.6c-0.2-0.2-0.4-0.3-0.7-0.4c-0.3-0.1-0.7-0.2-1.1-0.2c-1.8,0-2.7,0.9-2.7,2.8v5.7
					c0,1.9,0.9,2.8,2.7,2.8c0.5,0,0.9-0.1,1.3-0.2c0.3-0.1,0.6-0.3,0.8-0.6c0.2-0.3,0.3-0.5,0.3-0.7c0.1-0.2,0.1-0.4,0.1-0.7
					c0-0.3,0.2-0.5,0.6-0.5c0.2,0,0.4,0.1,0.5,0.2c0.1,0.1,0.1,0.3,0.1,0.6c0,0.9-0.3,1.6-1,2.2c-0.7,0.6-1.6,0.9-2.8,0.9
					c-1.1,0-2-0.3-2.8-1C26.1,24.4,25.8,23.4,25.8,22.1z"/>
			</g>
		</g>
	</g>
</g>
</svg>
