<svg width="206" height="252" viewBox="0 0 206 252" fill="none" xmlns="http://www.w3.org/2000/svg">
<g id="BG" style="mix-blend-mode:soft-light" clip-path="url(#clip0_34_217)">
<path id="Vector" d="M119.763 118.776C111.573 117.485 107.184 111.909 109.368 94.6785L109.61 92.5995C111.447 77.6265 112.98 74.298 120.068 74.6865C122.147 74.823 124.541 76.1565 126.935 78.1515C129.15 80.745 134.075 84.1155 136.857 90.7935C138.852 95.6865 139.524 98.8785 139.808 102.323L140.249 106.544V106.523C140.532 108.192 141.399 109.706 142.695 110.795C143.991 111.884 145.632 112.477 147.325 112.468C149.018 112.46 150.653 111.849 151.938 110.747C153.223 109.644 154.074 108.121 154.34 106.449C154.424 105.987 156.188 60.6165 156.188 59.871C156.188 55.881 153.017 52.626 149.048 52.563C148.103 52.5671 147.169 52.7573 146.297 53.1225C145.426 53.4878 144.636 54.0211 143.971 54.6919C143.306 55.3627 142.78 56.1579 142.422 57.0321C142.064 57.9064 141.882 58.8425 141.887 59.787C141.887 59.8815 141.876 66.1395 141.74 72.45C136.112 66.234 128.898 60.6585 120.803 60.165C99.1935 59.01 96.831 79.1805 95.403 90.804L95.193 92.862C92.274 115.846 99.8235 130.337 117.558 133.15C136.857 136.227 149.72 140.71 149.835 152.764C149.909 157.447 147.483 162.246 143.252 165.932C140.762 168.101 137.828 169.701 134.657 170.62C131.485 171.539 128.151 171.756 124.887 171.255C122.961 170.925 121.068 170.43 119.228 169.775C116.707 168.347 110.334 164.42 107.111 159.883C104.381 156.062 103.436 150.045 103.142 146.234C103.184 144.522 103.194 143.398 103.194 143.262C103.231 141.355 102.514 139.51 101.199 138.128C99.8835 136.746 98.0764 135.938 96.1695 135.88C95.2194 135.871 94.2768 136.048 93.3953 136.403C92.5139 136.758 91.7109 137.282 91.0323 137.947C90.3537 138.612 89.8127 139.404 89.4402 140.279C89.0678 141.153 88.8711 142.091 88.8615 143.042C88.8615 143.178 88.683 157.395 88.1685 165.963C87.4335 179.749 88.1685 191.436 88.1685 191.94C88.4625 195.951 91.8435 198.975 95.802 198.702C96.7475 198.641 97.6714 198.393 98.52 197.971C99.3687 197.55 100.125 196.964 100.746 196.248C101.366 195.532 101.838 194.7 102.134 193.8C102.43 192.9 102.544 191.95 102.47 191.005C102.47 190.943 102.123 185.283 102.165 177.46C108.331 181.51 115.253 184.271 122.514 185.577C127.838 186.466 133.294 186.154 138.482 184.665C143.67 183.175 148.46 180.545 152.502 176.967C159.989 170.467 164.283 161.595 164.157 152.607C163.905 125.78 134.075 121.065 119.763 118.776ZM148.827 0C138.796 0.00820435 128.94 2.62428 120.225 7.5915H119.049C91.3605 7.5915 67.2105 22.2075 54.474 46.7355C46.83 61.362 45.024 75.6105 43.9845 84.315C43.8585 85.2495 43.7955 86.1 43.6905 87.066C42.4305 97.293 42.399 107.058 43.5855 116.172C39.421 124.414 37.1774 133.493 37.023 142.727V142.895C36.9365 149.722 36.737 156.548 36.4245 163.37C35.8872 173.652 35.8592 183.954 36.3405 194.24L36.477 196.434C38.829 227.598 64.6695 252 95.3715 252C108.587 252.037 121.417 247.554 131.733 239.295C151.885 238.5 171.148 230.787 186.281 217.455C205.454 200.791 216.3 177.083 215.996 152.46C215.859 138.159 212.363 124.761 205.727 112.949C206.955 99.582 208.047 60.4905 208.047 60.1335C208.047 27.552 181.965 0.5985 149.888 0L148.827 0ZM149.415 28.0875C166.656 28.4025 180.684 42.9135 180.684 60.438C180.684 60.837 179.162 107.657 178.427 111.71C177.995 114.198 177.28 116.629 176.295 118.955C184.233 128.299 188.528 139.954 188.633 153.143C188.853 169.47 181.482 185.441 168.41 196.823C157.393 206.555 143.21 211.945 128.51 211.984C125.989 211.968 123.471 211.8 120.971 211.481C120.399 212.257 119.797 213.01 119.165 213.738C116.227 217.167 112.581 219.918 108.476 221.8C104.372 223.682 99.9077 224.65 95.3925 224.637C78.876 224.637 64.974 211.46 63.756 194.649L63.672 193.368C63.2361 184.056 63.2536 174.728 63.7245 165.417C64.134 158.287 64.3545 146.191 64.3755 143.577C64.4858 135.735 67.4026 128.191 72.597 122.314C70.1085 113.547 69.321 103.036 70.8435 90.6045L71.0955 88.3785C71.967 81.081 73.2795 70.3185 78.6555 60.0285C86.688 44.562 101.42 35.6895 119.06 35.6895C121.96 35.6724 124.856 35.9184 127.712 36.4245C133.445 31.1745 141.047 27.9195 149.415 28.0875Z" fill="white"/>
</g>
<defs>
<clipPath id="clip0_34_217">
<rect width="252" height="252" fill="white"/>
</clipPath>
</defs>
</svg>
