<svg width="49" height="54" viewBox="0 0 49 54" fill="none" xmlns="http://www.w3.org/2000/svg">
<path fill-rule="evenodd" clip-rule="evenodd" d="M24.1578 1.00391L28.6891 4.21697L33.7179 4.57205L36.54 8.74832L41.5874 11.0672L41.0713 16.5991L43.278 21.1305L41.0713 25.6618L41.5874 31.1938L36.54 33.5126L33.7179 37.6889L28.6891 38.044L24.1578 41.2571L19.6264 38.044L14.5977 37.6889L11.7756 33.5126L6.72818 31.1938L7.24428 25.6618L5.03754 21.1305L7.24428 16.5991L6.72818 11.0672L11.7756 8.74832L14.5977 4.57205L19.6264 4.21697L24.1578 1.00391Z" fill="white"/>
<path fill-rule="evenodd" clip-rule="evenodd" d="M9.14807 34.0039L1.82931 46.6804L8.41267 46.2558L11.3367 52.1694L18.6554 39.493" fill="white"/>
<path fill-rule="evenodd" clip-rule="evenodd" d="M39.1548 34.0039L46.4736 46.6804L39.8902 46.2558L36.9663 52.1694L29.6475 39.493" fill="white"/>
<path fill-rule="evenodd" clip-rule="evenodd" d="M7.38875 33.3932L0.245648 45.7656C-0.0928451 46.3492 -0.0800394 47.072 0.27492 47.6465C0.63171 48.2192 1.27393 48.5504 1.94726 48.5065L7.31374 48.1606L9.69782 52.98C9.99606 53.5857 10.6035 53.9772 11.2787 53.9992C11.952 54.0193 12.5851 53.668 12.9217 53.0843L20.1124 40.6315L20.9833 41.2499C22.8844 42.5984 25.4313 42.5984 27.3324 41.2499L28.1942 40.6369L35.3812 53.0843C35.7178 53.668 36.3509 54.0193 37.0242 53.9992C37.6994 53.9772 38.3069 53.5857 38.6051 52.98L40.9892 48.1606L46.3557 48.5065C47.029 48.5504 47.6712 48.2192 48.028 47.6465C48.3829 47.072 48.3958 46.3492 48.0573 45.7656L40.9178 33.4005C42.4731 32.2789 43.3513 30.3998 43.1683 28.4402C43.1043 27.7578 43.0403 27.0588 42.989 26.5136C42.9579 26.1787 43.0183 25.8439 43.1647 25.542L44.1436 23.533C44.8809 22.0162 44.8809 20.2451 44.1436 18.7282L43.1647 16.7193C43.0183 16.4174 42.9579 16.0825 42.989 15.7477C43.0403 15.2024 43.1043 14.5035 43.1683 13.821C43.3861 11.4992 42.1126 9.29437 39.9938 8.3228C39.3699 8.03554 38.7332 7.74279 38.2337 7.51408C37.9299 7.37502 37.6701 7.15363 37.4817 6.87552L36.232 5.02389C35.2879 3.626 33.7527 2.74043 32.0694 2.6215L29.8409 2.46415C29.506 2.44036 29.1858 2.32508 28.9114 2.13113C28.4649 1.81459 27.8923 1.4084 27.3324 1.01136C25.4313 -0.33712 22.8844 -0.33712 20.9833 1.01136C20.4235 1.4084 19.8508 1.81459 19.4043 2.13113C19.1299 2.32508 18.8097 2.44036 18.4748 2.46415L16.2463 2.6215C14.563 2.74043 13.0279 3.626 12.0837 5.02389L10.8341 6.87552C10.6456 7.15363 10.3858 7.37502 10.0821 7.51408C9.58255 7.74279 8.94582 8.03554 8.3219 8.3228C6.20312 9.29437 4.92965 11.4992 5.14739 13.821C5.21143 14.5035 5.27546 15.2024 5.3267 15.7477C5.3578 16.0825 5.29742 16.4174 5.15104 16.7193L4.17217 18.7282C3.4348 20.2451 3.4348 22.0162 4.17217 23.533L5.15104 25.542C5.29742 25.8439 5.3578 26.1787 5.3267 26.5136C5.27546 27.0588 5.21143 27.7578 5.14739 28.4402C4.96442 30.3962 5.84084 32.2698 7.38875 33.3932ZM10.6163 35.1204L5.1236 44.6348L8.29628 44.4299C9.03182 44.3823 9.72527 44.783 10.0528 45.4454L11.4616 48.2942L16.4494 39.6544L16.2463 39.6398C14.563 39.5208 13.0279 38.6353 12.0837 37.2374L10.8341 35.3857C10.77 35.2906 10.6968 35.2028 10.6163 35.1204ZM37.6921 35.1296C37.6134 35.2083 37.5439 35.2943 37.4817 35.3857L36.232 37.2374C35.2879 38.6353 33.7527 39.5208 32.0694 39.6398L31.8535 39.6544L36.8413 48.2942L38.2501 45.4454C38.5776 44.783 39.2711 44.3823 40.0066 44.4299L43.1793 44.6348L37.6921 35.1296ZM21.5213 5.11719L23.1003 3.99742C23.7334 3.54732 24.5824 3.54732 25.2154 3.99742L26.7944 5.11719C27.616 5.69903 28.5802 6.04301 29.5829 6.11437L31.8114 6.27172C32.3732 6.31197 32.8837 6.60656 33.1984 7.07313L34.4499 8.92295C35.0116 9.75729 35.7929 10.4196 36.7077 10.8405L38.466 11.6474C39.1723 11.9712 39.5968 12.7067 39.5254 13.4807L39.3443 15.4074C39.251 16.41 39.4339 17.4164 39.8749 18.3221L40.8538 20.3292C41.099 20.836 41.099 21.4252 40.8538 21.932L39.8749 23.9392C39.4339 24.8449 39.251 25.8512 39.3443 26.8539L39.5254 28.7806C39.5968 29.5545 39.1723 30.2901 38.466 30.6139L36.7077 31.4208C35.7929 31.8416 35.0116 32.504 34.4499 33.3383L33.1984 35.1881C32.8837 35.6547 32.3732 35.9493 31.8114 35.9895L29.5829 36.1469C28.5802 36.2183 27.616 36.5622 26.7944 37.1441L25.2154 38.2638C24.5824 38.7139 23.7334 38.7139 23.1003 38.2638L21.5213 37.1441C20.6997 36.5622 19.7355 36.2183 18.7328 36.1469L16.5043 35.9895C15.9426 35.9493 15.4321 35.6547 15.1174 35.1881L13.8659 33.3383C13.3041 32.504 12.5229 31.8416 11.608 31.4208L9.84969 30.6139C9.14343 30.2901 8.71894 29.5545 8.79029 28.7806L8.97143 26.8539C9.06475 25.8512 8.88179 24.8449 8.44083 23.9392L7.46194 21.932C7.21676 21.4252 7.21676 20.836 7.46194 20.3292L8.44083 18.3221C8.88179 17.4164 9.06475 16.41 8.97143 15.4074L8.79029 13.4807C8.71894 12.7067 9.14343 11.9712 9.84969 11.6474L11.608 10.8405C12.5229 10.4196 13.3041 9.75729 13.8659 8.92295L15.1174 7.07313C15.4321 6.60656 15.9426 6.31197 16.5043 6.27172L18.7328 6.11437C19.7355 6.04301 20.6997 5.69903 21.5213 5.11719ZM24.1579 10.1525C18.0998 10.1525 13.1797 15.0725 13.1797 21.1306C13.1797 27.1887 18.0998 32.1088 24.1579 32.1088C30.216 32.1088 35.136 27.1887 35.136 21.1306C35.136 15.0725 30.216 10.1525 24.1579 10.1525ZM24.1579 13.8119C28.1978 13.8119 31.4766 17.0907 31.4766 21.1306C31.4766 25.1706 28.1978 28.4494 24.1579 28.4494C20.1179 28.4494 16.8391 25.1706 16.8391 21.1306C16.8391 17.0907 20.1179 13.8119 24.1579 13.8119Z" fill="#3891A3"/>
</svg>
