<svg width="187" height="216" viewBox="0 0 187 216" fill="none" xmlns="http://www.w3.org/2000/svg">
<g id="html-tag_svgrepo.com" clip-path="url(#clip0_90_5)">
<g id="Group">
<path id="Vector" d="M108.002 0C48.3515 0 0 48.3515 0 107.998C0 167.649 48.3515 216 108.002 216C167.649 216 216 167.649 216 107.998C216 48.3515 167.649 0 108.002 0ZM78.9185 85.6879C78.9185 85.8423 78.8522 85.9785 78.7345 86.0743L48.3372 108.679L78.7345 131.295C78.8522 131.376 78.9185 131.523 78.9185 131.671V145.622C78.9185 145.795 78.8337 145.949 78.694 146.03C78.6316 146.064 78.5692 146.085 78.4953 146.085C78.4143 146.085 78.33 146.056 78.2599 146.001L34.4815 113.44C34.3676 113.355 34.2938 113.211 34.2938 113.061V104.301C34.2938 104.146 34.3672 104.003 34.4815 103.918L78.2599 71.3576C78.33 71.3024 78.4143 71.2766 78.4953 71.2766C78.5687 71.2766 78.6316 71.2952 78.694 71.3315C78.8341 71.4087 78.9185 71.5635 78.9185 71.7398V85.6879ZM100.625 152.045C100.563 152.233 100.408 152.358 100.224 152.358H87.9871C87.8475 152.358 87.7222 152.284 87.6412 152.159C87.564 152.042 87.5416 151.887 87.5859 151.747L115.375 63.9474C115.43 63.763 115.592 63.642 115.772 63.642H128.012C128.145 63.642 128.277 63.712 128.355 63.8335C128.432 63.955 128.454 64.1094 128.41 64.2528L100.625 152.045ZM181.699 113.061C181.699 113.211 181.633 113.355 181.515 113.44L137.737 146C137.667 146.055 137.586 146.085 137.501 146.085C137.431 146.085 137.365 146.063 137.303 146.03C137.163 145.949 137.078 145.795 137.078 145.622V131.674C137.078 131.523 137.144 131.376 137.262 131.295L167.659 108.679L137.262 86.0739C137.145 85.9857 137.078 85.8461 137.078 85.6917V71.7398C137.078 71.5635 137.163 71.4087 137.303 71.3315C137.365 71.2952 137.431 71.2766 137.501 71.2766C137.586 71.2766 137.667 71.3024 137.737 71.3576L181.515 103.918C181.633 104.003 181.699 104.146 181.699 104.301V113.061Z" fill="#D8D8D8"/>
</g>
</g>
<defs>
<clipPath id="clip0_90_5">
<rect width="216" height="216" fill="white"/>
</clipPath>
</defs>
</svg>
